You are viewing a plain text version of this content. The canonical link for it is here.
Posted to dev@kafka.apache.org by Apache Jenkins Server <je...@builds.apache.org> on 2023/09/26 10:33:55 UTC
Build failed in Jenkins: Kafka » Kafka Branch Builder » 3.4 #166
See <https://ci-builds.apache.org/job/Kafka/job/kafka/job/3.4/166/display/redirect>
Changes:
------------------------------------------
[...truncated 364018 lines...]
Gradle Test Run :core:integrationTest > Gradle Test Executor 172 > KafkaZkClientTest > testGetDataAndStat() PASSED
Gradle Test Run :core:integrationTest > Gradle Test Executor 172 > KafkaZkClientTest > testReassignPartitionsInProgress() STARTED
Gradle Test Run :core:integrationTest > Gradle Test Executor 172 > KafkaZkClientTest > testReassignPartitionsInProgress() PASSED
Gradle Test Run :core:integrationTest > Gradle Test Executor 172 > KafkaZkClientTest > testChrootExistsAndRootIsLocked() STARTED
Gradle Test Run :core:integrationTest > Gradle Test Executor 172 > KafkaZkClientTest > testChrootExistsAndRootIsLocked() PASSED
Gradle Test Run :core:integrationTest > Gradle Test Executor 172 > KafkaZkClientTest > testCreateTopLevelPaths() STARTED
Gradle Test Run :core:integrationTest > Gradle Test Executor 172 > KafkaZkClientTest > testCreateTopLevelPaths() PASSED
Gradle Test Run :core:integrationTest > Gradle Test Executor 172 > KafkaZkClientTest > testGetAllTopicsInClusterDoesNotTriggerWatch() STARTED
Gradle Test Run :core:integrationTest > Gradle Test Executor 172 > KafkaZkClientTest > testGetAllTopicsInClusterDoesNotTriggerWatch() PASSED
Gradle Test Run :core:integrationTest > Gradle Test Executor 172 > KafkaZkClientTest > testIsrChangeNotificationGetters() STARTED
Gradle Test Run :core:integrationTest > Gradle Test Executor 172 > KafkaZkClientTest > testIsrChangeNotificationGetters() PASSED
Gradle Test Run :core:integrationTest > Gradle Test Executor 172 > KafkaZkClientTest > testLogDirEventNotificationsDeletion() STARTED
Gradle Test Run :core:integrationTest > Gradle Test Executor 172 > KafkaZkClientTest > testLogDirEventNotificationsDeletion() PASSED
Gradle Test Run :core:integrationTest > Gradle Test Executor 172 > KafkaZkClientTest > testGetLogConfigs() STARTED
Gradle Test Run :core:integrationTest > Gradle Test Executor 172 > KafkaZkClientTest > testGetLogConfigs() PASSED
Gradle Test Run :core:integrationTest > Gradle Test Executor 172 > KafkaZkClientTest > testBrokerSequenceIdMethods() STARTED
Gradle Test Run :core:integrationTest > Gradle Test Executor 172 > KafkaZkClientTest > testBrokerSequenceIdMethods() PASSED
Gradle Test Run :core:integrationTest > Gradle Test Executor 172 > KafkaZkClientTest > testAclMethods() STARTED
Gradle Test Run :core:integrationTest > Gradle Test Executor 172 > KafkaZkClientTest > testAclMethods() PASSED
Gradle Test Run :core:integrationTest > Gradle Test Executor 172 > KafkaZkClientTest > testCreateSequentialPersistentPath() STARTED
Gradle Test Run :core:integrationTest > Gradle Test Executor 172 > KafkaZkClientTest > testCreateSequentialPersistentPath() PASSED
Gradle Test Run :core:integrationTest > Gradle Test Executor 172 > KafkaZkClientTest > testConditionalUpdatePath() STARTED
Gradle Test Run :core:integrationTest > Gradle Test Executor 172 > KafkaZkClientTest > testConditionalUpdatePath() PASSED
Gradle Test Run :core:integrationTest > Gradle Test Executor 172 > KafkaZkClientTest > testGetAllTopicsInClusterTriggersWatch() STARTED
Gradle Test Run :core:integrationTest > Gradle Test Executor 172 > KafkaZkClientTest > testGetAllTopicsInClusterTriggersWatch() PASSED
Gradle Test Run :core:integrationTest > Gradle Test Executor 172 > KafkaZkClientTest > testDeleteTopicZNode() STARTED
Gradle Test Run :core:integrationTest > Gradle Test Executor 172 > KafkaZkClientTest > testDeleteTopicZNode() PASSED
Gradle Test Run :core:integrationTest > Gradle Test Executor 172 > KafkaZkClientTest > testDeletePath() STARTED
Gradle Test Run :core:integrationTest > Gradle Test Executor 172 > KafkaZkClientTest > testDeletePath() PASSED
Gradle Test Run :core:integrationTest > Gradle Test Executor 172 > KafkaZkClientTest > testGetBrokerMethods() STARTED
Gradle Test Run :core:integrationTest > Gradle Test Executor 172 > KafkaZkClientTest > testGetBrokerMethods() PASSED
Gradle Test Run :core:integrationTest > Gradle Test Executor 172 > KafkaZkClientTest > testJuteMaxBufffer() STARTED
Gradle Test Run :core:integrationTest > Gradle Test Executor 172 > KafkaZkClientTest > testJuteMaxBufffer() PASSED
Gradle Test Run :core:integrationTest > Gradle Test Executor 172 > KafkaZkClientTest > testCreateTokenChangeNotification() STARTED
Gradle Test Run :core:integrationTest > Gradle Test Executor 172 > KafkaZkClientTest > testCreateTokenChangeNotification() PASSED
Gradle Test Run :core:integrationTest > Gradle Test Executor 172 > KafkaZkClientTest > testGetTopicsAndPartitions() STARTED
Gradle Test Run :core:integrationTest > Gradle Test Executor 172 > KafkaZkClientTest > testGetTopicsAndPartitions() PASSED
Gradle Test Run :core:integrationTest > Gradle Test Executor 172 > KafkaZkClientTest > testChroot(boolean) > kafka.zk.KafkaZkClientTest.testChroot(boolean)[1] STARTED
Gradle Test Run :core:integrationTest > Gradle Test Executor 172 > KafkaZkClientTest > testChroot(boolean) > kafka.zk.KafkaZkClientTest.testChroot(boolean)[1] PASSED
Gradle Test Run :core:integrationTest > Gradle Test Executor 172 > KafkaZkClientTest > testChroot(boolean) > kafka.zk.KafkaZkClientTest.testChroot(boolean)[2] STARTED
Gradle Test Run :core:integrationTest > Gradle Test Executor 172 > KafkaZkClientTest > testChroot(boolean) > kafka.zk.KafkaZkClientTest.testChroot(boolean)[2] PASSED
Gradle Test Run :core:integrationTest > Gradle Test Executor 172 > KafkaZkClientTest > testRegisterBrokerInfo() STARTED
Gradle Test Run :core:integrationTest > Gradle Test Executor 172 > KafkaZkClientTest > testRegisterBrokerInfo() PASSED
Gradle Test Run :core:integrationTest > Gradle Test Executor 172 > KafkaZkClientTest > testRetryRegisterBrokerInfo() STARTED
Gradle Test Run :core:integrationTest > Gradle Test Executor 172 > KafkaZkClientTest > testRetryRegisterBrokerInfo() PASSED
Gradle Test Run :core:integrationTest > Gradle Test Executor 172 > KafkaZkClientTest > testConsumerOffsetPath() STARTED
Gradle Test Run :core:integrationTest > Gradle Test Executor 172 > KafkaZkClientTest > testConsumerOffsetPath() PASSED
Gradle Test Run :core:integrationTest > Gradle Test Executor 172 > KafkaZkClientTest > testDeleteRecursiveWithControllerEpochVersionCheck() STARTED
Gradle Test Run :core:integrationTest > Gradle Test Executor 172 > KafkaZkClientTest > testDeleteRecursiveWithControllerEpochVersionCheck() PASSED
Gradle Test Run :core:integrationTest > Gradle Test Executor 172 > KafkaZkClientTest > testTopicAssignments() STARTED
Gradle Test Run :core:integrationTest > Gradle Test Executor 172 > KafkaZkClientTest > testTopicAssignments() PASSED
Gradle Test Run :core:integrationTest > Gradle Test Executor 172 > KafkaZkClientTest > testControllerManagementMethods() STARTED
Gradle Test Run :core:integrationTest > Gradle Test Executor 172 > KafkaZkClientTest > testControllerManagementMethods() PASSED
Gradle Test Run :core:integrationTest > Gradle Test Executor 172 > KafkaZkClientTest > testTopicAssignmentMethods() STARTED
Gradle Test Run :core:integrationTest > Gradle Test Executor 172 > KafkaZkClientTest > testTopicAssignmentMethods() PASSED
Gradle Test Run :core:integrationTest > Gradle Test Executor 172 > KafkaZkClientTest > testConnectionViaNettyClient() STARTED
Gradle Test Run :core:integrationTest > Gradle Test Executor 172 > KafkaZkClientTest > testConnectionViaNettyClient() PASSED
Gradle Test Run :core:integrationTest > Gradle Test Executor 172 > KafkaZkClientTest > testPropagateIsrChanges() STARTED
Gradle Test Run :core:integrationTest > Gradle Test Executor 172 > KafkaZkClientTest > testPropagateIsrChanges() PASSED
Gradle Test Run :core:integrationTest > Gradle Test Executor 172 > KafkaZkClientTest > testControllerEpochMethods() STARTED
Gradle Test Run :core:integrationTest > Gradle Test Executor 172 > KafkaZkClientTest > testControllerEpochMethods() PASSED
Gradle Test Run :core:integrationTest > Gradle Test Executor 172 > KafkaZkClientTest > testDeleteRecursive() STARTED
Gradle Test Run :core:integrationTest > Gradle Test Executor 172 > KafkaZkClientTest > testDeleteRecursive() PASSED
Gradle Test Run :core:integrationTest > Gradle Test Executor 172 > KafkaZkClientTest > testGetTopicPartitionStates() STARTED
Gradle Test Run :core:integrationTest > Gradle Test Executor 172 > KafkaZkClientTest > testGetTopicPartitionStates() PASSED
Gradle Test Run :core:integrationTest > Gradle Test Executor 172 > KafkaZkClientTest > testCreateConfigChangeNotification() STARTED
Gradle Test Run :core:integrationTest > Gradle Test Executor 172 > KafkaZkClientTest > testCreateConfigChangeNotification() PASSED
Gradle Test Run :core:integrationTest > Gradle Test Executor 172 > KafkaZkClientTest > testDelegationTokenMethods() STARTED
Gradle Test Run :core:integrationTest > Gradle Test Executor 172 > KafkaZkClientTest > testDelegationTokenMethods() PASSED
Gradle Test Run :core:integrationTest > Gradle Test Executor 172 > ZkMigrationClientTest > testUpdateExistingPartitions() STARTED
Gradle Test Run :core:integrationTest > Gradle Test Executor 172 > ZkMigrationClientTest > testUpdateExistingPartitions() PASSED
Gradle Test Run :core:integrationTest > Gradle Test Executor 172 > ZkMigrationClientTest > testEmptyWrite() STARTED
Gradle Test Run :core:integrationTest > Gradle Test Executor 172 > ZkMigrationClientTest > testEmptyWrite() PASSED
Gradle Test Run :core:integrationTest > Gradle Test Executor 172 > ZkMigrationClientTest > testExistingKRaftControllerClaim() STARTED
Gradle Test Run :core:integrationTest > Gradle Test Executor 172 > ZkMigrationClientTest > testExistingKRaftControllerClaim() PASSED
Gradle Test Run :core:integrationTest > Gradle Test Executor 172 > ZkMigrationClientTest > testReadAndWriteProducerId() STARTED
Gradle Test Run :core:integrationTest > Gradle Test Executor 172 > ZkMigrationClientTest > testReadAndWriteProducerId() PASSED
Gradle Test Run :core:integrationTest > Gradle Test Executor 172 > ZkMigrationClientTest > testMigrateTopicConfigs() STARTED
Gradle Test Run :core:integrationTest > Gradle Test Executor 172 > ZkMigrationClientTest > testMigrateTopicConfigs() PASSED
Gradle Test Run :core:integrationTest > Gradle Test Executor 172 > ZkMigrationClientTest > testNonIncreasingKRaftEpoch() STARTED
Gradle Test Run :core:integrationTest > Gradle Test Executor 172 > ZkMigrationClientTest > testNonIncreasingKRaftEpoch() PASSED
Gradle Test Run :core:integrationTest > Gradle Test Executor 172 > ZkMigrationClientTest > testMigrateEmptyZk() STARTED
Gradle Test Run :core:integrationTest > Gradle Test Executor 172 > ZkMigrationClientTest > testMigrateEmptyZk() PASSED
Gradle Test Run :core:integrationTest > Gradle Test Executor 172 > ZkMigrationClientTest > testWriteNewTopicConfigs() STARTED
Gradle Test Run :core:integrationTest > Gradle Test Executor 172 > ZkMigrationClientTest > testWriteNewTopicConfigs() PASSED
Gradle Test Run :core:integrationTest > Gradle Test Executor 172 > ZkMigrationClientTest > testClaimAndReleaseExistingController() STARTED
Gradle Test Run :core:integrationTest > Gradle Test Executor 172 > ZkMigrationClientTest > testClaimAndReleaseExistingController() PASSED
Gradle Test Run :core:integrationTest > Gradle Test Executor 172 > ZkMigrationClientTest > testWriteNewClientQuotas() STARTED
Gradle Test Run :core:integrationTest > Gradle Test Executor 172 > ZkMigrationClientTest > testWriteNewClientQuotas() PASSED
Gradle Test Run :core:integrationTest > Gradle Test Executor 172 > ZkMigrationClientTest > testClaimAbsentController() STARTED
Gradle Test Run :core:integrationTest > Gradle Test Executor 172 > ZkMigrationClientTest > testClaimAbsentController() PASSED
Gradle Test Run :core:integrationTest > Gradle Test Executor 172 > ZkMigrationClientTest > testWriteExistingTopicConfigs() STARTED
Gradle Test Run :core:integrationTest > Gradle Test Executor 172 > ZkMigrationClientTest > testWriteExistingTopicConfigs() PASSED
Gradle Test Run :core:integrationTest > Gradle Test Executor 172 > ZkMigrationClientTest > testCreateNewPartitions() STARTED
Gradle Test Run :core:integrationTest > Gradle Test Executor 172 > ZkMigrationClientTest > testCreateNewPartitions() PASSED
Gradle Test Run :core:integrationTest > Gradle Test Executor 172 > ZkMigrationClientTest > testIdempotentCreateTopics() STARTED
Gradle Test Run :core:integrationTest > Gradle Test Executor 172 > ZkMigrationClientTest > testIdempotentCreateTopics() PASSED
Gradle Test Run :core:integrationTest > Gradle Test Executor 172 > ZkMigrationClientTest > testWriteExistingClientQuotas() STARTED
Gradle Test Run :core:integrationTest > Gradle Test Executor 172 > ZkMigrationClientTest > testWriteExistingClientQuotas() PASSED
Gradle Test Run :core:integrationTest > Gradle Test Executor 172 > AllocateProducerIdsRequestTest > testAllocateProducersIdSentToController() > unit.kafka.server.AllocateProducerIdsRequestTest.testAllocateProducersIdSentToController()[1] STARTED
Gradle Test Run :core:integrationTest > Gradle Test Executor 172 > AllocateProducerIdsRequestTest > testAllocateProducersIdSentToController() > unit.kafka.server.AllocateProducerIdsRequestTest.testAllocateProducersIdSentToController()[1] PASSED
Gradle Test Run :core:integrationTest > Gradle Test Executor 172 > AllocateProducerIdsRequestTest > testAllocateProducersIdSentToNonController() > unit.kafka.server.AllocateProducerIdsRequestTest.testAllocateProducersIdSentToNonController()[1] STARTED
Gradle Test Run :core:integrationTest > Gradle Test Executor 172 > AllocateProducerIdsRequestTest > testAllocateProducersIdSentToNonController() > unit.kafka.server.AllocateProducerIdsRequestTest.testAllocateProducersIdSentToNonController()[1] PASSED
Deprecated Gradle features were used in this build, making it incompatible with Gradle 8.0.
You can use '--warning-mode all' to show the individual deprecation warnings and determine if they come from your own scripts or plugins.
See https://docs.gradle.org/7.6/userguide/command_line_interface.html#sec:command_line_warnings
BUILD SUCCESSFUL in 3h 13m 22s
218 actionable tasks: 118 executed, 100 up-to-date
See the profiling report at: file:///home/jenkins/jenkins-agent/workspace/Kafka_kafka_3.4/build/reports/profile/profile-2023-09-26-07-19-56.html
A fine-grained performance profile is available: use the --scan option.
[Pipeline] junit
Recording test results
[Checks API] No suitable checks publisher found.
[Pipeline] echo
Skipping Kafka Streams archetype test for Java 11
[Pipeline] }
[Pipeline] // withEnv
[Pipeline] }
[Pipeline] // withEnv
[Pipeline] }
[Pipeline] // withEnv
[Pipeline] }
[Pipeline] // node
[Pipeline] }
[Pipeline] // timestamps
[Pipeline] }
[Pipeline] // timeout
[Pipeline] }
[Pipeline] // stage
[Pipeline] }
[Pipeline] // parallel
[Pipeline] }
[Pipeline] // stage
[Pipeline] stage
[Pipeline] { (Declarative: Post Actions)
[Pipeline] script
[Pipeline] {
[Pipeline] node
Running on builds42 in /home/jenkins/workspace/Kafka_kafka_3.4
[Pipeline] {
[Pipeline] step
Build failed in Jenkins: Kafka » Kafka Branch Builder » 3.4 #168
Posted by Apache Jenkins Server <je...@builds.apache.org>.
See <https://ci-builds.apache.org/job/Kafka/job/kafka/job/3.4/168/display/redirect>
Changes:
------------------------------------------
[...truncated 524055 lines...]
Gradle Test Run :streams:integrationTest > Gradle Test Executor 181 > KTableKTableForeignKeyJoinIntegrationTest > [leftJoin=true, optimization=all, materialized=true, rejoin=true] > org.apache.kafka.streams.integration.KTableKTableForeignKeyJoinIntegrationTest.doJoinFromRightThenDeleteRightEntity[leftJoin=true, optimization=all, materialized=true, rejoin=true] PASSED
Gradle Test Run :streams:integrationTest > Gradle Test Executor 181 > KTableKTableForeignKeyJoinIntegrationTest > [leftJoin=true, optimization=all, materialized=true, rejoin=false] > org.apache.kafka.streams.integration.KTableKTableForeignKeyJoinIntegrationTest.shouldUnsubscribeOldForeignKeyIfLeftSideIsUpdated[leftJoin=true, optimization=all, materialized=true, rejoin=false] STARTED
Gradle Test Run :streams:integrationTest > Gradle Test Executor 181 > KTableKTableForeignKeyJoinIntegrationTest > [leftJoin=true, optimization=all, materialized=true, rejoin=false] > org.apache.kafka.streams.integration.KTableKTableForeignKeyJoinIntegrationTest.shouldUnsubscribeOldForeignKeyIfLeftSideIsUpdated[leftJoin=true, optimization=all, materialized=true, rejoin=false] PASSED
Gradle Test Run :streams:integrationTest > Gradle Test Executor 181 > KTableKTableForeignKeyJoinIntegrationTest > [leftJoin=true, optimization=all, materialized=true, rejoin=false] > org.apache.kafka.streams.integration.KTableKTableForeignKeyJoinIntegrationTest.shouldNotEmitTombstonesWhenDeletingNonExistingRecords[leftJoin=true, optimization=all, materialized=true, rejoin=false] STARTED
Gradle Test Run :streams:integrationTest > Gradle Test Executor 181 > KTableKTableForeignKeyJoinIntegrationTest > [leftJoin=true, optimization=all, materialized=true, rejoin=false] > org.apache.kafka.streams.integration.KTableKTableForeignKeyJoinIntegrationTest.shouldNotEmitTombstonesWhenDeletingNonExistingRecords[leftJoin=true, optimization=all, materialized=true, rejoin=false] PASSED
Gradle Test Run :streams:integrationTest > Gradle Test Executor 181 > KTableKTableForeignKeyJoinIntegrationTest > [leftJoin=true, optimization=all, materialized=true, rejoin=false] > org.apache.kafka.streams.integration.KTableKTableForeignKeyJoinIntegrationTest.shouldEmitTombstoneWhenDeletingNonJoiningRecords[leftJoin=true, optimization=all, materialized=true, rejoin=false] STARTED
> Task :core:integrationTest
Gradle Test Run :core:integrationTest > Gradle Test Executor 179 > PlaintextAdminIntegrationTest > testDeleteConsumerGroupOffsets(String) > kafka.api.PlaintextAdminIntegrationTest.testDeleteConsumerGroupOffsets(String)[2] PASSED
Gradle Test Run :core:integrationTest > Gradle Test Executor 179 > PlaintextAdminIntegrationTest > testListReassignmentsDoesNotShowNonReassigningPartitions(String) > kafka.api.PlaintextAdminIntegrationTest.testListReassignmentsDoesNotShowNonReassigningPartitions(String)[1] STARTED
Gradle Test Run :core:integrationTest > Gradle Test Executor 179 > PlaintextAdminIntegrationTest > testListReassignmentsDoesNotShowNonReassigningPartitions(String) > kafka.api.PlaintextAdminIntegrationTest.testListReassignmentsDoesNotShowNonReassigningPartitions(String)[1] PASSED
Gradle Test Run :core:integrationTest > Gradle Test Executor 179 > PlaintextAdminIntegrationTest > testListReassignmentsDoesNotShowNonReassigningPartitions(String) > kafka.api.PlaintextAdminIntegrationTest.testListReassignmentsDoesNotShowNonReassigningPartitions(String)[2] STARTED
Gradle Test Run :core:integrationTest > Gradle Test Executor 179 > PlaintextAdminIntegrationTest > testListReassignmentsDoesNotShowNonReassigningPartitions(String) > kafka.api.PlaintextAdminIntegrationTest.testListReassignmentsDoesNotShowNonReassigningPartitions(String)[2] PASSED
Gradle Test Run :core:integrationTest > Gradle Test Executor 179 > PlaintextAdminIntegrationTest > testConsumeAfterDeleteRecords(String) > kafka.api.PlaintextAdminIntegrationTest.testConsumeAfterDeleteRecords(String)[1] STARTED
Gradle Test Run :core:integrationTest > Gradle Test Executor 179 > PlaintextAdminIntegrationTest > testConsumeAfterDeleteRecords(String) > kafka.api.PlaintextAdminIntegrationTest.testConsumeAfterDeleteRecords(String)[1] PASSED
Gradle Test Run :core:integrationTest > Gradle Test Executor 179 > PlaintextAdminIntegrationTest > testConsumeAfterDeleteRecords(String) > kafka.api.PlaintextAdminIntegrationTest.testConsumeAfterDeleteRecords(String)[2] STARTED
Gradle Test Run :core:integrationTest > Gradle Test Executor 179 > PlaintextAdminIntegrationTest > testConsumeAfterDeleteRecords(String) > kafka.api.PlaintextAdminIntegrationTest.testConsumeAfterDeleteRecords(String)[2] PASSED
Gradle Test Run :core:integrationTest > Gradle Test Executor 179 > PlaintextAdminIntegrationTest > testClose(String) > kafka.api.PlaintextAdminIntegrationTest.testClose(String)[1] STARTED
Gradle Test Run :core:integrationTest > Gradle Test Executor 180 > SaslSslAdminIntegrationTest > testAuthorizedOperations() PASSED
Gradle Test Run :core:integrationTest > Gradle Test Executor 180 > SaslSslAdminIntegrationTest > testAclDescribe() STARTED
Gradle Test Run :core:integrationTest > Gradle Test Executor 179 > PlaintextAdminIntegrationTest > testClose(String) > kafka.api.PlaintextAdminIntegrationTest.testClose(String)[1] PASSED
Gradle Test Run :core:integrationTest > Gradle Test Executor 179 > PlaintextAdminIntegrationTest > testClose(String) > kafka.api.PlaintextAdminIntegrationTest.testClose(String)[2] STARTED
Gradle Test Run :core:integrationTest > Gradle Test Executor 179 > PlaintextAdminIntegrationTest > testClose(String) > kafka.api.PlaintextAdminIntegrationTest.testClose(String)[2] PASSED
Gradle Test Run :core:integrationTest > Gradle Test Executor 179 > PlaintextAdminIntegrationTest > testReplicaCanFetchFromLogStartOffsetAfterDeleteRecords(String) > kafka.api.PlaintextAdminIntegrationTest.testReplicaCanFetchFromLogStartOffsetAfterDeleteRecords(String)[1] STARTED
> Task :streams:integrationTest
Gradle Test Run :streams:integrationTest > Gradle Test Executor 181 > KTableKTableForeignKeyJoinIntegrationTest > [leftJoin=true, optimization=all, materialized=true, rejoin=false] > org.apache.kafka.streams.integration.KTableKTableForeignKeyJoinIntegrationTest.shouldEmitTombstoneWhenDeletingNonJoiningRecords[leftJoin=true, optimization=all, materialized=true, rejoin=false] PASSED
Gradle Test Run :streams:integrationTest > Gradle Test Executor 181 > KTableKTableForeignKeyJoinIntegrationTest > [leftJoin=true, optimization=all, materialized=true, rejoin=false] > org.apache.kafka.streams.integration.KTableKTableForeignKeyJoinIntegrationTest.joinShouldProduceNullsWhenValueHasNonMatchingForeignKey[leftJoin=true, optimization=all, materialized=true, rejoin=false] STARTED
Gradle Test Run :streams:integrationTest > Gradle Test Executor 182 > RocksDBMetricsIntegrationTest > [exactly_once] > org.apache.kafka.streams.integration.RocksDBMetricsIntegrationTest.shouldExposeRocksDBMetricsBeforeAndAfterFailureWithEmptyStateDir[exactly_once] PASSED
Gradle Test Run :streams:integrationTest > Gradle Test Executor 182 > RocksDBMetricsIntegrationTest > [exactly_once_v2] > org.apache.kafka.streams.integration.RocksDBMetricsIntegrationTest.shouldExposeRocksDBMetricsBeforeAndAfterFailureWithEmptyStateDir[exactly_once_v2] STARTED
Gradle Test Run :streams:integrationTest > Gradle Test Executor 181 > KTableKTableForeignKeyJoinIntegrationTest > [leftJoin=true, optimization=all, materialized=true, rejoin=false] > org.apache.kafka.streams.integration.KTableKTableForeignKeyJoinIntegrationTest.joinShouldProduceNullsWhenValueHasNonMatchingForeignKey[leftJoin=true, optimization=all, materialized=true, rejoin=false] PASSED
Gradle Test Run :streams:integrationTest > Gradle Test Executor 181 > KTableKTableForeignKeyJoinIntegrationTest > [leftJoin=true, optimization=all, materialized=true, rejoin=false] > org.apache.kafka.streams.integration.KTableKTableForeignKeyJoinIntegrationTest.doJoinFromLeftThenDeleteLeftEntity[leftJoin=true, optimization=all, materialized=true, rejoin=false] STARTED
> Task :core:integrationTest
Gradle Test Run :core:integrationTest > Gradle Test Executor 179 > PlaintextAdminIntegrationTest > testReplicaCanFetchFromLogStartOffsetAfterDeleteRecords(String) > kafka.api.PlaintextAdminIntegrationTest.testReplicaCanFetchFromLogStartOffsetAfterDeleteRecords(String)[1] PASSED
Gradle Test Run :core:integrationTest > Gradle Test Executor 179 > PlaintextAdminIntegrationTest > testReplicaCanFetchFromLogStartOffsetAfterDeleteRecords(String) > kafka.api.PlaintextAdminIntegrationTest.testReplicaCanFetchFromLogStartOffsetAfterDeleteRecords(String)[2] STARTED
Gradle Test Run :core:integrationTest > Gradle Test Executor 180 > SaslSslAdminIntegrationTest > testAclDescribe() PASSED
Gradle Test Run :core:integrationTest > Gradle Test Executor 180 > SaslSslAdminIntegrationTest > testLegacyAclOpsNeverAffectOrReturnPrefixed() STARTED
> Task :streams:integrationTest
Gradle Test Run :streams:integrationTest > Gradle Test Executor 181 > KTableKTableForeignKeyJoinIntegrationTest > [leftJoin=true, optimization=all, materialized=true, rejoin=false] > org.apache.kafka.streams.integration.KTableKTableForeignKeyJoinIntegrationTest.doJoinFromLeftThenDeleteLeftEntity[leftJoin=true, optimization=all, materialized=true, rejoin=false] PASSED
Gradle Test Run :streams:integrationTest > Gradle Test Executor 181 > KTableKTableForeignKeyJoinIntegrationTest > [leftJoin=true, optimization=all, materialized=true, rejoin=false] > org.apache.kafka.streams.integration.KTableKTableForeignKeyJoinIntegrationTest.doJoinFromRightThenDeleteRightEntity[leftJoin=true, optimization=all, materialized=true, rejoin=false] STARTED
Gradle Test Run :streams:integrationTest > Gradle Test Executor 182 > RocksDBMetricsIntegrationTest > [exactly_once_v2] > org.apache.kafka.streams.integration.RocksDBMetricsIntegrationTest.shouldExposeRocksDBMetricsBeforeAndAfterFailureWithEmptyStateDir[exactly_once_v2] PASSED
Gradle Test Run :streams:integrationTest > Gradle Test Executor 182 > SlidingWindowedKStreamIntegrationTest > [ON_WINDOW_UPDATE_cache:true] > org.apache.kafka.streams.integration.SlidingWindowedKStreamIntegrationTest.shouldAggregateWindowedWithNoGrace[ON_WINDOW_UPDATE_cache:true] STARTED
Gradle Test Run :streams:integrationTest > Gradle Test Executor 181 > KTableKTableForeignKeyJoinIntegrationTest > [leftJoin=true, optimization=all, materialized=true, rejoin=false] > org.apache.kafka.streams.integration.KTableKTableForeignKeyJoinIntegrationTest.doJoinFromRightThenDeleteRightEntity[leftJoin=true, optimization=all, materialized=true, rejoin=false] PASSED
Gradle Test Run :streams:integrationTest > Gradle Test Executor 181 > KTableKTableForeignKeyJoinIntegrationTest > [leftJoin=true, optimization=all, materialized=false, rejoin=true] > org.apache.kafka.streams.integration.KTableKTableForeignKeyJoinIntegrationTest.shouldUnsubscribeOldForeignKeyIfLeftSideIsUpdated[leftJoin=true, optimization=all, materialized=false, rejoin=true] STARTED
> Task :core:integrationTest
Gradle Test Run :core:integrationTest > Gradle Test Executor 179 > PlaintextAdminIntegrationTest > testReplicaCanFetchFromLogStartOffsetAfterDeleteRecords(String) > kafka.api.PlaintextAdminIntegrationTest.testReplicaCanFetchFromLogStartOffsetAfterDeleteRecords(String)[2] PASSED
Gradle Test Run :core:integrationTest > Gradle Test Executor 179 > PlaintextAdminIntegrationTest > testDescribeConfigsForLog4jLogLevels(String) > kafka.api.PlaintextAdminIntegrationTest.testDescribeConfigsForLog4jLogLevels(String)[1] STARTED
Gradle Test Run :core:integrationTest > Gradle Test Executor 179 > PlaintextAdminIntegrationTest > testDescribeConfigsForLog4jLogLevels(String) > kafka.api.PlaintextAdminIntegrationTest.testDescribeConfigsForLog4jLogLevels(String)[1] PASSED
Gradle Test Run :core:integrationTest > Gradle Test Executor 179 > PlaintextAdminIntegrationTest > testDescribeConfigsForLog4jLogLevels(String) > kafka.api.PlaintextAdminIntegrationTest.testDescribeConfigsForLog4jLogLevels(String)[2] STARTED
Gradle Test Run :core:integrationTest > Gradle Test Executor 179 > PlaintextAdminIntegrationTest > testDescribeConfigsForLog4jLogLevels(String) > kafka.api.PlaintextAdminIntegrationTest.testDescribeConfigsForLog4jLogLevels(String)[2] PASSED
Gradle Test Run :core:integrationTest > Gradle Test Executor 179 > PlaintextAdminIntegrationTest > testMinimumRequestTimeouts(String) > kafka.api.PlaintextAdminIntegrationTest.testMinimumRequestTimeouts(String)[1] STARTED
Gradle Test Run :core:integrationTest > Gradle Test Executor 179 > PlaintextAdminIntegrationTest > testMinimumRequestTimeouts(String) > kafka.api.PlaintextAdminIntegrationTest.testMinimumRequestTimeouts(String)[1] PASSED
Gradle Test Run :core:integrationTest > Gradle Test Executor 179 > PlaintextAdminIntegrationTest > testMinimumRequestTimeouts(String) > kafka.api.PlaintextAdminIntegrationTest.testMinimumRequestTimeouts(String)[2] STARTED
Gradle Test Run :core:integrationTest > Gradle Test Executor 179 > PlaintextAdminIntegrationTest > testMinimumRequestTimeouts(String) > kafka.api.PlaintextAdminIntegrationTest.testMinimumRequestTimeouts(String)[2] PASSED
Gradle Test Run :core:integrationTest > Gradle Test Executor 179 > PlaintextAdminIntegrationTest > testIncrementalAlterConfigsDeleteAndSetBrokerConfigs(String) > kafka.api.PlaintextAdminIntegrationTest.testIncrementalAlterConfigsDeleteAndSetBrokerConfigs(String)[1] STARTED
Gradle Test Run :core:integrationTest > Gradle Test Executor 180 > SaslSslAdminIntegrationTest > testLegacyAclOpsNeverAffectOrReturnPrefixed() PASSED
Gradle Test Run :core:integrationTest > Gradle Test Executor 180 > SaslSslAdminIntegrationTest > testCreateTopicsResponseMetadataAndConfig() STARTED
Gradle Test Run :core:integrationTest > Gradle Test Executor 179 > PlaintextAdminIntegrationTest > testIncrementalAlterConfigsDeleteAndSetBrokerConfigs(String) > kafka.api.PlaintextAdminIntegrationTest.testIncrementalAlterConfigsDeleteAndSetBrokerConfigs(String)[1] PASSED
Gradle Test Run :core:integrationTest > Gradle Test Executor 179 > PlaintextAdminIntegrationTest > testIncrementalAlterConfigsDeleteAndSetBrokerConfigs(String) > kafka.api.PlaintextAdminIntegrationTest.testIncrementalAlterConfigsDeleteAndSetBrokerConfigs(String)[2] STARTED
Gradle Test Run :core:integrationTest > Gradle Test Executor 179 > PlaintextAdminIntegrationTest > testIncrementalAlterConfigsDeleteAndSetBrokerConfigs(String) > kafka.api.PlaintextAdminIntegrationTest.testIncrementalAlterConfigsDeleteAndSetBrokerConfigs(String)[2] PASSED
Gradle Test Run :core:integrationTest > Gradle Test Executor 179 > PlaintextAdminIntegrationTest > testForceClose(String) > kafka.api.PlaintextAdminIntegrationTest.testForceClose(String)[1] STARTED
Gradle Test Run :core:integrationTest > Gradle Test Executor 179 > PlaintextAdminIntegrationTest > testForceClose(String) > kafka.api.PlaintextAdminIntegrationTest.testForceClose(String)[1] PASSED
Gradle Test Run :core:integrationTest > Gradle Test Executor 179 > PlaintextAdminIntegrationTest > testForceClose(String) > kafka.api.PlaintextAdminIntegrationTest.testForceClose(String)[2] STARTED
> Task :streams:integrationTest
Gradle Test Run :streams:integrationTest > Gradle Test Executor 182 > SlidingWindowedKStreamIntegrationTest > [ON_WINDOW_UPDATE_cache:true] > org.apache.kafka.streams.integration.SlidingWindowedKStreamIntegrationTest.shouldAggregateWindowedWithNoGrace[ON_WINDOW_UPDATE_cache:true] PASSED
Gradle Test Run :streams:integrationTest > Gradle Test Executor 182 > SlidingWindowedKStreamIntegrationTest > [ON_WINDOW_UPDATE_cache:true] > org.apache.kafka.streams.integration.SlidingWindowedKStreamIntegrationTest.shouldAggregateWindowedWithGrace[ON_WINDOW_UPDATE_cache:true] STARTED
Gradle Test Run :streams:integrationTest > Gradle Test Executor 182 > SlidingWindowedKStreamIntegrationTest > [ON_WINDOW_UPDATE_cache:true] > org.apache.kafka.streams.integration.SlidingWindowedKStreamIntegrationTest.shouldAggregateWindowedWithGrace[ON_WINDOW_UPDATE_cache:true] PASSED
Gradle Test Run :streams:integrationTest > Gradle Test Executor 182 > SlidingWindowedKStreamIntegrationTest > [ON_WINDOW_UPDATE_cache:true] > org.apache.kafka.streams.integration.SlidingWindowedKStreamIntegrationTest.shouldRestoreAfterJoinRestart[ON_WINDOW_UPDATE_cache:true] STARTED
Gradle Test Run :streams:integrationTest > Gradle Test Executor 181 > KTableKTableForeignKeyJoinIntegrationTest > [leftJoin=true, optimization=all, materialized=false, rejoin=true] > org.apache.kafka.streams.integration.KTableKTableForeignKeyJoinIntegrationTest.shouldUnsubscribeOldForeignKeyIfLeftSideIsUpdated[leftJoin=true, optimization=all, materialized=false, rejoin=true] PASSED
Gradle Test Run :streams:integrationTest > Gradle Test Executor 181 > KTableKTableForeignKeyJoinIntegrationTest > [leftJoin=true, optimization=all, materialized=false, rejoin=true] > org.apache.kafka.streams.integration.KTableKTableForeignKeyJoinIntegrationTest.shouldNotEmitTombstonesWhenDeletingNonExistingRecords[leftJoin=true, optimization=all, materialized=false, rejoin=true] STARTED
> Task :core:integrationTest
Gradle Test Run :core:integrationTest > Gradle Test Executor 179 > PlaintextAdminIntegrationTest > testForceClose(String) > kafka.api.PlaintextAdminIntegrationTest.testForceClose(String)[2] PASSED
Gradle Test Run :core:integrationTest > Gradle Test Executor 179 > PlaintextAdminIntegrationTest > testListNodes(String) > kafka.api.PlaintextAdminIntegrationTest.testListNodes(String)[1] STARTED
Gradle Test Run :core:integrationTest > Gradle Test Executor 179 > PlaintextAdminIntegrationTest > testListNodes(String) > kafka.api.PlaintextAdminIntegrationTest.testListNodes(String)[1] PASSED
Gradle Test Run :core:integrationTest > Gradle Test Executor 179 > PlaintextAdminIntegrationTest > testListNodes(String) > kafka.api.PlaintextAdminIntegrationTest.testListNodes(String)[2] STARTED
Cancelling nested steps due to timeout
Sending interrupt signal to process
> Task :streams:integrationTest
Gradle Test Run :streams:integrationTest > Gradle Test Executor 181 > KTableKTableForeignKeyJoinIntegrationTest > [leftJoin=true, optimization=all, materialized=false, rejoin=true] > org.apache.kafka.streams.integration.KTableKTableForeignKeyJoinIntegrationTest.shouldNotEmitTombstonesWhenDeletingNonExistingRecords[leftJoin=true, optimization=all, materialized=false, rejoin=true] PASSED
Gradle Test Run :streams:integrationTest > Gradle Test Executor 181 > KTableKTableForeignKeyJoinIntegrationTest > [leftJoin=true, optimization=all, materialized=false, rejoin=true] > org.apache.kafka.streams.integration.KTableKTableForeignKeyJoinIntegrationTest.shouldEmitTombstoneWhenDeletingNonJoiningRecords[leftJoin=true, optimization=all, materialized=false, rejoin=true] STARTED
Gradle Test Run :streams:integrationTest > Gradle Test Executor 182 > SlidingWindowedKStreamIntegrationTest > [ON_WINDOW_UPDATE_cache:true] > org.apache.kafka.streams.integration.SlidingWindowedKStreamIntegrationTest.shouldRestoreAfterJoinRestart[ON_WINDOW_UPDATE_cache:true] PASSED
Gradle Test Run :streams:integrationTest > Gradle Test Executor 182 > SlidingWindowedKStreamIntegrationTest > [ON_WINDOW_UPDATE_cache:false] > org.apache.kafka.streams.integration.SlidingWindowedKStreamIntegrationTest.shouldAggregateWindowedWithNoGrace[ON_WINDOW_UPDATE_cache:false] STARTED
> Task :core:integrationTest FAILED
Could not stop org.gradle.internal.actor.internal.DefaultActorFactory$NonBlockingActor@59ec48b5.
org.gradle.internal.dispatch.DispatchException: Could not dispatch message [MethodInvocation method: stop()].
at org.gradle.internal.dispatch.ExceptionTrackingFailureHandler.dispatchFailed(ExceptionTrackingFailureHandler.java:35)
at org.gradle.internal.dispatch.FailureHandlingDispatch.dispatch(FailureHandlingDispatch.java:32)
at org.gradle.internal.dispatch.AsyncDispatch.dispatchMessages(AsyncDispatch.java:87)
at org.gradle.internal.dispatch.AsyncDispatch.access$000(AsyncDispatch.java:36)
at org.gradle.internal.dispatch.AsyncDispatch$1.run(AsyncDispatch.java:71)
at org.gradle.internal.concurrent.InterruptibleRunnable.run(InterruptibleRunnable.java:42)
at org.gradle.internal.operations.CurrentBuildOperationPreservingRunnable.run(CurrentBuildOperationPreservingRunnable.java:42)
at org.gradle.internal.concurrent.ExecutorPolicy$CatchAndRecordFailures.onExecute(ExecutorPolicy.java:64)
at org.gradle.internal.concurrent.ManagedExecutorImpl$1.run(ManagedExecutorImpl.java:49)
at java.base/java.util.concurrent.ThreadPoolExecutor.runWorker(ThreadPoolExecutor.java:1136)
at java.base/java.util.concurrent.ThreadPoolExecutor$Worker.run(ThreadPoolExecutor.java:635)
at java.base/java.lang.Thread.run(Thread.java:833)
Caused by: org.gradle.process.internal.ExecException: Process 'Gradle Test Executor 180' finished with non-zero exit value 143
This problem might be caused by incorrect test process configuration.
Please refer to the test execution section in the User Manual at https://docs.gradle.org/7.6/userguide/java_testing.html#sec:test_execution
at org.gradle.api.internal.tasks.testing.worker.ForkingTestClassProcessor.stop(ForkingTestClassProcessor.java:192)
at org.gradle.api.internal.tasks.testing.processors.RestartEveryNTestClassProcessor.endBatch(RestartEveryNTestClassProcessor.java:77)
at org.gradle.api.internal.tasks.testing.processors.RestartEveryNTestClassProcessor.stop(RestartEveryNTestClassProcessor.java:62)
at jdk.internal.reflect.GeneratedMethodAccessor394.invoke(Unknown Source)
at java.base/jdk.internal.reflect.DelegatingMethodAccessorImpl.invoke(DelegatingMethodAccessorImpl.java:43)
at java.base/java.lang.reflect.Method.invoke(Method.java:568)
at org.gradle.internal.dispatch.ReflectionDispatch.dispatch(ReflectionDispatch.java:36)
at org.gradle.internal.dispatch.ReflectionDispatch.dispatch(ReflectionDispatch.java:24)
at org.gradle.internal.dispatch.FailureHandlingDispatch.dispatch(FailureHandlingDispatch.java:30)
... 10 more
> Task :streams:integrationTest
Could not stop org.gradle.internal.actor.internal.DefaultActorFactory$NonBlockingActor@e752351.
org.gradle.internal.dispatch.DispatchException: Could not dispatch message [MethodInvocation method: stop()].
at org.gradle.internal.dispatch.ExceptionTrackingFailureHandler.dispatchFailed(ExceptionTrackingFailureHandler.java:35)
at org.gradle.internal.dispatch.FailureHandlingDispatch.dispatch(FailureHandlingDispatch.java:32)
at org.gradle.internal.dispatch.AsyncDispatch.dispatchMessages(AsyncDispatch.java:87)
at org.gradle.internal.dispatch.AsyncDispatch.access$000(AsyncDispatch.java:36)
at org.gradle.internal.dispatch.AsyncDispatch$1.run(AsyncDispatch.java:71)
at org.gradle.internal.concurrent.InterruptibleRunnable.run(InterruptibleRunnable.java:42)
at org.gradle.internal.operations.CurrentBuildOperationPreservingRunnable.run(CurrentBuildOperationPreservingRunnable.java:42)
at org.gradle.internal.concurrent.ExecutorPolicy$CatchAndRecordFailures.onExecute(ExecutorPolicy.java:64)
at org.gradle.internal.concurrent.ManagedExecutorImpl$1.run(ManagedExecutorImpl.java:49)
at java.base/java.util.concurrent.ThreadPoolExecutor.runWorker(ThreadPoolExecutor.java:1136)
at java.base/java.util.concurrent.ThreadPoolExecutor$Worker.run(ThreadPoolExecutor.java:635)
at java.base/java.lang.Thread.run(Thread.java:833)
Caused by: org.gradle.process.internal.ExecException: Process 'Gradle Test Executor 181' finished with non-zero exit value 143
This problem might be caused by incorrect test process configuration.
Please refer to the test execution section in the User Manual at https://docs.gradle.org/7.6/userguide/java_testing.html#sec:test_execution
at org.gradle.api.internal.tasks.testing.worker.ForkingTestClassProcessor.stop(ForkingTestClassProcessor.java:192)
at org.gradle.api.internal.tasks.testing.processors.RestartEveryNTestClassProcessor.endBatch(RestartEveryNTestClassProcessor.java:77)
at org.gradle.api.internal.tasks.testing.processors.RestartEveryNTestClassProcessor.stop(RestartEveryNTestClassProcessor.java:62)
at jdk.internal.reflect.GeneratedMethodAccessor394.invoke(Unknown Source)
at java.base/jdk.internal.reflect.DelegatingMethodAccessorImpl.invoke(DelegatingMethodAccessorImpl.java:43)
at java.base/java.lang.reflect.Method.invoke(Method.java:568)
at org.gradle.internal.dispatch.ReflectionDispatch.dispatch(ReflectionDispatch.java:36)
at org.gradle.internal.dispatch.ReflectionDispatch.dispatch(ReflectionDispatch.java:24)
at org.gradle.internal.dispatch.FailureHandlingDispatch.dispatch(FailureHandlingDispatch.java:30)
... 10 more
Gradle Test Run :streams:integrationTest > Gradle Test Executor 181 > KTableKTableForeignKeyJoinIntegrationTest > [leftJoin=true, optimization=all, materialized=false, rejoin=true] > org.apache.kafka.streams.integration.KTableKTableForeignKeyJoinIntegrationTest.shouldEmitTombstoneWhenDeletingNonJoiningRecords[leftJoin=true, optimization=all, materialized=false, rejoin=true] SKIPPED
Gradle Test Run :streams:integrationTest > Gradle Test Executor 182 > SlidingWindowedKStreamIntegrationTest > [ON_WINDOW_UPDATE_cache:false] > org.apache.kafka.streams.integration.SlidingWindowedKStreamIntegrationTest.shouldAggregateWindowedWithNoGrace[ON_WINDOW_UPDATE_cache:false] SKIPPED
> Task :streams:integrationTest FAILED
script returned exit code 143
[Pipeline] }
[Pipeline] // withEnv
[Pipeline] }
[Pipeline] // withEnv
[Pipeline] }
[Pipeline] // withEnv
[Pipeline] }
[Pipeline] // node
[Pipeline] }
[Pipeline] // timestamps
[Pipeline] }
[Pipeline] // timeout
[Pipeline] }
[Pipeline] // stage
[Pipeline] }
Failed in branch JDK 17 and Scala 2.13
[Pipeline] // parallel
[Pipeline] }
[Pipeline] // stage
[Pipeline] stage
[Pipeline] { (Declarative: Post Actions)
[Pipeline] script
[Pipeline] {
[Pipeline] node
Running on builds42 in /home/jenkins/workspace/Kafka_kafka_3.4
[Pipeline] {
[Pipeline] step
Build failed in Jenkins: Kafka » Kafka Branch Builder » 3.4 #167
Posted by Apache Jenkins Server <je...@builds.apache.org>.
See <https://ci-builds.apache.org/job/Kafka/job/kafka/job/3.4/167/display/redirect>
Changes:
------------------------------------------
[...truncated 439022 lines...]
Gradle Test Run :core:integrationTest > Gradle Test Executor 169 > KafkaZkClientTest > testGetDataAndStat() PASSED
Gradle Test Run :core:integrationTest > Gradle Test Executor 169 > KafkaZkClientTest > testReassignPartitionsInProgress() STARTED
Gradle Test Run :core:integrationTest > Gradle Test Executor 169 > KafkaZkClientTest > testReassignPartitionsInProgress() PASSED
Gradle Test Run :core:integrationTest > Gradle Test Executor 169 > KafkaZkClientTest > testChrootExistsAndRootIsLocked() STARTED
Gradle Test Run :core:integrationTest > Gradle Test Executor 169 > KafkaZkClientTest > testChrootExistsAndRootIsLocked() PASSED
Gradle Test Run :core:integrationTest > Gradle Test Executor 169 > KafkaZkClientTest > testCreateTopLevelPaths() STARTED
Gradle Test Run :core:integrationTest > Gradle Test Executor 169 > KafkaZkClientTest > testCreateTopLevelPaths() PASSED
Gradle Test Run :core:integrationTest > Gradle Test Executor 169 > KafkaZkClientTest > testGetAllTopicsInClusterDoesNotTriggerWatch() STARTED
Gradle Test Run :core:integrationTest > Gradle Test Executor 169 > KafkaZkClientTest > testGetAllTopicsInClusterDoesNotTriggerWatch() PASSED
Gradle Test Run :core:integrationTest > Gradle Test Executor 169 > KafkaZkClientTest > testIsrChangeNotificationGetters() STARTED
Gradle Test Run :core:integrationTest > Gradle Test Executor 169 > KafkaZkClientTest > testIsrChangeNotificationGetters() PASSED
Gradle Test Run :core:integrationTest > Gradle Test Executor 169 > KafkaZkClientTest > testLogDirEventNotificationsDeletion() STARTED
Gradle Test Run :core:integrationTest > Gradle Test Executor 169 > KafkaZkClientTest > testLogDirEventNotificationsDeletion() PASSED
Gradle Test Run :core:integrationTest > Gradle Test Executor 169 > KafkaZkClientTest > testGetLogConfigs() STARTED
Gradle Test Run :core:integrationTest > Gradle Test Executor 169 > KafkaZkClientTest > testGetLogConfigs() PASSED
Gradle Test Run :core:integrationTest > Gradle Test Executor 169 > KafkaZkClientTest > testBrokerSequenceIdMethods() STARTED
Gradle Test Run :core:integrationTest > Gradle Test Executor 169 > KafkaZkClientTest > testBrokerSequenceIdMethods() PASSED
Gradle Test Run :core:integrationTest > Gradle Test Executor 169 > KafkaZkClientTest > testAclMethods() STARTED
Gradle Test Run :core:integrationTest > Gradle Test Executor 169 > KafkaZkClientTest > testAclMethods() PASSED
Gradle Test Run :core:integrationTest > Gradle Test Executor 169 > KafkaZkClientTest > testCreateSequentialPersistentPath() STARTED
Gradle Test Run :core:integrationTest > Gradle Test Executor 169 > KafkaZkClientTest > testCreateSequentialPersistentPath() PASSED
Gradle Test Run :core:integrationTest > Gradle Test Executor 169 > KafkaZkClientTest > testConditionalUpdatePath() STARTED
Gradle Test Run :core:integrationTest > Gradle Test Executor 169 > KafkaZkClientTest > testConditionalUpdatePath() PASSED
Gradle Test Run :core:integrationTest > Gradle Test Executor 169 > KafkaZkClientTest > testGetAllTopicsInClusterTriggersWatch() STARTED
Gradle Test Run :core:integrationTest > Gradle Test Executor 169 > KafkaZkClientTest > testGetAllTopicsInClusterTriggersWatch() PASSED
Gradle Test Run :core:integrationTest > Gradle Test Executor 169 > KafkaZkClientTest > testDeleteTopicZNode() STARTED
Gradle Test Run :core:integrationTest > Gradle Test Executor 169 > KafkaZkClientTest > testDeleteTopicZNode() PASSED
Gradle Test Run :core:integrationTest > Gradle Test Executor 169 > KafkaZkClientTest > testDeletePath() STARTED
Gradle Test Run :core:integrationTest > Gradle Test Executor 169 > KafkaZkClientTest > testDeletePath() PASSED
Gradle Test Run :core:integrationTest > Gradle Test Executor 169 > KafkaZkClientTest > testGetBrokerMethods() STARTED
Gradle Test Run :core:integrationTest > Gradle Test Executor 169 > KafkaZkClientTest > testGetBrokerMethods() PASSED
Gradle Test Run :core:integrationTest > Gradle Test Executor 169 > KafkaZkClientTest > testJuteMaxBufffer() STARTED
Gradle Test Run :core:integrationTest > Gradle Test Executor 169 > KafkaZkClientTest > testJuteMaxBufffer() PASSED
Gradle Test Run :core:integrationTest > Gradle Test Executor 169 > KafkaZkClientTest > testCreateTokenChangeNotification() STARTED
Gradle Test Run :core:integrationTest > Gradle Test Executor 169 > KafkaZkClientTest > testCreateTokenChangeNotification() PASSED
Gradle Test Run :core:integrationTest > Gradle Test Executor 169 > KafkaZkClientTest > testGetTopicsAndPartitions() STARTED
Gradle Test Run :core:integrationTest > Gradle Test Executor 169 > KafkaZkClientTest > testGetTopicsAndPartitions() PASSED
Gradle Test Run :core:integrationTest > Gradle Test Executor 169 > KafkaZkClientTest > testChroot(boolean) > kafka.zk.KafkaZkClientTest.testChroot(boolean)[1] STARTED
Gradle Test Run :core:integrationTest > Gradle Test Executor 169 > KafkaZkClientTest > testChroot(boolean) > kafka.zk.KafkaZkClientTest.testChroot(boolean)[1] PASSED
Gradle Test Run :core:integrationTest > Gradle Test Executor 169 > KafkaZkClientTest > testChroot(boolean) > kafka.zk.KafkaZkClientTest.testChroot(boolean)[2] STARTED
Gradle Test Run :core:integrationTest > Gradle Test Executor 169 > KafkaZkClientTest > testChroot(boolean) > kafka.zk.KafkaZkClientTest.testChroot(boolean)[2] PASSED
Gradle Test Run :core:integrationTest > Gradle Test Executor 169 > KafkaZkClientTest > testRegisterBrokerInfo() STARTED
Gradle Test Run :core:integrationTest > Gradle Test Executor 169 > KafkaZkClientTest > testRegisterBrokerInfo() PASSED
Gradle Test Run :core:integrationTest > Gradle Test Executor 169 > KafkaZkClientTest > testRetryRegisterBrokerInfo() STARTED
Gradle Test Run :core:integrationTest > Gradle Test Executor 169 > KafkaZkClientTest > testRetryRegisterBrokerInfo() PASSED
Gradle Test Run :core:integrationTest > Gradle Test Executor 169 > KafkaZkClientTest > testConsumerOffsetPath() STARTED
Gradle Test Run :core:integrationTest > Gradle Test Executor 169 > KafkaZkClientTest > testConsumerOffsetPath() PASSED
Gradle Test Run :core:integrationTest > Gradle Test Executor 169 > KafkaZkClientTest > testDeleteRecursiveWithControllerEpochVersionCheck() STARTED
Gradle Test Run :core:integrationTest > Gradle Test Executor 169 > KafkaZkClientTest > testDeleteRecursiveWithControllerEpochVersionCheck() PASSED
Gradle Test Run :core:integrationTest > Gradle Test Executor 169 > KafkaZkClientTest > testTopicAssignments() STARTED
Gradle Test Run :core:integrationTest > Gradle Test Executor 169 > KafkaZkClientTest > testTopicAssignments() PASSED
Gradle Test Run :core:integrationTest > Gradle Test Executor 169 > KafkaZkClientTest > testControllerManagementMethods() STARTED
Gradle Test Run :core:integrationTest > Gradle Test Executor 169 > KafkaZkClientTest > testControllerManagementMethods() PASSED
Gradle Test Run :core:integrationTest > Gradle Test Executor 169 > KafkaZkClientTest > testTopicAssignmentMethods() STARTED
Gradle Test Run :core:integrationTest > Gradle Test Executor 169 > KafkaZkClientTest > testTopicAssignmentMethods() PASSED
Gradle Test Run :core:integrationTest > Gradle Test Executor 169 > KafkaZkClientTest > testConnectionViaNettyClient() STARTED
Gradle Test Run :core:integrationTest > Gradle Test Executor 169 > KafkaZkClientTest > testConnectionViaNettyClient() PASSED
Gradle Test Run :core:integrationTest > Gradle Test Executor 169 > KafkaZkClientTest > testPropagateIsrChanges() STARTED
Gradle Test Run :core:integrationTest > Gradle Test Executor 169 > KafkaZkClientTest > testPropagateIsrChanges() PASSED
Gradle Test Run :core:integrationTest > Gradle Test Executor 169 > KafkaZkClientTest > testControllerEpochMethods() STARTED
Gradle Test Run :core:integrationTest > Gradle Test Executor 169 > KafkaZkClientTest > testControllerEpochMethods() PASSED
Gradle Test Run :core:integrationTest > Gradle Test Executor 169 > KafkaZkClientTest > testDeleteRecursive() STARTED
Gradle Test Run :core:integrationTest > Gradle Test Executor 169 > KafkaZkClientTest > testDeleteRecursive() PASSED
Gradle Test Run :core:integrationTest > Gradle Test Executor 169 > KafkaZkClientTest > testGetTopicPartitionStates() STARTED
Gradle Test Run :core:integrationTest > Gradle Test Executor 169 > KafkaZkClientTest > testGetTopicPartitionStates() PASSED
Gradle Test Run :core:integrationTest > Gradle Test Executor 169 > KafkaZkClientTest > testCreateConfigChangeNotification() STARTED
Gradle Test Run :core:integrationTest > Gradle Test Executor 169 > KafkaZkClientTest > testCreateConfigChangeNotification() PASSED
Gradle Test Run :core:integrationTest > Gradle Test Executor 169 > KafkaZkClientTest > testDelegationTokenMethods() STARTED
Gradle Test Run :core:integrationTest > Gradle Test Executor 169 > KafkaZkClientTest > testDelegationTokenMethods() PASSED
Gradle Test Run :core:integrationTest > Gradle Test Executor 169 > ZkMigrationClientTest > testUpdateExistingPartitions() STARTED
Gradle Test Run :core:integrationTest > Gradle Test Executor 169 > ZkMigrationClientTest > testUpdateExistingPartitions() PASSED
Gradle Test Run :core:integrationTest > Gradle Test Executor 169 > ZkMigrationClientTest > testEmptyWrite() STARTED
Gradle Test Run :core:integrationTest > Gradle Test Executor 169 > ZkMigrationClientTest > testEmptyWrite() PASSED
Gradle Test Run :core:integrationTest > Gradle Test Executor 169 > ZkMigrationClientTest > testExistingKRaftControllerClaim() STARTED
Gradle Test Run :core:integrationTest > Gradle Test Executor 169 > ZkMigrationClientTest > testExistingKRaftControllerClaim() PASSED
Gradle Test Run :core:integrationTest > Gradle Test Executor 169 > ZkMigrationClientTest > testReadAndWriteProducerId() STARTED
Gradle Test Run :core:integrationTest > Gradle Test Executor 169 > ZkMigrationClientTest > testReadAndWriteProducerId() PASSED
Gradle Test Run :core:integrationTest > Gradle Test Executor 169 > ZkMigrationClientTest > testMigrateTopicConfigs() STARTED
Gradle Test Run :core:integrationTest > Gradle Test Executor 169 > ZkMigrationClientTest > testMigrateTopicConfigs() PASSED
Gradle Test Run :core:integrationTest > Gradle Test Executor 169 > ZkMigrationClientTest > testNonIncreasingKRaftEpoch() STARTED
Gradle Test Run :core:integrationTest > Gradle Test Executor 169 > ZkMigrationClientTest > testNonIncreasingKRaftEpoch() PASSED
Gradle Test Run :core:integrationTest > Gradle Test Executor 169 > ZkMigrationClientTest > testMigrateEmptyZk() STARTED
Gradle Test Run :core:integrationTest > Gradle Test Executor 169 > ZkMigrationClientTest > testMigrateEmptyZk() PASSED
Gradle Test Run :core:integrationTest > Gradle Test Executor 169 > ZkMigrationClientTest > testWriteNewTopicConfigs() STARTED
Gradle Test Run :core:integrationTest > Gradle Test Executor 169 > ZkMigrationClientTest > testWriteNewTopicConfigs() PASSED
Gradle Test Run :core:integrationTest > Gradle Test Executor 169 > ZkMigrationClientTest > testClaimAndReleaseExistingController() STARTED
Gradle Test Run :core:integrationTest > Gradle Test Executor 169 > ZkMigrationClientTest > testClaimAndReleaseExistingController() PASSED
Gradle Test Run :core:integrationTest > Gradle Test Executor 169 > ZkMigrationClientTest > testWriteNewClientQuotas() STARTED
Gradle Test Run :core:integrationTest > Gradle Test Executor 169 > ZkMigrationClientTest > testWriteNewClientQuotas() PASSED
Gradle Test Run :core:integrationTest > Gradle Test Executor 169 > ZkMigrationClientTest > testClaimAbsentController() STARTED
Gradle Test Run :core:integrationTest > Gradle Test Executor 169 > ZkMigrationClientTest > testClaimAbsentController() PASSED
Gradle Test Run :core:integrationTest > Gradle Test Executor 169 > ZkMigrationClientTest > testWriteExistingTopicConfigs() STARTED
Gradle Test Run :core:integrationTest > Gradle Test Executor 169 > ZkMigrationClientTest > testWriteExistingTopicConfigs() PASSED
Gradle Test Run :core:integrationTest > Gradle Test Executor 169 > ZkMigrationClientTest > testCreateNewPartitions() STARTED
Gradle Test Run :core:integrationTest > Gradle Test Executor 169 > ZkMigrationClientTest > testCreateNewPartitions() PASSED
Gradle Test Run :core:integrationTest > Gradle Test Executor 169 > ZkMigrationClientTest > testIdempotentCreateTopics() STARTED
Gradle Test Run :core:integrationTest > Gradle Test Executor 169 > ZkMigrationClientTest > testIdempotentCreateTopics() PASSED
Gradle Test Run :core:integrationTest > Gradle Test Executor 169 > ZkMigrationClientTest > testWriteExistingClientQuotas() STARTED
Gradle Test Run :core:integrationTest > Gradle Test Executor 169 > ZkMigrationClientTest > testWriteExistingClientQuotas() PASSED
Gradle Test Run :core:integrationTest > Gradle Test Executor 169 > AllocateProducerIdsRequestTest > testAllocateProducersIdSentToController() > unit.kafka.server.AllocateProducerIdsRequestTest.testAllocateProducersIdSentToController()[1] STARTED
Gradle Test Run :core:integrationTest > Gradle Test Executor 169 > AllocateProducerIdsRequestTest > testAllocateProducersIdSentToController() > unit.kafka.server.AllocateProducerIdsRequestTest.testAllocateProducersIdSentToController()[1] PASSED
Gradle Test Run :core:integrationTest > Gradle Test Executor 169 > AllocateProducerIdsRequestTest > testAllocateProducersIdSentToNonController() > unit.kafka.server.AllocateProducerIdsRequestTest.testAllocateProducersIdSentToNonController()[1] STARTED
Gradle Test Run :core:integrationTest > Gradle Test Executor 169 > AllocateProducerIdsRequestTest > testAllocateProducersIdSentToNonController() > unit.kafka.server.AllocateProducerIdsRequestTest.testAllocateProducersIdSentToNonController()[1] PASSED
Deprecated Gradle features were used in this build, making it incompatible with Gradle 8.0.
You can use '--warning-mode all' to show the individual deprecation warnings and determine if they come from your own scripts or plugins.
See https://docs.gradle.org/7.6/userguide/command_line_interface.html#sec:command_line_warnings
BUILD SUCCESSFUL in 2h 44m 1s
218 actionable tasks: 118 executed, 100 up-to-date
See the profiling report at: file:///home/jenkins/workspace/Kafka_kafka_3.4/build/reports/profile/profile-2023-09-26-11-10-24.html
A fine-grained performance profile is available: use the --scan option.
[Pipeline] junit
Recording test results
[Checks API] No suitable checks publisher found.
[Pipeline] echo
Skipping Kafka Streams archetype test for Java 11
[Pipeline] }
[Pipeline] // withEnv
[Pipeline] }
[Pipeline] // withEnv
[Pipeline] }
[Pipeline] // withEnv
[Pipeline] }
[Pipeline] // node
[Pipeline] }
[Pipeline] // timestamps
[Pipeline] }
[Pipeline] // timeout
[Pipeline] }
[Pipeline] // stage
[Pipeline] }
[Pipeline] // parallel
[Pipeline] }
[Pipeline] // stage
[Pipeline] stage
[Pipeline] { (Declarative: Post Actions)
[Pipeline] script
[Pipeline] {
[Pipeline] node
Running on builds42 in /home/jenkins/workspace/Kafka_kafka_3.4
[Pipeline] {
[Pipeline] step