You are viewing a plain text version of this content. The canonical link for it is here.
Posted to builds@cassandra.apache.org by Apache Jenkins Server <je...@builds.apache.org> on 2023/12/07 09:35:20 UTC

Build complete: Cassandra-5.0 #134 [UNSTABLE] fdfc5e614d6d7e3e84f0200870d6ac34917f601d

-------------------------------------------------------------------------------
Build Cassandra-5.0 #134 Still Unstable
URL: https://ci-cassandra.apache.org/job/Cassandra-5.0/134/
-------------------------------------------------------------------------------
Changes:
[Michael Semb Wever] Write ccm clusters under test's TMPDIR

[Brandon Williams] Suppress CVE-2023-6378


-------------------------------------------------------------------------------
Failed Tests:
16 tests failed.
FAILED:  dtest-offheap.bootstrap_test.TestBootstrap.test_shutdown_wiped_node_cannot_join
FAILED:  dtest-upgrade-novnode-large.upgrade_tests.upgrade_through_versions_test.TestProtoV3Upgrade_AllVersions_RandomPartitioner_EndsAt_Trunk_HEAD.test_parallel_upgrade_with_internode_ssl
FAILED:  dtest-upgrade-novnode-large.upgrade_tests.upgrade_through_versions_test.TestProtoV4Upgrade_AllVersions_EndsAt_Trunk_HEAD.test_parallel_upgrade
FAILED:  dtest-upgrade-novnode-large.upgrade_tests.upgrade_through_versions_test.TestProtoV4Upgrade_AllVersions_RandomPartitioner_EndsAt_Trunk_HEAD.test_parallel_upgrade
FAILED:  dtest-upgrade-novnode-large.upgrade_tests.upgrade_through_versions_test.TestProtoV4Upgrade_AllVersions_RandomPartitioner_EndsAt_Trunk_HEAD.test_parallel_upgrade_with_internode_ssl
FAILED:  dtest-upgrade-novnode-large.upgrade_tests.upgrade_through_versions_test.TestUpgrade_current_5_0_x_To_indev_5_0_x.test_bootstrap
FAILED:  dtest-upgrade-novnode.upgrade_tests.cql_tests.TestCQLNodes3RF3_Upgrade_current_4_0_x_To_indev_5_0_x.test_cas_and_list_index
FAILED:  dtest-upgrade-novnode.upgrade_tests.cql_tests.TestCQLNodes3RF3_Upgrade_current_4_1_x_To_indev_5_0_x.test_only_pk
FAILED:  dtest-upgrade-novnode.upgrade_tests.cql_tests.TestCQLNodes3RF3_Upgrade_current_4_1_x_To_indev_5_0_x.test_map_keys_indexing
FAILED:  dtest-upgrade-novnode.upgrade_tests.cql_tests.TestCQLNodes2RF1_Upgrade_current_4_0_x_To_indev_5_0_x.test_limit_ranges
FAILED:  dtest-upgrade-novnode.upgrade_tests.cql_tests.TestCQLNodes2RF1_Upgrade_current_4_0_x_To_indev_5_0_x.test_timeuuid
FAILED:  org.apache.cassandra.distributed.test.sai.IndexStreamingFailureTest.testAvailabilityAfterFailedNonEntireFileStreaming-_jdk11_x86_64_novnode
FAILED:  org.apache.cassandra.distributed.test.sai.IndexStreamingFailureTest.testAvailabilityAfterFailedEntireFileStreaming-_jdk11_x86_64_novnode
FAILED:  org.apache.cassandra.utils.concurrent.SemaphoreTest.testUnfair-compression_jdk11_x86_64
FAILED:  dtest-offheap.bootstrap_test.TestBootstrap.test_read_from_bootstrapped_node
FAILED:  dtest-upgrade-novnode-large.upgrade_tests.upgrade_through_versions_test.TestProtoV3Upgrade_AllVersions_EndsAt_Trunk_HEAD.test_parallel_upgrade

-------------------------------------------------------------------------------
For complete test report and logs see https://nightlies.apache.org/cassandra/Cassandra-5.0/134/