You are viewing a plain text version of this content. The canonical link for it is here.
Posted to builds@beam.apache.org by Apache Jenkins Server <je...@builds.apache.org> on 2020/02/14 20:14:13 UTC
Build failed in Jenkins: beam_PostCommit_Java_ValidatesRunner_Flink
#6665
See <https://builds.apache.org/job/beam_PostCommit_Java_ValidatesRunner_Flink/6665/display/redirect?page=changes>
Changes:
[kcweaver] [BEAM-9212] fix zetasql struct exception
------------------------------------------
Started by GitHub push by ibzib
Running as SYSTEM
[EnvInject] - Loading node environment variables.
Building remotely on apache-beam-jenkins-13 (beam) in workspace <https://builds.apache.org/job/beam_PostCommit_Java_ValidatesRunner_Flink/ws/>
No credentials specified
Wiping out workspace first.
Cloning the remote Git repository
Cloning repository https://github.com/apache/beam.git
> git init <https://builds.apache.org/job/beam_PostCommit_Java_ValidatesRunner_Flink/ws/src> # timeout=10
Fetching upstream changes from https://github.com/apache/beam.git
> git --version # timeout=10
> git fetch --tags --progress https://github.com/apache/beam.git +refs/heads/*:refs/remotes/origin/*
> git config remote.origin.url https://github.com/apache/beam.git # timeout=10
> git config --add remote.origin.fetch +refs/heads/*:refs/remotes/origin/* # timeout=10
> git config remote.origin.url https://github.com/apache/beam.git # timeout=10
Fetching upstream changes from https://github.com/apache/beam.git
> git fetch --tags --progress https://github.com/apache/beam.git +refs/heads/*:refs/remotes/origin/* +refs/pull/${ghprbPullId}/*:refs/remotes/origin/pr/${ghprbPullId}/*
> git rev-parse origin/master^{commit} # timeout=10
Checking out Revision c1817f4cf65a4244c0033e6db3fc1eaedea5de88 (origin/master)
> git config core.sparsecheckout # timeout=10
> git checkout -f c1817f4cf65a4244c0033e6db3fc1eaedea5de88
Commit message: "Merge pull request #10707 from ibzib/zetasql-error-str"
> git rev-list --no-walk b1a02e9468b91c688074c270a50c2ef0aa6661ba # timeout=10
No emails were triggered.
[EnvInject] - Executing scripts and injecting environment variables after the SCM step.
[EnvInject] - Injecting as environment variables the properties content
SPARK_LOCAL_IP=127.0.0.1
[EnvInject] - Variables injected successfully.
[Gradle] - Launching build.
[src] $ <https://builds.apache.org/job/beam_PostCommit_Java_ValidatesRunner_Flink/ws/src/gradlew> --continue --max-workers=12 -Dorg.gradle.jvmargs=-Xms2g -Dorg.gradle.jvmargs=-Xmx4g :runners:flink:1.9:validatesRunner
Starting a Gradle Daemon, 1 busy Daemon could not be reused, use --status for details
> Task :buildSrc:compileJava NO-SOURCE
> Task :buildSrc:compileGroovy FROM-CACHE
> Task :buildSrc:pluginDescriptors
> Task :buildSrc:processResources
> Task :buildSrc:classes
> Task :buildSrc:jar
> Task :buildSrc:assemble
> Task :buildSrc:spotlessGroovy
> Task :buildSrc:spotlessGroovyCheck
> Task :buildSrc:spotlessGroovyGradle
> Task :buildSrc:spotlessGroovyGradleCheck
> Task :buildSrc:spotlessCheck
> Task :buildSrc:pluginUnderTestMetadata
> Task :buildSrc:compileTestJava NO-SOURCE
> Task :buildSrc:compileTestGroovy NO-SOURCE
> Task :buildSrc:processTestResources NO-SOURCE
> Task :buildSrc:testClasses UP-TO-DATE
> Task :buildSrc:test NO-SOURCE
> Task :buildSrc:validateTaskProperties FROM-CACHE
> Task :buildSrc:check
> Task :buildSrc:build
Configuration on demand is an incubating feature.
> Task :runners:core-java:processResources NO-SOURCE
> Task :runners:core-construction-java:processResources NO-SOURCE
> Task :sdks:java:harness:processResources NO-SOURCE
> Task :runners:flink:1.9:copyResourcesOverrides NO-SOURCE
> Task :sdks:java:extensions:google-cloud-platform-core:processResources NO-SOURCE
> Task :runners:java-fn-execution:processResources NO-SOURCE
> Task :sdks:java:fn-execution:processResources NO-SOURCE
> Task :vendor:sdks-java-extensions-protobuf:processResources NO-SOURCE
> Task :sdks:java:core:generateAvroProtocol NO-SOURCE
> Task :runners:core-java:processTestResources NO-SOURCE
> Task :sdks:java:core:generateAvroJava NO-SOURCE
> Task :model:fn-execution:extractProto
> Task :model:job-management:extractProto
> Task :model:job-management:processResources
> Task :sdks:java:core:generateGrammarSource FROM-CACHE
> Task :model:fn-execution:processResources
> Task :runners:flink:1.9:copySourceOverrides
> Task :runners:flink:1.9:copyTestResourcesOverrides NO-SOURCE
> Task :runners:flink:1.9:processResources
> Task :sdks:java:core:processResources
> Task :sdks:java:core:generateTestAvroProtocol NO-SOURCE
> Task :sdks:java:core:generateTestAvroJava
> Task :sdks:java:core:generateTestGrammarSource NO-SOURCE
> Task :sdks:java:core:processTestResources
> Task :model:pipeline:extractIncludeProto
> Task :model:pipeline:extractProto
> Task :model:pipeline:generateProto
> Task :model:pipeline:compileJava FROM-CACHE
> Task :model:pipeline:processResources
> Task :model:pipeline:classes
> Task :sdks:java:build-tools:compileJava
> Task :sdks:java:build-tools:processResources
> Task :sdks:java:build-tools:classes
> Task :sdks:java:build-tools:jar
> Task :model:pipeline:jar
> Task :model:job-management:extractIncludeProto
> Task :model:fn-execution:extractIncludeProto
> Task :model:job-management:generateProto
> Task :model:fn-execution:generateProto
> Task :model:job-management:compileJava FROM-CACHE
> Task :model:job-management:classes
> Task :model:fn-execution:compileJava FROM-CACHE
> Task :model:fn-execution:classes
> Task :model:pipeline:shadowJar
> Task :model:job-management:shadowJar
> Task :model:fn-execution:shadowJar
> Task :sdks:java:core:compileJava FROM-CACHE
> Task :sdks:java:core:classes
> Task :sdks:java:core:shadowJar
> Task :vendor:sdks-java-extensions-protobuf:compileJava FROM-CACHE
> Task :vendor:sdks-java-extensions-protobuf:classes UP-TO-DATE
> Task :sdks:java:extensions:google-cloud-platform-core:compileJava FROM-CACHE
> Task :sdks:java:extensions:google-cloud-platform-core:classes UP-TO-DATE
> Task :runners:core-construction-java:compileJava FROM-CACHE
> Task :runners:core-construction-java:classes UP-TO-DATE
> Task :sdks:java:extensions:google-cloud-platform-core:jar
> Task :sdks:java:fn-execution:compileJava FROM-CACHE
> Task :sdks:java:fn-execution:classes UP-TO-DATE
> Task :sdks:java:fn-execution:jar
> Task :vendor:sdks-java-extensions-protobuf:shadowJar
> Task :runners:core-construction-java:jar
> Task :runners:core-java:compileJava FROM-CACHE
> Task :runners:core-java:classes UP-TO-DATE
> Task :runners:core-java:jar
> Task :sdks:java:harness:compileJava FROM-CACHE
> Task :sdks:java:harness:classes UP-TO-DATE
> Task :sdks:java:core:compileTestJava FROM-CACHE
> Task :sdks:java:harness:jar
> Task :sdks:java:core:testClasses
> Task :sdks:java:core:shadowTestJar
> Task :runners:core-java:compileTestJava
Note: Some input files use or override a deprecated API.
Note: Recompile with -Xlint:deprecation for details.
Note: Some input files use unchecked or unsafe operations.
Note: Recompile with -Xlint:unchecked for details.
> Task :sdks:java:harness:shadowJar
> Task :runners:core-java:testClasses
> Task :runners:core-java:testJar
> Task :runners:java-fn-execution:compileJava FROM-CACHE
> Task :runners:java-fn-execution:classes UP-TO-DATE
> Task :runners:java-fn-execution:jar
> Task :runners:flink:1.9:compileJava
Note: Some input files use or override a deprecated API.
Note: Recompile with -Xlint:deprecation for details.
Note: Some input files use unchecked or unsafe operations.
Note: Recompile with -Xlint:unchecked for details.
> Task :runners:flink:1.9:classes
> Task :runners:flink:1.9:jar
> Task :runners:flink:1.9:validatesRunnerBatch
org.apache.beam.sdk.transforms.ParDoTest$TimerFamilyTests > testTimerWithMultipleTimerFamilyUnbounded FAILED
org.apache.beam.sdk.Pipeline$PipelineExecutionException at ParDoTest.java:4679
Caused by: java.lang.IllegalArgumentException at ParDoTest.java:4679
org.apache.beam.sdk.transforms.ParDoTest$TimerFamilyTests > testTimerFamilyAndTimerUnbounded FAILED
org.apache.beam.sdk.Pipeline$PipelineExecutionException at ParDoTest.java:4735
Caused by: java.lang.IllegalArgumentException at ParDoTest.java:4735
org.apache.beam.sdk.transforms.ParDoTest$TimerFamilyTests > testTimerFamilyEventTimeUnbounded FAILED
org.apache.beam.sdk.Pipeline$PipelineExecutionException at ParDoTest.java:4622
Caused by: java.lang.IllegalArgumentException at ParDoTest.java:4622
243 tests completed, 3 failed, 2 skipped
> Task :runners:flink:1.9:validatesRunnerBatch FAILED
> Task :runners:flink:1.9:validatesRunnerStreaming
FAILURE: Build failed with an exception.
* What went wrong:
Execution failed for task ':runners:flink:1.9:validatesRunnerBatch'.
> There were failing tests. See the report at: file://<https://builds.apache.org/job/beam_PostCommit_Java_ValidatesRunner_Flink/ws/src/runners/flink/1.9/build/reports/tests/validatesRunnerBatch/index.html>
* Try:
Run with --stacktrace option to get the stack trace. Run with --info or --debug option to get more log output. Run with --scan to get full insights.
* Get more help at https://help.gradle.org
Deprecated Gradle features were used in this build, making it incompatible with Gradle 6.0.
Use '--warning-mode all' to show the individual deprecation warnings.
See https://docs.gradle.org/5.2.1/userguide/command_line_interface.html#sec:command_line_warnings
BUILD FAILED in 5m 43s
53 actionable tasks: 40 executed, 13 from cache
Publishing build scan...
https://gradle.com/s/w2rtaqd43c2zq
Build step 'Invoke Gradle script' changed build result to FAILURE
Build step 'Invoke Gradle script' marked build as failure
---------------------------------------------------------------------
To unsubscribe, e-mail: builds-unsubscribe@beam.apache.org
For additional commands, e-mail: builds-help@beam.apache.org
Jenkins build is back to normal :
beam_PostCommit_Java_ValidatesRunner_Flink #6668
Posted by Apache Jenkins Server <je...@builds.apache.org>.
See <https://builds.apache.org/job/beam_PostCommit_Java_ValidatesRunner_Flink/6668/display/redirect?page=changes>
---------------------------------------------------------------------
To unsubscribe, e-mail: builds-unsubscribe@beam.apache.org
For additional commands, e-mail: builds-help@beam.apache.org
Build failed in Jenkins: beam_PostCommit_Java_ValidatesRunner_Flink
#6667
Posted by Apache Jenkins Server <je...@builds.apache.org>.
See <https://builds.apache.org/job/beam_PostCommit_Java_ValidatesRunner_Flink/6667/display/redirect?page=changes>
Changes:
[github] [BEAM-9317] Fix Dataflow tests to not perform SplittableDoFn expansion
------------------------------------------
Started by GitHub push by lukecwik
Running as SYSTEM
[EnvInject] - Loading node environment variables.
Building remotely on apache-beam-jenkins-9 (beam) in workspace <https://builds.apache.org/job/beam_PostCommit_Java_ValidatesRunner_Flink/ws/>
No credentials specified
Wiping out workspace first.
Cloning the remote Git repository
Cloning repository https://github.com/apache/beam.git
> git init <https://builds.apache.org/job/beam_PostCommit_Java_ValidatesRunner_Flink/ws/src> # timeout=10
Fetching upstream changes from https://github.com/apache/beam.git
> git --version # timeout=10
> git fetch --tags --progress https://github.com/apache/beam.git +refs/heads/*:refs/remotes/origin/*
> git config remote.origin.url https://github.com/apache/beam.git # timeout=10
> git config --add remote.origin.fetch +refs/heads/*:refs/remotes/origin/* # timeout=10
> git config remote.origin.url https://github.com/apache/beam.git # timeout=10
Fetching upstream changes from https://github.com/apache/beam.git
> git fetch --tags --progress https://github.com/apache/beam.git +refs/heads/*:refs/remotes/origin/* +refs/pull/${ghprbPullId}/*:refs/remotes/origin/pr/${ghprbPullId}/*
> git rev-parse origin/master^{commit} # timeout=10
Checking out Revision b6b631238bd10786c1bdb76d674a5f073d6477c3 (origin/master)
> git config core.sparsecheckout # timeout=10
> git checkout -f b6b631238bd10786c1bdb76d674a5f073d6477c3
Commit message: "[BEAM-9317] Fix Dataflow tests to not perform SplittableDoFn expansion at the moment. (#10868)"
> git rev-list --no-walk 9710fce42f8ad5a542ee3244004ec49aba5e6acb # timeout=10
No emails were triggered.
[EnvInject] - Executing scripts and injecting environment variables after the SCM step.
[EnvInject] - Injecting as environment variables the properties content
SPARK_LOCAL_IP=127.0.0.1
[EnvInject] - Variables injected successfully.
[Gradle] - Launching build.
[src] $ <https://builds.apache.org/job/beam_PostCommit_Java_ValidatesRunner_Flink/ws/src/gradlew> --continue --max-workers=12 -Dorg.gradle.jvmargs=-Xms2g -Dorg.gradle.jvmargs=-Xmx4g :runners:flink:1.9:validatesRunner
Starting a Gradle Daemon, 1 busy and 1 stopped Daemons could not be reused, use --status for details
> Task :buildSrc:compileJava NO-SOURCE
> Task :buildSrc:compileGroovy FROM-CACHE
> Task :buildSrc:pluginDescriptors
> Task :buildSrc:processResources
> Task :buildSrc:classes
> Task :buildSrc:jar
> Task :buildSrc:assemble
> Task :buildSrc:spotlessGroovy
> Task :buildSrc:spotlessGroovyCheck
> Task :buildSrc:spotlessGroovyGradle
> Task :buildSrc:spotlessGroovyGradleCheck
> Task :buildSrc:spotlessCheck
> Task :buildSrc:pluginUnderTestMetadata
> Task :buildSrc:compileTestJava NO-SOURCE
> Task :buildSrc:compileTestGroovy NO-SOURCE
> Task :buildSrc:processTestResources NO-SOURCE
> Task :buildSrc:testClasses UP-TO-DATE
> Task :buildSrc:test NO-SOURCE
> Task :buildSrc:validateTaskProperties FROM-CACHE
> Task :buildSrc:check
> Task :buildSrc:build
Configuration on demand is an incubating feature.
> Task :runners:flink:1.9:copyResourcesOverrides NO-SOURCE
> Task :sdks:java:core:generateAvroProtocol NO-SOURCE
> Task :sdks:java:fn-execution:processResources NO-SOURCE
> Task :runners:core-construction-java:processResources NO-SOURCE
> Task :sdks:java:extensions:google-cloud-platform-core:processResources NO-SOURCE
> Task :sdks:java:harness:processResources NO-SOURCE
> Task :runners:java-fn-execution:processResources NO-SOURCE
> Task :vendor:sdks-java-extensions-protobuf:processResources NO-SOURCE
> Task :sdks:java:core:generateAvroJava NO-SOURCE
> Task :runners:core-java:processResources NO-SOURCE
> Task :runners:core-java:processTestResources NO-SOURCE
> Task :model:job-management:extractProto
> Task :model:fn-execution:extractProto
> Task :runners:flink:1.9:copySourceOverrides
> Task :runners:flink:1.9:copyTestResourcesOverrides NO-SOURCE
> Task :model:job-management:processResources
> Task :sdks:java:core:generateGrammarSource FROM-CACHE
> Task :runners:flink:1.9:processResources
> Task :model:fn-execution:processResources
> Task :sdks:java:build-tools:compileJava FROM-CACHE
> Task :sdks:java:core:processResources
> Task :sdks:java:core:generateTestAvroProtocol NO-SOURCE
> Task :sdks:java:build-tools:processResources
> Task :sdks:java:build-tools:classes
> Task :sdks:java:build-tools:jar
> Task :sdks:java:core:generateTestAvroJava
> Task :sdks:java:core:generateTestGrammarSource NO-SOURCE
> Task :sdks:java:core:processTestResources
> Task :model:pipeline:extractIncludeProto
> Task :model:pipeline:extractProto
> Task :model:pipeline:generateProto
> Task :model:pipeline:compileJava FROM-CACHE
> Task :model:pipeline:processResources
> Task :model:pipeline:classes
> Task :model:pipeline:jar
> Task :model:job-management:extractIncludeProto
> Task :model:fn-execution:extractIncludeProto
> Task :model:job-management:generateProto
> Task :model:fn-execution:generateProto
> Task :model:job-management:compileJava FROM-CACHE
> Task :model:job-management:classes
> Task :model:fn-execution:compileJava FROM-CACHE
> Task :model:fn-execution:classes
> Task :model:pipeline:shadowJar
> Task :model:job-management:shadowJar
> Task :model:fn-execution:shadowJar
> Task :sdks:java:core:compileJava FROM-CACHE
> Task :sdks:java:core:classes
> Task :sdks:java:core:shadowJar
> Task :vendor:sdks-java-extensions-protobuf:compileJava FROM-CACHE
> Task :vendor:sdks-java-extensions-protobuf:classes UP-TO-DATE
> Task :sdks:java:extensions:google-cloud-platform-core:compileJava FROM-CACHE
> Task :sdks:java:extensions:google-cloud-platform-core:classes UP-TO-DATE
> Task :runners:core-construction-java:compileJava FROM-CACHE
> Task :runners:core-construction-java:classes UP-TO-DATE
> Task :sdks:java:extensions:google-cloud-platform-core:jar
> Task :vendor:sdks-java-extensions-protobuf:shadowJar
> Task :sdks:java:fn-execution:compileJava FROM-CACHE
> Task :sdks:java:fn-execution:classes UP-TO-DATE
> Task :sdks:java:fn-execution:jar
> Task :runners:core-construction-java:jar
> Task :runners:core-java:compileJava FROM-CACHE
> Task :runners:core-java:classes UP-TO-DATE
> Task :runners:core-java:jar
> Task :sdks:java:harness:compileJava FROM-CACHE
> Task :sdks:java:harness:classes UP-TO-DATE
> Task :sdks:java:harness:jar
> Task :sdks:java:core:compileTestJava FROM-CACHE
> Task :sdks:java:core:testClasses
> Task :sdks:java:core:shadowTestJar
> Task :runners:core-java:compileTestJava FROM-CACHE
> Task :runners:core-java:testClasses UP-TO-DATE
> Task :runners:core-java:testJar
> Task :sdks:java:harness:shadowJar
> Task :runners:java-fn-execution:compileJava FROM-CACHE
> Task :runners:java-fn-execution:classes UP-TO-DATE
> Task :runners:java-fn-execution:jar
> Task :runners:flink:1.9:compileJava FROM-CACHE
> Task :runners:flink:1.9:classes
> Task :runners:flink:1.9:jar
> Task :runners:flink:1.9:validatesRunnerBatch
org.apache.beam.sdk.transforms.ParDoTest$TimerFamilyTests > testTimerWithMultipleTimerFamilyUnbounded FAILED
org.apache.beam.sdk.Pipeline$PipelineExecutionException at ParDoTest.java:4713
Caused by: java.lang.IllegalArgumentException at ParDoTest.java:4713
org.apache.beam.sdk.transforms.ParDoTest$TimerFamilyTests > testTimerFamilyAndTimerUnbounded FAILED
org.apache.beam.sdk.Pipeline$PipelineExecutionException at ParDoTest.java:4769
Caused by: java.lang.IllegalArgumentException at ParDoTest.java:4769
org.apache.beam.sdk.transforms.ParDoTest$TimerFamilyTests > testTimerFamilyEventTimeUnbounded FAILED
org.apache.beam.sdk.Pipeline$PipelineExecutionException at ParDoTest.java:4656
Caused by: java.lang.IllegalArgumentException at ParDoTest.java:4656
243 tests completed, 3 failed, 2 skipped
> Task :runners:flink:1.9:validatesRunnerBatch FAILED
> Task :runners:flink:1.9:validatesRunnerStreaming
FAILURE: Build failed with an exception.
* What went wrong:
Execution failed for task ':runners:flink:1.9:validatesRunnerBatch'.
> There were failing tests. See the report at: file://<https://builds.apache.org/job/beam_PostCommit_Java_ValidatesRunner_Flink/ws/src/runners/flink/1.9/build/reports/tests/validatesRunnerBatch/index.html>
* Try:
Run with --stacktrace option to get the stack trace. Run with --info or --debug option to get more log output. Run with --scan to get full insights.
* Get more help at https://help.gradle.org
Deprecated Gradle features were used in this build, making it incompatible with Gradle 6.0.
Use '--warning-mode all' to show the individual deprecation warnings.
See https://docs.gradle.org/5.2.1/userguide/command_line_interface.html#sec:command_line_warnings
BUILD FAILED in 5m 10s
53 actionable tasks: 37 executed, 16 from cache
Publishing build scan...
https://gradle.com/s/sknpqkaihnjxu
Build step 'Invoke Gradle script' changed build result to FAILURE
Build step 'Invoke Gradle script' marked build as failure
---------------------------------------------------------------------
To unsubscribe, e-mail: builds-unsubscribe@beam.apache.org
For additional commands, e-mail: builds-help@beam.apache.org
Build failed in Jenkins: beam_PostCommit_Java_ValidatesRunner_Flink
#6666
Posted by Apache Jenkins Server <je...@builds.apache.org>.
See <https://builds.apache.org/job/beam_PostCommit_Java_ValidatesRunner_Flink/6666/display/redirect?page=changes>
Changes:
[je.ik] [BEAM-9265] @RequiresTimeSortedInput respects allowedLateness
------------------------------------------
Started by GitHub push by je-ik
Running as SYSTEM
[EnvInject] - Loading node environment variables.
Building remotely on apache-beam-jenkins-15 (beam) in workspace <https://builds.apache.org/job/beam_PostCommit_Java_ValidatesRunner_Flink/ws/>
No credentials specified
Wiping out workspace first.
Cloning the remote Git repository
Cloning repository https://github.com/apache/beam.git
> git init <https://builds.apache.org/job/beam_PostCommit_Java_ValidatesRunner_Flink/ws/src> # timeout=10
Fetching upstream changes from https://github.com/apache/beam.git
> git --version # timeout=10
> git fetch --tags --progress https://github.com/apache/beam.git +refs/heads/*:refs/remotes/origin/*
> git config remote.origin.url https://github.com/apache/beam.git # timeout=10
> git config --add remote.origin.fetch +refs/heads/*:refs/remotes/origin/* # timeout=10
> git config remote.origin.url https://github.com/apache/beam.git # timeout=10
Fetching upstream changes from https://github.com/apache/beam.git
> git fetch --tags --progress https://github.com/apache/beam.git +refs/heads/*:refs/remotes/origin/* +refs/pull/${ghprbPullId}/*:refs/remotes/origin/pr/${ghprbPullId}/*
> git rev-parse origin/master^{commit} # timeout=10
Checking out Revision 9710fce42f8ad5a542ee3244004ec49aba5e6acb (origin/master)
> git config core.sparsecheckout # timeout=10
> git checkout -f 9710fce42f8ad5a542ee3244004ec49aba5e6acb
Commit message: "Merge pull request #10795: [BEAM-9265] @RequiresTimeSortedInput respects allowedLateness"
> git rev-list --no-walk c1817f4cf65a4244c0033e6db3fc1eaedea5de88 # timeout=10
No emails were triggered.
[EnvInject] - Executing scripts and injecting environment variables after the SCM step.
[EnvInject] - Injecting as environment variables the properties content
SPARK_LOCAL_IP=127.0.0.1
[EnvInject] - Variables injected successfully.
[Gradle] - Launching build.
[src] $ <https://builds.apache.org/job/beam_PostCommit_Java_ValidatesRunner_Flink/ws/src/gradlew> --continue --max-workers=12 -Dorg.gradle.jvmargs=-Xms2g -Dorg.gradle.jvmargs=-Xmx4g :runners:flink:1.9:validatesRunner
Starting a Gradle Daemon, 1 busy Daemon could not be reused, use --status for details
> Task :buildSrc:compileJava NO-SOURCE
> Task :buildSrc:compileGroovy FROM-CACHE
> Task :buildSrc:pluginDescriptors
> Task :buildSrc:processResources
> Task :buildSrc:classes
> Task :buildSrc:jar
> Task :buildSrc:assemble
> Task :buildSrc:spotlessGroovy
> Task :buildSrc:spotlessGroovyCheck
> Task :buildSrc:spotlessGroovyGradle
> Task :buildSrc:spotlessGroovyGradleCheck
> Task :buildSrc:spotlessCheck
> Task :buildSrc:pluginUnderTestMetadata
> Task :buildSrc:compileTestJava NO-SOURCE
> Task :buildSrc:compileTestGroovy NO-SOURCE
> Task :buildSrc:processTestResources NO-SOURCE
> Task :buildSrc:testClasses UP-TO-DATE
> Task :buildSrc:test NO-SOURCE
> Task :buildSrc:validateTaskProperties FROM-CACHE
> Task :buildSrc:check
> Task :buildSrc:build
Configuration on demand is an incubating feature.
> Task :sdks:java:extensions:google-cloud-platform-core:processResources NO-SOURCE
> Task :sdks:java:core:generateAvroProtocol NO-SOURCE
> Task :sdks:java:harness:processResources NO-SOURCE
> Task :runners:flink:1.9:copyResourcesOverrides NO-SOURCE
> Task :sdks:java:fn-execution:processResources NO-SOURCE
> Task :runners:java-fn-execution:processResources NO-SOURCE
> Task :runners:core-java:processResources NO-SOURCE
> Task :runners:core-construction-java:processResources NO-SOURCE
> Task :vendor:sdks-java-extensions-protobuf:processResources NO-SOURCE
> Task :sdks:java:core:generateAvroJava NO-SOURCE
> Task :model:job-management:extractProto
> Task :model:fn-execution:extractProto
> Task :runners:core-java:processTestResources NO-SOURCE
> Task :runners:flink:1.9:copySourceOverrides
> Task :sdks:java:core:generateGrammarSource FROM-CACHE
> Task :model:fn-execution:processResources
> Task :runners:flink:1.9:copyTestResourcesOverrides NO-SOURCE
> Task :model:job-management:processResources
> Task :runners:flink:1.9:processResources
> Task :sdks:java:build-tools:compileJava FROM-CACHE
> Task :sdks:java:build-tools:processResources
> Task :sdks:java:build-tools:classes
> Task :sdks:java:core:processResources
> Task :sdks:java:core:generateTestAvroProtocol NO-SOURCE
> Task :sdks:java:build-tools:jar
> Task :sdks:java:core:generateTestAvroJava
> Task :sdks:java:core:generateTestGrammarSource NO-SOURCE
> Task :sdks:java:core:processTestResources
> Task :model:pipeline:extractIncludeProto
> Task :model:pipeline:extractProto
> Task :model:pipeline:generateProto
> Task :model:pipeline:compileJava FROM-CACHE
> Task :model:pipeline:processResources
> Task :model:pipeline:classes
> Task :model:pipeline:jar
> Task :model:fn-execution:extractIncludeProto
> Task :model:job-management:extractIncludeProto
> Task :model:job-management:generateProto
> Task :model:fn-execution:generateProto
> Task :model:job-management:compileJava FROM-CACHE
> Task :model:job-management:classes
> Task :model:fn-execution:compileJava FROM-CACHE
> Task :model:fn-execution:classes
> Task :model:pipeline:shadowJar
> Task :model:job-management:shadowJar
> Task :model:fn-execution:shadowJar
> Task :sdks:java:core:compileJava
Note: Some input files use or override a deprecated API.
Note: Recompile with -Xlint:deprecation for details.
Note: Some input files use unchecked or unsafe operations.
Note: Recompile with -Xlint:unchecked for details.
> Task :sdks:java:core:classes
> Task :sdks:java:core:shadowJar
> Task :vendor:sdks-java-extensions-protobuf:compileJava
Note: Some input files use or override a deprecated API.
Note: Recompile with -Xlint:deprecation for details.
Note: Some input files use unchecked or unsafe operations.
Note: Recompile with -Xlint:unchecked for details.
> Task :sdks:java:fn-execution:compileJava
Note: <https://builds.apache.org/job/beam_PostCommit_Java_ValidatesRunner_Flink/ws/src/sdks/java/fn-execution/src/main/java/org/apache/beam/sdk/fn/data/BeamFnDataSizeBasedBufferingOutboundObserver.java> uses or overrides a deprecated API.
Note: Recompile with -Xlint:deprecation for details.
Note: Some input files use unchecked or unsafe operations.
Note: Recompile with -Xlint:unchecked for details.
> Task :sdks:java:extensions:google-cloud-platform-core:compileJava
Note: <https://builds.apache.org/job/beam_PostCommit_Java_ValidatesRunner_Flink/ws/src/sdks/java/extensions/google-cloud-platform-core/src/main/java/org/apache/beam/sdk/extensions/gcp/util/GcsUtil.java> uses or overrides a deprecated API.
Note: Recompile with -Xlint:deprecation for details.
> Task :sdks:java:fn-execution:classes
> Task :vendor:sdks-java-extensions-protobuf:classes
> Task :sdks:java:extensions:google-cloud-platform-core:classes
> Task :sdks:java:fn-execution:jar
> Task :sdks:java:extensions:google-cloud-platform-core:jar
> Task :vendor:sdks-java-extensions-protobuf:shadowJar
> Task :runners:core-construction-java:compileJava
Note: Some input files use or override a deprecated API.
Note: Recompile with -Xlint:deprecation for details.
Note: Some input files use unchecked or unsafe operations.
Note: Recompile with -Xlint:unchecked for details.
> Task :runners:core-construction-java:classes
> Task :runners:core-construction-java:jar
> Task :runners:core-java:compileJava
Note: Some input files use or override a deprecated API.
Note: Recompile with -Xlint:deprecation for details.
Note: Some input files use unchecked or unsafe operations.
Note: Recompile with -Xlint:unchecked for details.
> Task :runners:core-java:classes
> Task :runners:core-java:jar
> Task :sdks:java:harness:compileJava
Note: Some input files use or override a deprecated API.
Note: Recompile with -Xlint:deprecation for details.
Note: Some input files use unchecked or unsafe operations.
Note: Recompile with -Xlint:unchecked for details.
> Task :sdks:java:harness:classes
> Task :sdks:java:harness:jar
> Task :sdks:java:core:compileTestJava
Note: Some input files use or override a deprecated API.
Note: Recompile with -Xlint:deprecation for details.
Note: Some input files use unchecked or unsafe operations.
Note: Recompile with -Xlint:unchecked for details.
> Task :sdks:java:core:testClasses
> Task :sdks:java:core:shadowTestJar
> Task :sdks:java:harness:shadowJar
> Task :runners:core-java:compileTestJava
Note: Some input files use or override a deprecated API.
Note: Recompile with -Xlint:deprecation for details.
Note: Some input files use unchecked or unsafe operations.
Note: Recompile with -Xlint:unchecked for details.
> Task :runners:core-java:testClasses
> Task :runners:core-java:testJar
> Task :runners:java-fn-execution:compileJava
Note: Some input files use or override a deprecated API.
Note: Recompile with -Xlint:deprecation for details.
Note: Some input files use unchecked or unsafe operations.
Note: Recompile with -Xlint:unchecked for details.
> Task :runners:java-fn-execution:classes
> Task :runners:java-fn-execution:jar
> Task :runners:flink:1.9:compileJava
Note: Some input files use or override a deprecated API.
Note: Recompile with -Xlint:deprecation for details.
Note: Some input files use unchecked or unsafe operations.
Note: Recompile with -Xlint:unchecked for details.
> Task :runners:flink:1.9:classes
> Task :runners:flink:1.9:jar
> Task :runners:flink:1.9:validatesRunnerBatch
org.apache.beam.sdk.transforms.ParDoTest$TimerFamilyTests > testTimerWithMultipleTimerFamilyUnbounded FAILED
org.apache.beam.sdk.Pipeline$PipelineExecutionException at ParDoTest.java:4713
Caused by: java.lang.IllegalArgumentException at ParDoTest.java:4713
org.apache.beam.sdk.transforms.ParDoTest$TimerFamilyTests > testTimerFamilyAndTimerUnbounded FAILED
org.apache.beam.sdk.Pipeline$PipelineExecutionException at ParDoTest.java:4769
Caused by: java.lang.IllegalArgumentException at ParDoTest.java:4769
org.apache.beam.sdk.transforms.ParDoTest$TimerFamilyTests > testTimerFamilyEventTimeUnbounded FAILED
org.apache.beam.sdk.Pipeline$PipelineExecutionException at ParDoTest.java:4656
Caused by: java.lang.IllegalArgumentException at ParDoTest.java:4656
243 tests completed, 3 failed, 2 skipped
> Task :runners:flink:1.9:validatesRunnerBatch FAILED
> Task :runners:flink:1.9:validatesRunnerStreaming
FAILURE: Build failed with an exception.
* What went wrong:
Execution failed for task ':runners:flink:1.9:validatesRunnerBatch'.
> There were failing tests. See the report at: file://<https://builds.apache.org/job/beam_PostCommit_Java_ValidatesRunner_Flink/ws/src/runners/flink/1.9/build/reports/tests/validatesRunnerBatch/index.html>
* Try:
Run with --stacktrace option to get the stack trace. Run with --info or --debug option to get more log output. Run with --scan to get full insights.
* Get more help at https://help.gradle.org
Deprecated Gradle features were used in this build, making it incompatible with Gradle 6.0.
Use '--warning-mode all' to show the individual deprecation warnings.
See https://docs.gradle.org/5.2.1/userguide/command_line_interface.html#sec:command_line_warnings
BUILD FAILED in 6m 34s
53 actionable tasks: 48 executed, 5 from cache
Publishing build scan...
https://gradle.com/s/f5gn2ixywtvxm
Build step 'Invoke Gradle script' changed build result to FAILURE
Build step 'Invoke Gradle script' marked build as failure
---------------------------------------------------------------------
To unsubscribe, e-mail: builds-unsubscribe@beam.apache.org
For additional commands, e-mail: builds-help@beam.apache.org