You are viewing a plain text version of this content. The canonical link for it is here.
Posted to builds@solr.apache.org by Apache Jenkins Server <je...@builds.apache.org> on 2023/11/16 13:17:07 UTC
[JENKINS] Solr » Solr-Check-main - Build # 8382 - Failure!
Build: https://ci-builds.apache.org/job/Solr/job/Solr-Check-main/8382/
All tests passed
Build Log:
[...truncated 1228 lines...]
# ERROR: IOException occurred when talking to server at: https://localhost:38297/solr/test/select
#
# org.apache.solr.client.solrj.SolrServerException: IOException occurred when talking to server at: https://localhost:38297/solr/test/select
# at org.apache.solr.client.solrj.impl.Http2SolrClient.request(Http2SolrClient.java:550)
# at org.apache.solr.client.solrj.SolrClient.request(SolrClient.java:1193)
# at org.apache.solr.cli.ApiTool.callGet(ApiTool.java:97)
# at org.apache.solr.cli.ApiTool.runImpl(ApiTool.java:69)
# at org.apache.solr.cli.ToolBase.runTool(ToolBase.java:52)
# at org.apache.solr.cli.SolrCLI.main(SolrCLI.java:161)
# Caused by: java.nio.channels.ClosedChannelException
# at org.eclipse.jetty.http2.HTTP2Session$StreamsState.onShutdown(HTTP2Session.java:1865)
# at org.eclipse.jetty.http2.HTTP2Session.onShutdown(HTTP2Session.java:1036)
# at org.eclipse.jetty.http2.HTTP2Connection$HTTP2Producer.produce(HTTP2Connection.java:385)
# at org.eclipse.jetty.util.thread.strategy.AdaptiveExecutionStrategy.produceTask(AdaptiveExecutionStrategy.java:455)
# at org.eclipse.jetty.util.thread.strategy.AdaptiveExecutionStrategy.tryProduce(AdaptiveExecutionStrategy.java:248)
# at org.eclipse.jetty.util.thread.strategy.AdaptiveExecutionStrategy.produce(AdaptiveExecutionStrategy.java:193)
# at org.eclipse.jetty.http2.HTTP2Connection.produce(HTTP2Connection.java:208)
# at org.eclipse.jetty.http2.client.HTTP2ClientConnectionFactory$HTTP2ClientConnection.succeeded(HTTP2ClientConnectionFactory.java:174)
# at org.eclipse.jetty.util.Callback$Nested.succeeded(Callback.java:392)
# at org.eclipse.jetty.util.CountingCallback.succeeded(CountingCallback.java:63)
# at org.eclipse.jetty.util.Callback$Nested.succeeded(Callback.java:392)
# at org.eclipse.jetty.http2.HTTP2Session$ControlEntry.succeeded(HTTP2Session.java:1377)
# at java.base/java.util.ArrayList.forEach(ArrayList.java:1541)
# at org.eclipse.jetty.http2.HTTP2Flusher.finish(HTTP2Flusher.java:323)
# at org.eclipse.jetty.http2.HTTP2Flusher.succeeded(HTTP2Flusher.java:315)
# at org.eclipse.jetty.io.WriteFlusher.write(WriteFlusher.java:291)
# at org.eclipse.jetty.io.WriteFlusher.write(WriteFlusher.java:254)
# at org.eclipse.jetty.io.AbstractEndPoint.write(AbstractEndPoint.java:386)
# at org.eclipse.jetty.http2.HTTP2Flusher.process(HTTP2Flusher.java:292)
# at org.eclipse.jetty.util.IteratingCallback.processing(IteratingCallback.java:243)
# at org.eclipse.jetty.util.IteratingCallback.iterate(IteratingCallback.java:224)
# at org.eclipse.jetty.http2.HTTP2Session.frame(HTTP2Session.java:821)
# at org.eclipse.jetty.http2.HTTP2Session.frames(HTTP2Session.java:793)
# at org.eclipse.jetty.http2.client.HTTP2ClientConnectionFactory$HTTP2ClientConnection.onOpen(HTTP2ClientConnectionFactory.java:161)
# at org.eclipse.jetty.io.AbstractEndPoint.upgrade(AbstractEndPoint.java:451)
# at org.eclipse.jetty.io.NegotiatingClientConnection.replaceConnection(NegotiatingClientConnection.java:117)
# at org.eclipse.jetty.io.NegotiatingClientConnection.onFillable(NegotiatingClientConnection.java:87)
# at org.eclipse.jetty.io.AbstractConnection$ReadCallback.succeeded(AbstractConnection.java:314)
# at org.eclipse.jetty.io.FillInterest.fillable(FillInterest.java:100)
# at org.eclipse.jetty.io.ssl.SslConnection$DecryptedEndPoint.onFillable(SslConnection.java:558)
# at org.eclipse.jetty.io.ssl.SslConnection.onFillable(SslConnection.java:379)
# at org.eclipse.jetty.io.ssl.SslConnection$2.succeeded(SslConnection.java:146)
# at org.eclipse.jetty.io.FillInterest.fillable(FillInterest.java:100)
# at org.eclipse.jetty.io.SelectableChannelEndPoint$1.run(SelectableChannelEndPoint.java:53)
# at org.apache.solr.common.util.ExecutorUtil$MDCAwareThreadPoolExecutor.lambda$execute$0(ExecutorUtil.java:294)
# at java.base/java.util.concurrent.ThreadPoolExecutor.runWorker(ThreadPoolExecutor.java:1128)
# at java.base/java.util.concurrent.ThreadPoolExecutor$Worker.run(ThreadPoolExecutor.java:628)
# at java.base/java.lang.Thread.run(Thread.java:829)
# --
#
# Please find the SOLR_HOME snapshot for failed test #5 at: /home/jenkins/jenkins-slave/workspace/Solr/Solr-Check-main/solr/packaging/build/test-output/failure-snapshots/75-5
# Last output:
# INFO - 2023-11-16 13:14:51.733; org.apache.solr.util.configuration.SSLConfigurations; Setting javax.net.ssl.keyStorePassword
# INFO - 2023-11-16 13:14:51.738; org.apache.solr.util.configuration.SSLConfigurations; Setting javax.net.ssl.trustStorePassword
# WARNING: URLs provided to this tool needn't include Solr's context-root (e.g. "/solr"). Such URLs are deprecated and support for them will be removed in a future release. Correcting from [https://localhost:38298/solr] to [https://localhost:38298].
# WARN - 2023-11-16 13:14:52.725; org.apache.solr.common.cloud.SolrZkClient; Using default ZkCredentialsInjector. ZkCredentialsInjector is not secure, it creates an empty list of credentials which leads to 'OPEN_ACL_UNSAFE' ACLs to Zookeeper nodes
# WARN - 2023-11-16 13:14:52.769; org.apache.solr.common.cloud.SolrZkClient; Using default ZkACLProvider. DefaultZkACLProvider is not secure, it creates 'OPEN_ACL_UNSAFE' ACLs to Zookeeper nodes
ok 76 start solr with mTLS wanted in 47600ms
ok 77 SOLR-11740 check 'solr stop' connection in 15517ms
ok 78 stop command for single port in 17783ms
ok 79 status detects locally running solr in 9236ms
ok 80 status shell script ignores passed in -solrUrl cli parameter from user in 7324ms
ok 81 status help flag outputs message highlighting not to use solrUrl. in 1046ms
ok 82 listing out files in 2846ms
ok 83 copying files around in 6728ms
ok 84 upconfig in 2714ms
ok 85 zkcli.sh gets 'solrhome' from 'solr.home' system property in 1237ms
ok 86 zkcli.sh gets 'solrhome' from 'solrhome' command line option in 1256ms
ok 87 Cleanup in 2064ms
> Task :solr:packaging:integrationTests FAILED
FAILURE: Build failed with an exception.
* Where:
Build file '/home/jenkins/jenkins-slave/workspace/Solr/Solr-Check-main/solr/packaging/build.gradle' line: 301
* What went wrong:
Execution failed for task ':solr:packaging:integrationTests'.
> Process 'command '/home/jenkins/jenkins-slave/workspace/Solr/Solr-Check-main/.gradle/node/packaging/node_modules/bats/bin/bats'' finished with non-zero exit value 1
* Try:
> Run with --stacktrace option to get the stack trace.
> Run with --info or --debug option to get more log output.
> Get more help at https://help.gradle.org.
Deprecated Gradle features were used in this build, making it incompatible with Gradle 9.0.
You can use '--warning-mode all' to show the individual deprecation warnings and determine if they come from your own scripts or plugins.
For more on this, please refer to https://docs.gradle.org/8.4/userguide/command_line_interface.html#sec:command_line_warnings in the Gradle documentation.
BUILD FAILED in 1h 5m 39s
632 actionable tasks: 632 executed
Publishing build scan...
https://ge.apache.org/s/ykkfkq3p6xyu2
Build step 'Invoke Gradle script' changed build result to FAILURE
Build step 'Invoke Gradle script' marked build as failure
Archiving artifacts
Recording test results
[Checks API] No suitable checks publisher found.
Email was triggered for: Failure - Any
Sending email for trigger: Failure - Any
[JENKINS] Solr » Solr-Check-main - Build # 8384 - Failure!
Posted by Apache Jenkins Server <je...@builds.apache.org>.
Build: https://ci-builds.apache.org/job/Solr/job/Solr-Check-main/8384/
All tests passed
Build Log:
[...truncated 1298 lines...]
# ERROR: IOException occurred when talking to server at: https://localhost:39737/solr/test/select
#
# org.apache.solr.client.solrj.SolrServerException: IOException occurred when talking to server at: https://localhost:39737/solr/test/select
# at org.apache.solr.client.solrj.impl.Http2SolrClient.request(Http2SolrClient.java:550)
# at org.apache.solr.client.solrj.SolrClient.request(SolrClient.java:1193)
# at org.apache.solr.cli.ApiTool.callGet(ApiTool.java:97)
# at org.apache.solr.cli.ApiTool.runImpl(ApiTool.java:69)
# at org.apache.solr.cli.ToolBase.runTool(ToolBase.java:52)
# at org.apache.solr.cli.SolrCLI.main(SolrCLI.java:161)
# Caused by: java.nio.channels.ClosedChannelException
# at org.eclipse.jetty.http2.HTTP2Session$StreamsState.onShutdown(HTTP2Session.java:1865)
# at org.eclipse.jetty.http2.HTTP2Session.onShutdown(HTTP2Session.java:1036)
# at org.eclipse.jetty.http2.HTTP2Connection$HTTP2Producer.produce(HTTP2Connection.java:385)
# at org.eclipse.jetty.util.thread.strategy.AdaptiveExecutionStrategy.produceTask(AdaptiveExecutionStrategy.java:455)
# at org.eclipse.jetty.util.thread.strategy.AdaptiveExecutionStrategy.tryProduce(AdaptiveExecutionStrategy.java:248)
# at org.eclipse.jetty.util.thread.strategy.AdaptiveExecutionStrategy.produce(AdaptiveExecutionStrategy.java:193)
# at org.eclipse.jetty.http2.HTTP2Connection.produce(HTTP2Connection.java:208)
# at org.eclipse.jetty.http2.client.HTTP2ClientConnectionFactory$HTTP2ClientConnection.succeeded(HTTP2ClientConnectionFactory.java:174)
# at org.eclipse.jetty.util.Callback$Nested.succeeded(Callback.java:392)
# at org.eclipse.jetty.util.CountingCallback.succeeded(CountingCallback.java:63)
# at org.eclipse.jetty.util.Callback$Nested.succeeded(Callback.java:392)
# at org.eclipse.jetty.http2.HTTP2Session$ControlEntry.succeeded(HTTP2Session.java:1377)
# at java.base/java.util.ArrayList.forEach(ArrayList.java:1541)
# at org.eclipse.jetty.http2.HTTP2Flusher.finish(HTTP2Flusher.java:323)
# at org.eclipse.jetty.http2.HTTP2Flusher.succeeded(HTTP2Flusher.java:315)
# at org.eclipse.jetty.io.WriteFlusher.write(WriteFlusher.java:291)
# at org.eclipse.jetty.io.WriteFlusher.write(WriteFlusher.java:254)
# at org.eclipse.jetty.io.AbstractEndPoint.write(AbstractEndPoint.java:386)
# at org.eclipse.jetty.http2.HTTP2Flusher.process(HTTP2Flusher.java:292)
# at org.eclipse.jetty.util.IteratingCallback.processing(IteratingCallback.java:243)
# at org.eclipse.jetty.util.IteratingCallback.iterate(IteratingCallback.java:224)
# at org.eclipse.jetty.http2.HTTP2Session.frame(HTTP2Session.java:821)
# at org.eclipse.jetty.http2.HTTP2Session.frames(HTTP2Session.java:793)
# at org.eclipse.jetty.http2.client.HTTP2ClientConnectionFactory$HTTP2ClientConnection.onOpen(HTTP2ClientConnectionFactory.java:161)
# at org.eclipse.jetty.io.AbstractEndPoint.upgrade(AbstractEndPoint.java:451)
# at org.eclipse.jetty.io.NegotiatingClientConnection.replaceConnection(NegotiatingClientConnection.java:117)
# at org.eclipse.jetty.io.NegotiatingClientConnection.onFillable(NegotiatingClientConnection.java:87)
# at org.eclipse.jetty.io.AbstractConnection$ReadCallback.succeeded(AbstractConnection.java:314)
# at org.eclipse.jetty.io.FillInterest.fillable(FillInterest.java:100)
# at org.eclipse.jetty.io.ssl.SslConnection$DecryptedEndPoint.onFillable(SslConnection.java:558)
# at org.eclipse.jetty.io.ssl.SslConnection.onFillable(SslConnection.java:379)
# at org.eclipse.jetty.io.ssl.SslConnection$2.succeeded(SslConnection.java:146)
# at org.eclipse.jetty.io.FillInterest.fillable(FillInterest.java:100)
# at org.eclipse.jetty.io.SelectableChannelEndPoint$1.run(SelectableChannelEndPoint.java:53)
# at org.apache.solr.common.util.ExecutorUtil$MDCAwareThreadPoolExecutor.lambda$execute$0(ExecutorUtil.java:294)
# at java.base/java.util.concurrent.ThreadPoolExecutor.runWorker(ThreadPoolExecutor.java:1128)
# at java.base/java.util.concurrent.ThreadPoolExecutor$Worker.run(ThreadPoolExecutor.java:628)
# at java.base/java.lang.Thread.run(Thread.java:829)
# --
#
# Please find the SOLR_HOME snapshot for failed test #5 at: /home/jenkins/jenkins-slave/workspace/Solr/Solr-Check-main/solr/packaging/build/test-output/failure-snapshots/75-5
# Last output:
# INFO - 2023-11-16 20:01:13.721; org.apache.solr.util.configuration.SSLConfigurations; Setting javax.net.ssl.keyStorePassword
# INFO - 2023-11-16 20:01:13.726; org.apache.solr.util.configuration.SSLConfigurations; Setting javax.net.ssl.trustStorePassword
# WARNING: URLs provided to this tool needn't include Solr's context-root (e.g. "/solr"). Such URLs are deprecated and support for them will be removed in a future release. Correcting from [https://localhost:39738/solr] to [https://localhost:39738].
# WARN - 2023-11-16 20:01:14.783; org.apache.solr.common.cloud.SolrZkClient; Using default ZkCredentialsInjector. ZkCredentialsInjector is not secure, it creates an empty list of credentials which leads to 'OPEN_ACL_UNSAFE' ACLs to Zookeeper nodes
# WARN - 2023-11-16 20:01:14.825; org.apache.solr.common.cloud.SolrZkClient; Using default ZkACLProvider. DefaultZkACLProvider is not secure, it creates 'OPEN_ACL_UNSAFE' ACLs to Zookeeper nodes
ok 76 start solr with mTLS wanted in 49198ms
ok 77 SOLR-11740 check 'solr stop' connection in 14490ms
ok 78 stop command for single port in 17246ms
ok 79 status detects locally running solr in 9274ms
ok 80 status shell script ignores passed in -solrUrl cli parameter from user in 7528ms
ok 81 status help flag outputs message highlighting not to use solrUrl. in 1082ms
ok 82 listing out files in 2888ms
ok 83 copying files around in 6546ms
ok 84 upconfig in 2582ms
ok 85 zkcli.sh gets 'solrhome' from 'solr.home' system property in 1240ms
ok 86 zkcli.sh gets 'solrhome' from 'solrhome' command line option in 1237ms
ok 87 Cleanup in 2073ms
> Task :solr:packaging:integrationTests FAILED
FAILURE: Build failed with an exception.
* Where:
Build file '/home/jenkins/jenkins-slave/workspace/Solr/Solr-Check-main/solr/packaging/build.gradle' line: 301
* What went wrong:
Execution failed for task ':solr:packaging:integrationTests'.
> Process 'command '/home/jenkins/jenkins-slave/workspace/Solr/Solr-Check-main/.gradle/node/packaging/node_modules/bats/bin/bats'' finished with non-zero exit value 1
* Try:
> Run with --stacktrace option to get the stack trace.
> Run with --info or --debug option to get more log output.
> Get more help at https://help.gradle.org.
Deprecated Gradle features were used in this build, making it incompatible with Gradle 9.0.
You can use '--warning-mode all' to show the individual deprecation warnings and determine if they come from your own scripts or plugins.
For more on this, please refer to https://docs.gradle.org/8.4/userguide/command_line_interface.html#sec:command_line_warnings in the Gradle documentation.
BUILD FAILED in 1h 6m 38s
645 actionable tasks: 645 executed
Publishing build scan...
https://ge.apache.org/s/sn3rov5gx4tic
Build step 'Invoke Gradle script' changed build result to FAILURE
Build step 'Invoke Gradle script' marked build as failure
Archiving artifacts
Recording test results
[Checks API] No suitable checks publisher found.
Email was triggered for: Failure - Any
Sending email for trigger: Failure - Any
[JENKINS] Solr » Solr-Check-main - Build # 8383 - Unstable!
Posted by Apache Jenkins Server <je...@builds.apache.org>.
Build: https://ci-builds.apache.org/job/Solr/job/Solr-Check-main/8383/
1 tests failed.
FAILED: org.apache.solr.cloud.OverseerTest.testShardLeaderChange
Error Message:
com.carrotsearch.randomizedtesting.UncaughtExceptionError: Captured an uncaught exception in thread: Thread[id=7982, name=OverseerCollectionConfigSetProcessor-72171069504028706-127.0.0.1:34449_solr-n_0000000000, state=RUNNABLE, group=Overseer collection creation process.]
Stack Trace:
com.carrotsearch.randomizedtesting.UncaughtExceptionError: Captured an uncaught exception in thread: Thread[id=7982, name=OverseerCollectionConfigSetProcessor-72171069504028706-127.0.0.1:34449_solr-n_0000000000, state=RUNNABLE, group=Overseer collection creation process.]
at __randomizedtesting.SeedInfo.seed([FE3B9C7CD102D3C0:20681B8BCB9A2631]:0)
Caused by: org.apache.solr.common.AlreadyClosedException
at __randomizedtesting.SeedInfo.seed([FE3B9C7CD102D3C0]:0)
at app//org.apache.solr.common.cloud.ZkCmdExecutor.retryOperation(ZkCmdExecutor.java:68)
at app//org.apache.solr.common.cloud.SolrZkClient.getData(SolrZkClient.java:436)
at app//org.apache.solr.cloud.OverseerTaskProcessor.amILeader(OverseerTaskProcessor.java:486)
at app//org.apache.solr.cloud.OverseerTaskProcessor.run(OverseerTaskProcessor.java:171)
at java.base@11.0.16.1/java.lang.Thread.run(Thread.java:829)
Build Log:
[...truncated 30149 lines...]
ERROR: The following test(s) have failed:
- org.apache.solr.cloud.OverseerTest.testShardLeaderChange (:solr:core)
Test output: /home/jenkins/jenkins-slave/workspace/Solr/Solr-Check-main/solr/core/build/test-results/test/outputs/OUTPUT-org.apache.solr.cloud.OverseerTest.txt
Reproduce with: gradlew :solr:core:test --tests "org.apache.solr.cloud.OverseerTest.testShardLeaderChange" -Ptests.jvms=4 -Ptests.haltonfailure=false "-Ptests.jvmargs=-XX:TieredStopAtLevel=1 -XX:+UseParallelGC -XX:ActiveProcessorCount=1 -XX:ReservedCodeCacheSize=120m" -Ptests.seed=FE3B9C7CD102D3C0 -Ptests.multiplier=2 -Ptests.badapples=false -Ptests.file.encoding=UTF-8
Deprecated Gradle features were used in this build, making it incompatible with Gradle 9.0.
You can use '--warning-mode all' to show the individual deprecation warnings and determine if they come from your own scripts or plugins.
For more on this, please refer to https://docs.gradle.org/8.4/userguide/command_line_interface.html#sec:command_line_warnings in the Gradle documentation.
BUILD SUCCESSFUL in 1h 9m 19s
645 actionable tasks: 645 executed
Publishing build scan...
https://ge.apache.org/s/oj4jnebkhixbg
Build step 'Invoke Gradle script' changed build result to SUCCESS
Archiving artifacts
hudson.FilePath$ValidateAntFileMask$1Cancel
at hudson.FilePath$ValidateAntFileMask$1.isCaseSensitive(FilePath.java:3300)
at org.apache.tools.ant.DirectoryScanner.isIncluded(DirectoryScanner.java:1370)
at org.apache.tools.ant.DirectoryScanner.scandir(DirectoryScanner.java:1241)
at org.apache.tools.ant.DirectoryScanner.scandir(DirectoryScanner.java:1267)
at org.apache.tools.ant.DirectoryScanner.scandir(DirectoryScanner.java:1267)
at org.apache.tools.ant.DirectoryScanner.scandir(DirectoryScanner.java:1267)
at org.apache.tools.ant.DirectoryScanner.scandir(DirectoryScanner.java:1267)
at org.apache.tools.ant.DirectoryScanner.scandir(DirectoryScanner.java:1267)
at org.apache.tools.ant.DirectoryScanner.scandir(DirectoryScanner.java:1267)
at org.apache.tools.ant.DirectoryScanner.scandir(DirectoryScanner.java:1194)
at org.apache.tools.ant.DirectoryScanner.scandir(DirectoryScanner.java:1156)
at org.apache.tools.ant.DirectoryScanner.checkIncludePatterns(DirectoryScanner.java:954)
at org.apache.tools.ant.DirectoryScanner.scan(DirectoryScanner.java:912)
at hudson.FilePath$ValidateAntFileMask.hasMatch(FilePath.java:3313)
Caused: hudson.FilePath$FileMaskNoMatchesFoundException: no matches found within 10000
at hudson.FilePath$ValidateAntFileMask.hasMatch(FilePath.java:3318)
at hudson.FilePath$ValidateAntFileMask.invoke(FilePath.java:3196)
at hudson.FilePath$ValidateAntFileMask.invoke(FilePath.java:3174)
at hudson.FilePath$FileCallableWrapper.call(FilePath.java:3578)
Also: hudson.remoting.Channel$CallSiteStackTrace: Remote call to lucene-solr-1
at hudson.remoting.Channel.attachCallSiteStackTrace(Channel.java:1784)
at hudson.remoting.UserRequest$ExceptionResponse.retrieve(UserRequest.java:356)
at hudson.remoting.Channel.call(Channel.java:1000)
at hudson.FilePath.act(FilePath.java:1192)
at hudson.FilePath.act(FilePath.java:1181)
at hudson.FilePath.validateAntFileMask(FilePath.java:3171)
at hudson.tasks.ArtifactArchiver.perform(ArtifactArchiver.java:271)
at hudson.tasks.BuildStepCompatibilityLayer.perform(BuildStepCompatibilityLayer.java:80)
at hudson.tasks.BuildStepMonitor$1.perform(BuildStepMonitor.java:20)
at hudson.model.AbstractBuild$AbstractBuildExecution.perform(AbstractBuild.java:818)
at hudson.model.AbstractBuild$AbstractBuildExecution.performAllBuildSteps(AbstractBuild.java:767)
at hudson.model.Build$BuildExecution.post2(Build.java:179)
at hudson.model.AbstractBuild$AbstractBuildExecution.post(AbstractBuild.java:711)
at hudson.model.Run.execute(Run.java:1925)
at hudson.model.FreeStyleBuild.run(FreeStyleBuild.java:44)
at hudson.model.ResourceController.execute(ResourceController.java:101)
at hudson.model.Executor.run(Executor.java:442)
Caused: hudson.FilePath$TunneledInterruptedException
at hudson.FilePath$FileCallableWrapper.call(FilePath.java:3580)
at hudson.remoting.UserRequest.perform(UserRequest.java:211)
at hudson.remoting.UserRequest.perform(UserRequest.java:54)
at hudson.remoting.Request$2.run(Request.java:377)
at hudson.remoting.InterceptingExecutorService.lambda$wrap$0(InterceptingExecutorService.java:78)
at java.base/java.util.concurrent.FutureTask.run(FutureTask.java:264)
at java.base/java.util.concurrent.ThreadPoolExecutor.runWorker(ThreadPoolExecutor.java:1128)
at java.base/java.util.concurrent.ThreadPoolExecutor$Worker.run(ThreadPoolExecutor.java:628)
at java.base/java.lang.Thread.run(Thread.java:829)
Caused: java.lang.InterruptedException: hudson.FilePath$FileMaskNoMatchesFoundException: no matches found within 10000
at hudson.FilePath.act(FilePath.java:1194)
at hudson.FilePath.act(FilePath.java:1181)
at hudson.FilePath.validateAntFileMask(FilePath.java:3171)
at hudson.tasks.ArtifactArchiver.perform(ArtifactArchiver.java:271)
at hudson.tasks.BuildStepCompatibilityLayer.perform(BuildStepCompatibilityLayer.java:80)
at hudson.tasks.BuildStepMonitor$1.perform(BuildStepMonitor.java:20)
at hudson.model.AbstractBuild$AbstractBuildExecution.perform(AbstractBuild.java:818)
at hudson.model.AbstractBuild$AbstractBuildExecution.performAllBuildSteps(AbstractBuild.java:767)
at hudson.model.Build$BuildExecution.post2(Build.java:179)
at hudson.model.AbstractBuild$AbstractBuildExecution.post(AbstractBuild.java:711)
at hudson.model.Run.execute(Run.java:1925)
at hudson.model.FreeStyleBuild.run(FreeStyleBuild.java:44)
at hudson.model.ResourceController.execute(ResourceController.java:101)
at hudson.model.Executor.run(Executor.java:442)
No artifacts found that match the file pattern "**/*.events,heapdumps/**,**/hs_err_pid*". Configuration error?
Recording test results
[Checks API] No suitable checks publisher found.
Build step 'Publish JUnit test result report' changed build result to UNSTABLE
Email was triggered for: Unstable (Test Failures)
Sending email for trigger: Unstable (Test Failures)