You are viewing a plain text version of this content. The canonical link for it is here.
Posted to builds@lucene.apache.org by Apache Jenkins Server <je...@builds.apache.org> on 2019/10/09 23:08:20 UTC
[JENKINS] Lucene-Solr-Tests-8.x - Build # 700 - Failure
Build: https://builds.apache.org/job/Lucene-Solr-Tests-8.x/700/
All tests passed
Build Log:
[...truncated 12241 lines...]
[javac] Compiling 735 source files to /home/jenkins/jenkins-slave/workspace/Lucene-Solr-Tests-8.x/solr/build/solr-solrj/classes/java
[javac] /home/jenkins/jenkins-slave/workspace/Lucene-Solr-Tests-8.x/solr/solrj/src/java/org/apache/solr/client/solrj/impl/ConcurrentUpdateHttp2SolrClient.java:298: error: <identifier> expected
[javac] try (is) {
[javac] ^
[javac] /home/jenkins/jenkins-slave/workspace/Lucene-Solr-Tests-8.x/solr/solrj/src/java/org/apache/solr/client/solrj/impl/ConcurrentUpdateHttp2SolrClient.java:298: error: ')' expected
[javac] try (is) {
[javac] ^
[javac] /home/jenkins/jenkins-slave/workspace/Lucene-Solr-Tests-8.x/solr/solrj/src/java/org/apache/solr/client/solrj/impl/ConcurrentUpdateHttp2SolrClient.java:298: error: '{' expected
[javac] try (is) {
[javac] ^
[javac] /home/jenkins/jenkins-slave/workspace/Lucene-Solr-Tests-8.x/solr/solrj/src/java/org/apache/solr/client/solrj/impl/ConcurrentUpdateHttp2SolrClient.java:300: error: illegal start of expression
[javac] is.skip(is.available());
[javac] ^
[javac] /home/jenkins/jenkins-slave/workspace/Lucene-Solr-Tests-8.x/solr/solrj/src/java/org/apache/solr/client/solrj/impl/ConcurrentUpdateHttp2SolrClient.java:300: error: ';' expected
[javac] is.skip(is.available());
[javac] ^
[javac] /home/jenkins/jenkins-slave/workspace/Lucene-Solr-Tests-8.x/solr/solrj/src/java/org/apache/solr/client/solrj/impl/ConcurrentUpdateHttp2SolrClient.java:300: error: ';' expected
[javac] is.skip(is.available());
[javac] ^
[javac] 6 errors
BUILD FAILED
/home/jenkins/jenkins-slave/workspace/Lucene-Solr-Tests-8.x/build.xml:634: The following error occurred while executing this line:
/home/jenkins/jenkins-slave/workspace/Lucene-Solr-Tests-8.x/build.xml:578: The following error occurred while executing this line:
/home/jenkins/jenkins-slave/workspace/Lucene-Solr-Tests-8.x/build.xml:59: The following error occurred while executing this line:
/home/jenkins/jenkins-slave/workspace/Lucene-Solr-Tests-8.x/solr/build.xml:231: The following error occurred while executing this line:
/home/jenkins/jenkins-slave/workspace/Lucene-Solr-Tests-8.x/solr/common-build.xml:558: The following error occurred while executing this line:
/home/jenkins/jenkins-slave/workspace/Lucene-Solr-Tests-8.x/solr/common-build.xml:506: The following error occurred while executing this line:
/home/jenkins/jenkins-slave/workspace/Lucene-Solr-Tests-8.x/solr/common-build.xml:401: The following error occurred while executing this line:
/home/jenkins/jenkins-slave/workspace/Lucene-Solr-Tests-8.x/solr/common-build.xml:421: The following error occurred while executing this line:
/home/jenkins/jenkins-slave/workspace/Lucene-Solr-Tests-8.x/lucene/common-build.xml:576: The following error occurred while executing this line:
/home/jenkins/jenkins-slave/workspace/Lucene-Solr-Tests-8.x/lucene/common-build.xml:2074: Compile failed; see the compiler error output for details.
Total time: 41 minutes 33 seconds
Build step 'Invoke Ant' marked build as failure
Archiving artifacts
Recording test results
Email was triggered for: Failure - Any
Sending email for trigger: Failure - Any
[JENKINS] Lucene-Solr-Tests-8.x - Build # 704 - Still Failing
Posted by Apache Jenkins Server <je...@builds.apache.org>.
Build: https://builds.apache.org/job/Lucene-Solr-Tests-8.x/704/
All tests passed
Build Log:
[...truncated 12274 lines...]
[javac] Compiling 735 source files to /home/jenkins/jenkins-slave/workspace/Lucene-Solr-Tests-8.x/solr/build/solr-solrj/classes/java
[javac] /home/jenkins/jenkins-slave/workspace/Lucene-Solr-Tests-8.x/solr/solrj/src/java/org/apache/solr/client/solrj/impl/ConcurrentUpdateHttp2SolrClient.java:298: error: <identifier> expected
[javac] try (is) {
[javac] ^
[javac] /home/jenkins/jenkins-slave/workspace/Lucene-Solr-Tests-8.x/solr/solrj/src/java/org/apache/solr/client/solrj/impl/ConcurrentUpdateHttp2SolrClient.java:298: error: ')' expected
[javac] try (is) {
[javac] ^
[javac] /home/jenkins/jenkins-slave/workspace/Lucene-Solr-Tests-8.x/solr/solrj/src/java/org/apache/solr/client/solrj/impl/ConcurrentUpdateHttp2SolrClient.java:298: error: '{' expected
[javac] try (is) {
[javac] ^
[javac] /home/jenkins/jenkins-slave/workspace/Lucene-Solr-Tests-8.x/solr/solrj/src/java/org/apache/solr/client/solrj/impl/ConcurrentUpdateHttp2SolrClient.java:300: error: illegal start of expression
[javac] is.skip(is.available());
[javac] ^
[javac] /home/jenkins/jenkins-slave/workspace/Lucene-Solr-Tests-8.x/solr/solrj/src/java/org/apache/solr/client/solrj/impl/ConcurrentUpdateHttp2SolrClient.java:300: error: ';' expected
[javac] is.skip(is.available());
[javac] ^
[javac] /home/jenkins/jenkins-slave/workspace/Lucene-Solr-Tests-8.x/solr/solrj/src/java/org/apache/solr/client/solrj/impl/ConcurrentUpdateHttp2SolrClient.java:300: error: ';' expected
[javac] is.skip(is.available());
[javac] ^
[javac] 6 errors
BUILD FAILED
/home/jenkins/jenkins-slave/workspace/Lucene-Solr-Tests-8.x/build.xml:634: The following error occurred while executing this line:
/home/jenkins/jenkins-slave/workspace/Lucene-Solr-Tests-8.x/build.xml:578: The following error occurred while executing this line:
/home/jenkins/jenkins-slave/workspace/Lucene-Solr-Tests-8.x/build.xml:59: The following error occurred while executing this line:
/home/jenkins/jenkins-slave/workspace/Lucene-Solr-Tests-8.x/solr/build.xml:231: The following error occurred while executing this line:
/home/jenkins/jenkins-slave/workspace/Lucene-Solr-Tests-8.x/solr/common-build.xml:558: The following error occurred while executing this line:
/home/jenkins/jenkins-slave/workspace/Lucene-Solr-Tests-8.x/solr/common-build.xml:506: The following error occurred while executing this line:
/home/jenkins/jenkins-slave/workspace/Lucene-Solr-Tests-8.x/solr/common-build.xml:401: The following error occurred while executing this line:
/home/jenkins/jenkins-slave/workspace/Lucene-Solr-Tests-8.x/solr/common-build.xml:421: The following error occurred while executing this line:
/home/jenkins/jenkins-slave/workspace/Lucene-Solr-Tests-8.x/lucene/common-build.xml:576: The following error occurred while executing this line:
/home/jenkins/jenkins-slave/workspace/Lucene-Solr-Tests-8.x/lucene/common-build.xml:2074: Compile failed; see the compiler error output for details.
Total time: 82 minutes 36 seconds
Build step 'Invoke Ant' marked build as failure
Archiving artifacts
Recording test results
Email was triggered for: Failure - Any
Sending email for trigger: Failure - Any
[JENKINS] Lucene-Solr-Tests-8.x - Build # 703 - Still Failing
Posted by Apache Jenkins Server <je...@builds.apache.org>.
Build: https://builds.apache.org/job/Lucene-Solr-Tests-8.x/703/
All tests passed
Build Log:
[...truncated 12249 lines...]
[javac] Compiling 735 source files to /home/jenkins/jenkins-slave/workspace/Lucene-Solr-Tests-8.x/solr/build/solr-solrj/classes/java
[javac] /home/jenkins/jenkins-slave/workspace/Lucene-Solr-Tests-8.x/solr/solrj/src/java/org/apache/solr/client/solrj/impl/ConcurrentUpdateHttp2SolrClient.java:298: error: <identifier> expected
[javac] try (is) {
[javac] ^
[javac] /home/jenkins/jenkins-slave/workspace/Lucene-Solr-Tests-8.x/solr/solrj/src/java/org/apache/solr/client/solrj/impl/ConcurrentUpdateHttp2SolrClient.java:298: error: ')' expected
[javac] try (is) {
[javac] ^
[javac] /home/jenkins/jenkins-slave/workspace/Lucene-Solr-Tests-8.x/solr/solrj/src/java/org/apache/solr/client/solrj/impl/ConcurrentUpdateHttp2SolrClient.java:298: error: '{' expected
[javac] try (is) {
[javac] ^
[javac] /home/jenkins/jenkins-slave/workspace/Lucene-Solr-Tests-8.x/solr/solrj/src/java/org/apache/solr/client/solrj/impl/ConcurrentUpdateHttp2SolrClient.java:300: error: illegal start of expression
[javac] is.skip(is.available());
[javac] ^
[javac] /home/jenkins/jenkins-slave/workspace/Lucene-Solr-Tests-8.x/solr/solrj/src/java/org/apache/solr/client/solrj/impl/ConcurrentUpdateHttp2SolrClient.java:300: error: ';' expected
[javac] is.skip(is.available());
[javac] ^
[javac] /home/jenkins/jenkins-slave/workspace/Lucene-Solr-Tests-8.x/solr/solrj/src/java/org/apache/solr/client/solrj/impl/ConcurrentUpdateHttp2SolrClient.java:300: error: ';' expected
[javac] is.skip(is.available());
[javac] ^
[javac] 6 errors
BUILD FAILED
/home/jenkins/jenkins-slave/workspace/Lucene-Solr-Tests-8.x/build.xml:634: The following error occurred while executing this line:
/home/jenkins/jenkins-slave/workspace/Lucene-Solr-Tests-8.x/build.xml:578: The following error occurred while executing this line:
/home/jenkins/jenkins-slave/workspace/Lucene-Solr-Tests-8.x/build.xml:59: The following error occurred while executing this line:
/home/jenkins/jenkins-slave/workspace/Lucene-Solr-Tests-8.x/solr/build.xml:231: The following error occurred while executing this line:
/home/jenkins/jenkins-slave/workspace/Lucene-Solr-Tests-8.x/solr/common-build.xml:558: The following error occurred while executing this line:
/home/jenkins/jenkins-slave/workspace/Lucene-Solr-Tests-8.x/solr/common-build.xml:506: The following error occurred while executing this line:
/home/jenkins/jenkins-slave/workspace/Lucene-Solr-Tests-8.x/solr/common-build.xml:401: The following error occurred while executing this line:
/home/jenkins/jenkins-slave/workspace/Lucene-Solr-Tests-8.x/solr/common-build.xml:421: The following error occurred while executing this line:
/home/jenkins/jenkins-slave/workspace/Lucene-Solr-Tests-8.x/lucene/common-build.xml:576: The following error occurred while executing this line:
/home/jenkins/jenkins-slave/workspace/Lucene-Solr-Tests-8.x/lucene/common-build.xml:2074: Compile failed; see the compiler error output for details.
Total time: 40 minutes 54 seconds
Build step 'Invoke Ant' marked build as failure
Archiving artifacts
Recording test results
Email was triggered for: Failure - Any
Sending email for trigger: Failure - Any
[JENKINS] Lucene-Solr-Tests-8.x - Build # 702 - Still Failing
Posted by Apache Jenkins Server <je...@builds.apache.org>.
Build: https://builds.apache.org/job/Lucene-Solr-Tests-8.x/702/
All tests passed
Build Log:
[...truncated 12273 lines...]
[javac] Compiling 735 source files to /home/jenkins/jenkins-slave/workspace/Lucene-Solr-Tests-8.x/solr/build/solr-solrj/classes/java
[javac] /home/jenkins/jenkins-slave/workspace/Lucene-Solr-Tests-8.x/solr/solrj/src/java/org/apache/solr/client/solrj/impl/ConcurrentUpdateHttp2SolrClient.java:298: error: <identifier> expected
[javac] try (is) {
[javac] ^
[javac] /home/jenkins/jenkins-slave/workspace/Lucene-Solr-Tests-8.x/solr/solrj/src/java/org/apache/solr/client/solrj/impl/ConcurrentUpdateHttp2SolrClient.java:298: error: ')' expected
[javac] try (is) {
[javac] ^
[javac] /home/jenkins/jenkins-slave/workspace/Lucene-Solr-Tests-8.x/solr/solrj/src/java/org/apache/solr/client/solrj/impl/ConcurrentUpdateHttp2SolrClient.java:298: error: '{' expected
[javac] try (is) {
[javac] ^
[javac] /home/jenkins/jenkins-slave/workspace/Lucene-Solr-Tests-8.x/solr/solrj/src/java/org/apache/solr/client/solrj/impl/ConcurrentUpdateHttp2SolrClient.java:300: error: illegal start of expression
[javac] is.skip(is.available());
[javac] ^
[javac] /home/jenkins/jenkins-slave/workspace/Lucene-Solr-Tests-8.x/solr/solrj/src/java/org/apache/solr/client/solrj/impl/ConcurrentUpdateHttp2SolrClient.java:300: error: ';' expected
[javac] is.skip(is.available());
[javac] ^
[javac] /home/jenkins/jenkins-slave/workspace/Lucene-Solr-Tests-8.x/solr/solrj/src/java/org/apache/solr/client/solrj/impl/ConcurrentUpdateHttp2SolrClient.java:300: error: ';' expected
[javac] is.skip(is.available());
[javac] ^
[javac] 6 errors
BUILD FAILED
/home/jenkins/jenkins-slave/workspace/Lucene-Solr-Tests-8.x/build.xml:634: The following error occurred while executing this line:
/home/jenkins/jenkins-slave/workspace/Lucene-Solr-Tests-8.x/build.xml:578: The following error occurred while executing this line:
/home/jenkins/jenkins-slave/workspace/Lucene-Solr-Tests-8.x/build.xml:59: The following error occurred while executing this line:
/home/jenkins/jenkins-slave/workspace/Lucene-Solr-Tests-8.x/solr/build.xml:231: The following error occurred while executing this line:
/home/jenkins/jenkins-slave/workspace/Lucene-Solr-Tests-8.x/solr/common-build.xml:558: The following error occurred while executing this line:
/home/jenkins/jenkins-slave/workspace/Lucene-Solr-Tests-8.x/solr/common-build.xml:506: The following error occurred while executing this line:
/home/jenkins/jenkins-slave/workspace/Lucene-Solr-Tests-8.x/solr/common-build.xml:401: The following error occurred while executing this line:
/home/jenkins/jenkins-slave/workspace/Lucene-Solr-Tests-8.x/solr/common-build.xml:421: The following error occurred while executing this line:
/home/jenkins/jenkins-slave/workspace/Lucene-Solr-Tests-8.x/lucene/common-build.xml:576: The following error occurred while executing this line:
/home/jenkins/jenkins-slave/workspace/Lucene-Solr-Tests-8.x/lucene/common-build.xml:2074: Compile failed; see the compiler error output for details.
Total time: 82 minutes 10 seconds
Build step 'Invoke Ant' marked build as failure
Archiving artifacts
Recording test results
Email was triggered for: Failure - Any
Sending email for trigger: Failure - Any
[JENKINS] Lucene-Solr-Tests-8.x - Build # 701 - Still Failing
Posted by Apache Jenkins Server <je...@builds.apache.org>.
Build: https://builds.apache.org/job/Lucene-Solr-Tests-8.x/701/
All tests passed
Build Log:
[...truncated 12241 lines...]
[javac] Compiling 735 source files to /home/jenkins/jenkins-slave/workspace/Lucene-Solr-Tests-8.x/solr/build/solr-solrj/classes/java
[javac] /home/jenkins/jenkins-slave/workspace/Lucene-Solr-Tests-8.x/solr/solrj/src/java/org/apache/solr/client/solrj/impl/ConcurrentUpdateHttp2SolrClient.java:298: error: <identifier> expected
[javac] try (is) {
[javac] ^
[javac] /home/jenkins/jenkins-slave/workspace/Lucene-Solr-Tests-8.x/solr/solrj/src/java/org/apache/solr/client/solrj/impl/ConcurrentUpdateHttp2SolrClient.java:298: error: ')' expected
[javac] try (is) {
[javac] ^
[javac] /home/jenkins/jenkins-slave/workspace/Lucene-Solr-Tests-8.x/solr/solrj/src/java/org/apache/solr/client/solrj/impl/ConcurrentUpdateHttp2SolrClient.java:298: error: '{' expected
[javac] try (is) {
[javac] ^
[javac] /home/jenkins/jenkins-slave/workspace/Lucene-Solr-Tests-8.x/solr/solrj/src/java/org/apache/solr/client/solrj/impl/ConcurrentUpdateHttp2SolrClient.java:300: error: illegal start of expression
[javac] is.skip(is.available());
[javac] ^
[javac] /home/jenkins/jenkins-slave/workspace/Lucene-Solr-Tests-8.x/solr/solrj/src/java/org/apache/solr/client/solrj/impl/ConcurrentUpdateHttp2SolrClient.java:300: error: ';' expected
[javac] is.skip(is.available());
[javac] ^
[javac] /home/jenkins/jenkins-slave/workspace/Lucene-Solr-Tests-8.x/solr/solrj/src/java/org/apache/solr/client/solrj/impl/ConcurrentUpdateHttp2SolrClient.java:300: error: ';' expected
[javac] is.skip(is.available());
[javac] ^
[javac] 6 errors
BUILD FAILED
/home/jenkins/jenkins-slave/workspace/Lucene-Solr-Tests-8.x/build.xml:634: The following error occurred while executing this line:
/home/jenkins/jenkins-slave/workspace/Lucene-Solr-Tests-8.x/build.xml:578: The following error occurred while executing this line:
/home/jenkins/jenkins-slave/workspace/Lucene-Solr-Tests-8.x/build.xml:59: The following error occurred while executing this line:
/home/jenkins/jenkins-slave/workspace/Lucene-Solr-Tests-8.x/solr/build.xml:231: The following error occurred while executing this line:
/home/jenkins/jenkins-slave/workspace/Lucene-Solr-Tests-8.x/solr/common-build.xml:558: The following error occurred while executing this line:
/home/jenkins/jenkins-slave/workspace/Lucene-Solr-Tests-8.x/solr/common-build.xml:506: The following error occurred while executing this line:
/home/jenkins/jenkins-slave/workspace/Lucene-Solr-Tests-8.x/solr/common-build.xml:401: The following error occurred while executing this line:
/home/jenkins/jenkins-slave/workspace/Lucene-Solr-Tests-8.x/solr/common-build.xml:421: The following error occurred while executing this line:
/home/jenkins/jenkins-slave/workspace/Lucene-Solr-Tests-8.x/lucene/common-build.xml:576: The following error occurred while executing this line:
/home/jenkins/jenkins-slave/workspace/Lucene-Solr-Tests-8.x/lucene/common-build.xml:2074: Compile failed; see the compiler error output for details.
Total time: 41 minutes 31 seconds
Build step 'Invoke Ant' marked build as failure
Archiving artifacts
Recording test results
Email was triggered for: Failure - Any
Sending email for trigger: Failure - Any