You are viewing a plain text version of this content. The canonical link for it is here.
Posted to commits@activemq.apache.org by Apache Jenkins Server <je...@builds.apache.org> on 2024/05/28 16:30:22 UTC

Build failed in Jenkins: ActiveMQ » ActiveMQ-Artemis-JDK8 #686

See <https://ci-builds.apache.org/job/ActiveMQ/job/ActiveMQ-Artemis-JDK8/686/display/redirect?page=changes>

Changes:

[Robbie Gemmell] NO-JIRA Fix random test failures if flow is omitted

[Justin Bertram] ARTEMIS-4783 touch up federation docs


------------------------------------------
Started by an SCM change
Started by an SCM change
Started by an SCM change
Running as SYSTEM
[EnvInject] - Loading node environment variables.
Building remotely on builds43 (ubuntu) in workspace <https://ci-builds.apache.org/job/ActiveMQ/job/ActiveMQ-Artemis-JDK8/ws/>
The recommended git tool is: NONE
No credentials specified
Cloning the remote Git repository
Cloning repository https://gitbox.apache.org/repos/asf/activemq-artemis.git
 > git init <https://ci-builds.apache.org/job/ActiveMQ/job/ActiveMQ-Artemis-JDK8/ws/> # timeout=10
Fetching upstream changes from https://gitbox.apache.org/repos/asf/activemq-artemis.git
 > git --version # timeout=10
 > git --version # 'git version 2.34.1'
 > git fetch --tags --force --progress -- https://gitbox.apache.org/repos/asf/activemq-artemis.git +refs/heads/*:refs/remotes/origin/* # timeout=10
 > git config remote.origin.url https://gitbox.apache.org/repos/asf/activemq-artemis.git # timeout=10
 > git config --add remote.origin.fetch +refs/heads/*:refs/remotes/origin/* # timeout=10
Avoid second fetch
 > git rev-parse refs/remotes/origin/main^{commit} # timeout=10
Checking out Revision 7d6ab48763330bb77552809a6425550467e5642a (refs/remotes/origin/main)
 > git config core.sparsecheckout # timeout=10
 > git checkout -f 7d6ab48763330bb77552809a6425550467e5642a # timeout=10
Commit message: "This closes #4938"
 > git rev-list --no-walk c47713454caeece82df29a0a7fd4a2a39000576b # timeout=10
[ActiveMQ-Artemis-JDK8] $ /bin/sh -xe /tmp/jenkins5231877720017060666.sh
+ echo ===== Env Details =====
===== Env Details =====
+ java -version
openjdk version "1.8.0_362"
OpenJDK Runtime Environment (Temurin)(build 1.8.0_362-b09)
OpenJDK 64-Bit Server VM (Temurin)(build 25.362-b09, mixed mode)
+ javac -version
javac 1.8.0_362
+ echo JAVA_HOME=/home/jenkins/tools/java/latest1.8
JAVA_HOME=/home/jenkins/tools/java/latest1.8
+ echo PATH=/home/jenkins/tools/maven/latest3/bin:/home/jenkins/tools/java/latest1.8/bin:/usr/local/sbin:/usr/local/bin:/usr/sbin:/usr/bin:/sbin:/bin:/snap/bin
PATH=/home/jenkins/tools/maven/latest3/bin:/home/jenkins/tools/java/latest1.8/bin:/usr/local/sbin:/usr/local/bin:/usr/sbin:/usr/bin:/sbin:/bin:/snap/bin
+ echo =======================
=======================
Parsing POMs
Discovered a new module org.apache.activemq:artemis-project ActiveMQ Artemis
Discovered a new module org.apache.activemq:artemis-bom ActiveMQ Artemis Bill of Materials
Discovered a new module org.apache.activemq:artemis-log-annotation-processor ActiveMQ Log Annotation Processor
Discovered a new module org.apache.activemq:artemis-jakarta-openwire-protocol ActiveMQ Artemis Jakarta OpenWire Protocol
Discovered a new module org.apache.activemq:artemis-junit-parent ActiveMQ Artemis JUnit
Discovered a new module org.apache.activemq:artemis-junit-commons ActiveMQ Artemis JUnit Commons
Discovered a new module org.apache.activemq:artemis-junit-5 ActiveMQ Artemis JUnit 5 Extensions
Discovered a new module org.apache.activemq:artemis-unit-test-support ActiveMQ Artemis Unit Test Support
Discovered a new module org.apache.activemq.tests:integration-tests-isolated ActiveMQ Artemis Isolated Integration Tests
Discovered a new module org.apache.activemq.tests:karaf-server-integration-tests ActiveMQ Artemis Karaf Server Integration Tests
Discovered a new module org.apache.activemq.tests:e2e-tests End-to-End Tests
Discovered a new module org.apache.activemq.tests:leak-tests ActiveMQ Artemis Leak Tests
Discovered a new module org.apache.activemq.tests:db-tests Database Tests
Discovered a new module org.apache.activemq:artemis-lockmanager ActiveMQ Artemis Lock Manager
Discovered a new module org.apache.activemq:artemis-lockmanager-api ActiveMQ Artemis Lock Manager API
Discovered a new module org.apache.activemq:artemis-lockmanager-ri ActiveMQ Artemis Lock Manager RI
Discovered a new module org.apache.activemq:artemis-image Apache ActiveMQ Artemis Image
Discovered a new module org.apache.activemq:artemis-image-examples Apache ActiveMQ Artemis Image Examples
Modules changed, recalculating dependency graph
Established TCP socket on 36101
maven35-agent.jar already up to date
maven35-interceptor.jar already up to date
maven3-interceptor-commons.jar already up to date
[ActiveMQ-Artemis-JDK8] $ /home/jenkins/tools/java/latest1.8/bin/java -cp /home/jenkins/jenkins-agent/maven35-agent.jar:/home/jenkins/tools/maven/latest3/boot/plexus-classworlds-2.7.0.jar:/home/jenkins/tools/maven/latest3/conf/logging jenkins.maven3.agent.Maven35Main /home/jenkins/tools/maven/latest3 /home/jenkins/jenkins-agent/agent.jar /home/jenkins/jenkins-agent/maven35-interceptor.jar /home/jenkins/jenkins-agent/maven3-interceptor-commons.jar 36101
Exception in thread "main" java.lang.UnsupportedClassVersionError: hudson/remoting/Launcher has been compiled by a more recent version of the Java Runtime (class file version 55.0), this version of the Java Runtime only recognizes class file versions up to 52.0
	at java.lang.ClassLoader.defineClass1(Native Method)
	at java.lang.ClassLoader.defineClass(ClassLoader.java:756)
	at java.security.SecureClassLoader.defineClass(SecureClassLoader.java:142)
	at java.net.URLClassLoader.defineClass(URLClassLoader.java:473)
	at java.net.URLClassLoader.access$100(URLClassLoader.java:74)
	at java.net.URLClassLoader$1.run(URLClassLoader.java:369)
	at java.net.URLClassLoader$1.run(URLClassLoader.java:363)
	at java.security.AccessController.doPrivileged(Native Method)
	at java.net.URLClassLoader.findClass(URLClassLoader.java:362)
	at org.codehaus.plexus.classworlds.realm.ClassRealm.findClassInternal(ClassRealm.java:313)
	at org.codehaus.plexus.classworlds.realm.ClassRealm.loadClassFromSelf(ClassRealm.java:432)
	at org.codehaus.plexus.classworlds.strategy.SelfFirstStrategy.loadClass(SelfFirstStrategy.java:42)
	at org.codehaus.plexus.classworlds.realm.ClassRealm.unsynchronizedLoadClass(ClassRealm.java:271)
	at org.codehaus.plexus.classworlds.realm.ClassRealm.loadClass(ClassRealm.java:247)
	at org.codehaus.plexus.classworlds.realm.ClassRealm.loadClass(ClassRealm.java:239)
	at jenkins.maven3.agent.Maven35Main.main(Maven35Main.java:136)
	at jenkins.maven3.agent.Maven35Main.main(Maven35Main.java:66)
ERROR: Failed to parse POMs
java.io.EOFException: unexpected stream termination
	at hudson.remoting.ChannelBuilder.negotiate(ChannelBuilder.java:459)
	at hudson.remoting.ChannelBuilder.build(ChannelBuilder.java:404)
	at hudson.slaves.Channels.forProcess(Channels.java:121)
	at hudson.maven.AbstractMavenProcessFactory.newProcess(AbstractMavenProcessFactory.java:298)
	at hudson.maven.ProcessCache.get(ProcessCache.java:237)
	at hudson.maven.MavenModuleSetBuild$MavenModuleSetBuildExecution.doRun(MavenModuleSetBuild.java:802)
	at hudson.model.AbstractBuild$AbstractBuildExecution.run(AbstractBuild.java:526)
	at hudson.model.Run.execute(Run.java:1841)
	at hudson.maven.MavenModuleSetBuild.run(MavenModuleSetBuild.java:543)
	at hudson.model.ResourceController.execute(ResourceController.java:101)
	at hudson.model.Executor.run(Executor.java:442)

---------------------------------------------------------------------
To unsubscribe, e-mail: commits-unsubscribe@activemq.apache.org
For additional commands, e-mail: commits-help@activemq.apache.org
For further information, visit: https://activemq.apache.org/contact



Build failed in Jenkins: ActiveMQ » ActiveMQ-Artemis-JDK8 #690

Posted by Apache Jenkins Server <je...@builds.apache.org>.
See <https://ci-builds.apache.org/job/ActiveMQ/job/ActiveMQ-Artemis-JDK8/690/display/redirect?page=changes>

Changes:

[Clebert Suconic] NO-JIRA Removing non used field on PostOfficeImpl


------------------------------------------
Started by an SCM change
Running as SYSTEM
[EnvInject] - Loading node environment variables.
Building remotely on builds59 (ubuntu ubuntu-avx) in workspace <https://ci-builds.apache.org/job/ActiveMQ/job/ActiveMQ-Artemis-JDK8/ws/>
The recommended git tool is: NONE
No credentials specified
Cloning the remote Git repository
Cloning repository https://gitbox.apache.org/repos/asf/activemq-artemis.git
 > git init <https://ci-builds.apache.org/job/ActiveMQ/job/ActiveMQ-Artemis-JDK8/ws/> # timeout=10
Fetching upstream changes from https://gitbox.apache.org/repos/asf/activemq-artemis.git
 > git --version # timeout=10
 > git --version # 'git version 2.34.1'
 > git fetch --tags --force --progress -- https://gitbox.apache.org/repos/asf/activemq-artemis.git +refs/heads/*:refs/remotes/origin/* # timeout=10
 > git config remote.origin.url https://gitbox.apache.org/repos/asf/activemq-artemis.git # timeout=10
 > git config --add remote.origin.fetch +refs/heads/*:refs/remotes/origin/* # timeout=10
Avoid second fetch
 > git rev-parse refs/remotes/origin/main^{commit} # timeout=10
Checking out Revision 75446679078e20cc9a2d73ba3e3b6e239cf68b13 (refs/remotes/origin/main)
 > git config core.sparsecheckout # timeout=10
 > git checkout -f 75446679078e20cc9a2d73ba3e3b6e239cf68b13 # timeout=10
Commit message: "NO-JIRA Removing non used field on PostOfficeImpl"
 > git rev-list --no-walk fa06b7013416a3e1ff85ca109e292c6f0aeeab25 # timeout=10
[ActiveMQ-Artemis-JDK8] $ /bin/sh -xe /tmp/jenkins3180504922409324170.sh
+ echo ===== Env Details =====
===== Env Details =====
+ java -version
openjdk version "1.8.0_362"
OpenJDK Runtime Environment (Temurin)(build 1.8.0_362-b09)
OpenJDK 64-Bit Server VM (Temurin)(build 25.362-b09, mixed mode)
+ javac -version
javac 1.8.0_362
+ echo JAVA_HOME=/home/jenkins/tools/java/latest1.8
JAVA_HOME=/home/jenkins/tools/java/latest1.8
+ echo PATH=/home/jenkins/tools/maven/latest3/bin:/home/jenkins/tools/java/latest1.8/bin:/usr/local/sbin:/usr/local/bin:/usr/sbin:/usr/bin:/sbin:/bin:/snap/bin
PATH=/home/jenkins/tools/maven/latest3/bin:/home/jenkins/tools/java/latest1.8/bin:/usr/local/sbin:/usr/local/bin:/usr/sbin:/usr/bin:/sbin:/bin:/snap/bin
+ echo =======================
=======================
Parsing POMs
Modules changed, recalculating dependency graph
Established TCP socket on 45917
maven35-agent.jar already up to date
maven35-interceptor.jar already up to date
maven3-interceptor-commons.jar already up to date
[ActiveMQ-Artemis-JDK8] $ /home/jenkins/tools/java/latest1.8/bin/java -cp /home/jenkins/jenkins-agent/maven35-agent.jar:/home/jenkins/tools/maven/latest3/boot/plexus-classworlds-2.7.0.jar:/home/jenkins/tools/maven/latest3/conf/logging jenkins.maven3.agent.Maven35Main /home/jenkins/tools/maven/latest3 /home/jenkins/jenkins-agent/agent.jar /home/jenkins/jenkins-agent/maven35-interceptor.jar /home/jenkins/jenkins-agent/maven3-interceptor-commons.jar 45917
Exception in thread "main" java.lang.UnsupportedClassVersionError: hudson/remoting/Launcher has been compiled by a more recent version of the Java Runtime (class file version 55.0), this version of the Java Runtime only recognizes class file versions up to 52.0
	at java.lang.ClassLoader.defineClass1(Native Method)
	at java.lang.ClassLoader.defineClass(ClassLoader.java:756)
	at java.security.SecureClassLoader.defineClass(SecureClassLoader.java:142)
	at java.net.URLClassLoader.defineClass(URLClassLoader.java:473)
	at java.net.URLClassLoader.access$100(URLClassLoader.java:74)
	at java.net.URLClassLoader$1.run(URLClassLoader.java:369)
	at java.net.URLClassLoader$1.run(URLClassLoader.java:363)
	at java.security.AccessController.doPrivileged(Native Method)
	at java.net.URLClassLoader.findClass(URLClassLoader.java:362)
	at org.codehaus.plexus.classworlds.realm.ClassRealm.findClassInternal(ClassRealm.java:313)
	at org.codehaus.plexus.classworlds.realm.ClassRealm.loadClassFromSelf(ClassRealm.java:432)
	at org.codehaus.plexus.classworlds.strategy.SelfFirstStrategy.loadClass(SelfFirstStrategy.java:42)
	at org.codehaus.plexus.classworlds.realm.ClassRealm.unsynchronizedLoadClass(ClassRealm.java:271)
	at org.codehaus.plexus.classworlds.realm.ClassRealm.loadClass(ClassRealm.java:247)
	at org.codehaus.plexus.classworlds.realm.ClassRealm.loadClass(ClassRealm.java:239)
	at jenkins.maven3.agent.Maven35Main.main(Maven35Main.java:136)
	at jenkins.maven3.agent.Maven35Main.main(Maven35Main.java:66)
ERROR: Failed to parse POMs
java.io.EOFException: unexpected stream termination
	at hudson.remoting.ChannelBuilder.negotiate(ChannelBuilder.java:459)
	at hudson.remoting.ChannelBuilder.build(ChannelBuilder.java:404)
	at hudson.slaves.Channels.forProcess(Channels.java:121)
	at hudson.maven.AbstractMavenProcessFactory.newProcess(AbstractMavenProcessFactory.java:298)
	at hudson.maven.ProcessCache.get(ProcessCache.java:237)
	at hudson.maven.MavenModuleSetBuild$MavenModuleSetBuildExecution.doRun(MavenModuleSetBuild.java:802)
	at hudson.model.AbstractBuild$AbstractBuildExecution.run(AbstractBuild.java:526)
	at hudson.model.Run.execute(Run.java:1841)
	at hudson.maven.MavenModuleSetBuild.run(MavenModuleSetBuild.java:543)
	at hudson.model.ResourceController.execute(ResourceController.java:101)
	at hudson.model.Executor.run(Executor.java:442)

---------------------------------------------------------------------
To unsubscribe, e-mail: commits-unsubscribe@activemq.apache.org
For additional commands, e-mail: commits-help@activemq.apache.org
For further information, visit: https://activemq.apache.org/contact



Build failed in Jenkins: ActiveMQ » ActiveMQ-Artemis-JDK8 #689

Posted by Apache Jenkins Server <je...@builds.apache.org>.
See <https://ci-builds.apache.org/job/ActiveMQ/job/ActiveMQ-Artemis-JDK8/689/display/redirect?page=changes>

Changes:

[Clebert Suconic] NO-JIRA fixing intermittent test failure on MaxMessagePagingTest

[Clebert Suconic] ARTEMIS-4784 Large Messages should removed from HashMap on ReplicatioEndpoint after being closed


------------------------------------------
Started by an SCM change
Running as SYSTEM
[EnvInject] - Loading node environment variables.
Building remotely on EC2 (ec2-Jenkins Ephemeral Node User-CLI) - Jenkins Ephemeral Node - ubuntu label (i-0d040df8123e5e02c) (ubuntu ephemeral) in workspace <https://ci-builds.apache.org/job/ActiveMQ/job/ActiveMQ-Artemis-JDK8/ws/>
The recommended git tool is: NONE
No credentials specified
Cloning the remote Git repository
Cloning repository https://gitbox.apache.org/repos/asf/activemq-artemis.git
 > git init <https://ci-builds.apache.org/job/ActiveMQ/job/ActiveMQ-Artemis-JDK8/ws/> # timeout=10
Fetching upstream changes from https://gitbox.apache.org/repos/asf/activemq-artemis.git
 > git --version # timeout=10
 > git --version # 'git version 2.34.1'
 > git fetch --tags --force --progress -- https://gitbox.apache.org/repos/asf/activemq-artemis.git +refs/heads/*:refs/remotes/origin/* # timeout=10
 > git config remote.origin.url https://gitbox.apache.org/repos/asf/activemq-artemis.git # timeout=10
 > git config --add remote.origin.fetch +refs/heads/*:refs/remotes/origin/* # timeout=10
Avoid second fetch
 > git rev-parse refs/remotes/origin/main^{commit} # timeout=10
Checking out Revision fa06b7013416a3e1ff85ca109e292c6f0aeeab25 (refs/remotes/origin/main)
 > git config core.sparsecheckout # timeout=10
 > git checkout -f fa06b7013416a3e1ff85ca109e292c6f0aeeab25 # timeout=10
Commit message: "ARTEMIS-4784 Large Messages should removed from HashMap on ReplicatioEndpoint after being closed"
 > git rev-list --no-walk acc64b184ebb760f2813e77a9a0127b5515a3edc # timeout=10
[ActiveMQ-Artemis-JDK8] $ /bin/sh -xe /tmp/jenkins15647630641235098228.sh
+ echo ===== Env Details =====
===== Env Details =====
+ java -version
openjdk version "1.8.0_362"
OpenJDK Runtime Environment (Temurin)(build 1.8.0_362-b09)
OpenJDK 64-Bit Server VM (Temurin)(build 25.362-b09, mixed mode)
+ javac -version
javac 1.8.0_362
+ echo JAVA_HOME=/home/jenkins/tools/java/latest1.8
JAVA_HOME=/home/jenkins/tools/java/latest1.8
+ echo PATH=/home/jenkins/tools/maven/latest3/bin:/home/jenkins/tools/java/latest1.8/bin:/usr/local/sbin:/usr/local/bin:/usr/sbin:/usr/bin:/sbin:/bin:/usr/games:/usr/local/games:/snap/bin
PATH=/home/jenkins/tools/maven/latest3/bin:/home/jenkins/tools/java/latest1.8/bin:/usr/local/sbin:/usr/local/bin:/usr/sbin:/usr/bin:/sbin:/bin:/usr/games:/usr/local/games:/snap/bin
+ echo =======================
=======================
Parsing POMs
Downloaded artifact https://repo.maven.apache.org/maven2/org/apache/apache/32/apache-32.pom
Downloaded artifact https://repo.maven.apache.org/maven2/org/eclipse/jetty/jetty-bom/10.0.20/jetty-bom-10.0.20.pom
Modules changed, recalculating dependency graph
Established TCP socket on 42665
Copied maven35-agent.jar
Copied maven35-interceptor.jar
Copied maven3-interceptor-commons.jar
[ActiveMQ-Artemis-JDK8] $ /home/jenkins/tools/java/latest1.8/bin/java -cp /home/jenkins/maven35-agent.jar:/home/jenkins/tools/maven/latest3/boot/plexus-classworlds-2.7.0.jar:/home/jenkins/tools/maven/latest3/conf/logging jenkins.maven3.agent.Maven35Main /home/jenkins/tools/maven/latest3 /tmp/remoting.jar /home/jenkins/maven35-interceptor.jar /home/jenkins/maven3-interceptor-commons.jar 42665
Exception in thread "main" java.lang.UnsupportedClassVersionError: hudson/remoting/Launcher has been compiled by a more recent version of the Java Runtime (class file version 55.0), this version of the Java Runtime only recognizes class file versions up to 52.0
	at java.lang.ClassLoader.defineClass1(Native Method)
	at java.lang.ClassLoader.defineClass(ClassLoader.java:756)
	at java.security.SecureClassLoader.defineClass(SecureClassLoader.java:142)
	at java.net.URLClassLoader.defineClass(URLClassLoader.java:473)
	at java.net.URLClassLoader.access$100(URLClassLoader.java:74)
	at java.net.URLClassLoader$1.run(URLClassLoader.java:369)
	at java.net.URLClassLoader$1.run(URLClassLoader.java:363)
	at java.security.AccessController.doPrivileged(Native Method)
	at java.net.URLClassLoader.findClass(URLClassLoader.java:362)
	at org.codehaus.plexus.classworlds.realm.ClassRealm.findClassInternal(ClassRealm.java:313)
	at org.codehaus.plexus.classworlds.realm.ClassRealm.loadClassFromSelf(ClassRealm.java:432)
	at org.codehaus.plexus.classworlds.strategy.SelfFirstStrategy.loadClass(SelfFirstStrategy.java:42)
	at org.codehaus.plexus.classworlds.realm.ClassRealm.unsynchronizedLoadClass(ClassRealm.java:271)
	at org.codehaus.plexus.classworlds.realm.ClassRealm.loadClass(ClassRealm.java:247)
	at org.codehaus.plexus.classworlds.realm.ClassRealm.loadClass(ClassRealm.java:239)
	at jenkins.maven3.agent.Maven35Main.main(Maven35Main.java:136)
	at jenkins.maven3.agent.Maven35Main.main(Maven35Main.java:66)
ERROR: Failed to parse POMs
java.io.EOFException: unexpected stream termination
	at hudson.remoting.ChannelBuilder.negotiate(ChannelBuilder.java:459)
	at hudson.remoting.ChannelBuilder.build(ChannelBuilder.java:404)
	at hudson.slaves.Channels.forProcess(Channels.java:121)
	at hudson.maven.AbstractMavenProcessFactory.newProcess(AbstractMavenProcessFactory.java:298)
	at hudson.maven.ProcessCache.get(ProcessCache.java:237)
	at hudson.maven.MavenModuleSetBuild$MavenModuleSetBuildExecution.doRun(MavenModuleSetBuild.java:802)
	at hudson.model.AbstractBuild$AbstractBuildExecution.run(AbstractBuild.java:526)
	at hudson.model.Run.execute(Run.java:1841)
	at hudson.maven.MavenModuleSetBuild.run(MavenModuleSetBuild.java:543)
	at hudson.model.ResourceController.execute(ResourceController.java:101)
	at hudson.model.Executor.run(Executor.java:442)

---------------------------------------------------------------------
To unsubscribe, e-mail: commits-unsubscribe@activemq.apache.org
For additional commands, e-mail: commits-help@activemq.apache.org
For further information, visit: https://activemq.apache.org/contact



Build failed in Jenkins: ActiveMQ » ActiveMQ-Artemis-JDK8 #688

Posted by Apache Jenkins Server <je...@builds.apache.org>.
See <https://ci-builds.apache.org/job/ActiveMQ/job/ActiveMQ-Artemis-JDK8/688/display/redirect?page=changes>

Changes:

[Clebert Suconic] NO-JIRA fix intermittent failure on LargeMessageRetentionTest

[Clebert Suconic] ARTEMIS-4306 add authn/z cache metrics


------------------------------------------
Started by an SCM change
Running as SYSTEM
[EnvInject] - Loading node environment variables.
Building remotely on builds36 (ubuntu) in workspace <https://ci-builds.apache.org/job/ActiveMQ/job/ActiveMQ-Artemis-JDK8/ws/>
The recommended git tool is: NONE
No credentials specified
Cloning the remote Git repository
Cloning repository https://gitbox.apache.org/repos/asf/activemq-artemis.git
 > git init <https://ci-builds.apache.org/job/ActiveMQ/job/ActiveMQ-Artemis-JDK8/ws/> # timeout=10
Fetching upstream changes from https://gitbox.apache.org/repos/asf/activemq-artemis.git
 > git --version # timeout=10
 > git --version # 'git version 2.34.1'
 > git fetch --tags --force --progress -- https://gitbox.apache.org/repos/asf/activemq-artemis.git +refs/heads/*:refs/remotes/origin/* # timeout=10
 > git config remote.origin.url https://gitbox.apache.org/repos/asf/activemq-artemis.git # timeout=10
 > git config --add remote.origin.fetch +refs/heads/*:refs/remotes/origin/* # timeout=10
Avoid second fetch
 > git rev-parse refs/remotes/origin/main^{commit} # timeout=10
Checking out Revision acc64b184ebb760f2813e77a9a0127b5515a3edc (refs/remotes/origin/main)
 > git config core.sparsecheckout # timeout=10
 > git checkout -f acc64b184ebb760f2813e77a9a0127b5515a3edc # timeout=10
Commit message: "ARTEMIS-4306 add authn/z cache metrics"
 > git rev-list --no-walk aab1c484b211c7efb76aae3d2a1d9ddbe3f16067 # timeout=10
[ActiveMQ-Artemis-JDK8] $ /bin/sh -xe /tmp/jenkins3399392681439186487.sh
+ echo ===== Env Details =====
===== Env Details =====
+ java -version
openjdk version "1.8.0_362"
OpenJDK Runtime Environment (Temurin)(build 1.8.0_362-b09)
OpenJDK 64-Bit Server VM (Temurin)(build 25.362-b09, mixed mode)
+ javac -version
javac 1.8.0_362
+ echo JAVA_HOME=/home/jenkins/tools/java/latest1.8
JAVA_HOME=/home/jenkins/tools/java/latest1.8
+ echo PATH=/home/jenkins/tools/maven/latest3/bin:/home/jenkins/tools/java/latest1.8/bin:/usr/local/sbin:/usr/local/bin:/usr/sbin:/usr/bin:/sbin:/bin:/snap/bin
PATH=/home/jenkins/tools/maven/latest3/bin:/home/jenkins/tools/java/latest1.8/bin:/usr/local/sbin:/usr/local/bin:/usr/sbin:/usr/bin:/sbin:/bin:/snap/bin
+ echo =======================
=======================
Parsing POMs
Modules changed, recalculating dependency graph
Established TCP socket on 37821
maven35-agent.jar already up to date
maven35-interceptor.jar already up to date
maven3-interceptor-commons.jar already up to date
[ActiveMQ-Artemis-JDK8] $ /home/jenkins/tools/java/latest1.8/bin/java -cp /home/jenkins/maven35-agent.jar:/home/jenkins/tools/maven/latest3/boot/plexus-classworlds-2.7.0.jar:/home/jenkins/tools/maven/latest3/conf/logging jenkins.maven3.agent.Maven35Main /home/jenkins/tools/maven/latest3 /home/jenkins/agent.jar /home/jenkins/maven35-interceptor.jar /home/jenkins/maven3-interceptor-commons.jar 37821
Exception in thread "main" java.lang.UnsupportedClassVersionError: hudson/remoting/Launcher has been compiled by a more recent version of the Java Runtime (class file version 55.0), this version of the Java Runtime only recognizes class file versions up to 52.0
	at java.lang.ClassLoader.defineClass1(Native Method)
	at java.lang.ClassLoader.defineClass(ClassLoader.java:756)
	at java.security.SecureClassLoader.defineClass(SecureClassLoader.java:142)
	at java.net.URLClassLoader.defineClass(URLClassLoader.java:473)
	at java.net.URLClassLoader.access$100(URLClassLoader.java:74)
	at java.net.URLClassLoader$1.run(URLClassLoader.java:369)
	at java.net.URLClassLoader$1.run(URLClassLoader.java:363)
	at java.security.AccessController.doPrivileged(Native Method)
	at java.net.URLClassLoader.findClass(URLClassLoader.java:362)
	at org.codehaus.plexus.classworlds.realm.ClassRealm.findClassInternal(ClassRealm.java:313)
	at org.codehaus.plexus.classworlds.realm.ClassRealm.loadClassFromSelf(ClassRealm.java:432)
	at org.codehaus.plexus.classworlds.strategy.SelfFirstStrategy.loadClass(SelfFirstStrategy.java:42)
	at org.codehaus.plexus.classworlds.realm.ClassRealm.unsynchronizedLoadClass(ClassRealm.java:271)
	at org.codehaus.plexus.classworlds.realm.ClassRealm.loadClass(ClassRealm.java:247)
	at org.codehaus.plexus.classworlds.realm.ClassRealm.loadClass(ClassRealm.java:239)
	at jenkins.maven3.agent.Maven35Main.main(Maven35Main.java:136)
	at jenkins.maven3.agent.Maven35Main.main(Maven35Main.java:66)
ERROR: Failed to parse POMs
java.io.EOFException: unexpected stream termination
	at hudson.remoting.ChannelBuilder.negotiate(ChannelBuilder.java:459)
	at hudson.remoting.ChannelBuilder.build(ChannelBuilder.java:404)
	at hudson.slaves.Channels.forProcess(Channels.java:121)
	at hudson.maven.AbstractMavenProcessFactory.newProcess(AbstractMavenProcessFactory.java:298)
	at hudson.maven.ProcessCache.get(ProcessCache.java:237)
	at hudson.maven.MavenModuleSetBuild$MavenModuleSetBuildExecution.doRun(MavenModuleSetBuild.java:802)
	at hudson.model.AbstractBuild$AbstractBuildExecution.run(AbstractBuild.java:526)
	at hudson.model.Run.execute(Run.java:1841)
	at hudson.maven.MavenModuleSetBuild.run(MavenModuleSetBuild.java:543)
	at hudson.model.ResourceController.execute(ResourceController.java:101)
	at hudson.model.Executor.run(Executor.java:442)

---------------------------------------------------------------------
To unsubscribe, e-mail: commits-unsubscribe@activemq.apache.org
For additional commands, e-mail: commits-help@activemq.apache.org
For further information, visit: https://activemq.apache.org/contact



Build failed in Jenkins: ActiveMQ » ActiveMQ-Artemis-JDK8 #687

Posted by Apache Jenkins Server <je...@builds.apache.org>.
See <https://ci-builds.apache.org/job/ActiveMQ/job/ActiveMQ-Artemis-JDK8/687/display/redirect?page=changes>

Changes:

[tabish121] NO-JIRA Fix a few cases of federation test fails on unexpected frames


------------------------------------------
Started by an SCM change
Started by an SCM change
Running as SYSTEM
[EnvInject] - Loading node environment variables.
Building remotely on builds40 (ubuntu) in workspace <https://ci-builds.apache.org/job/ActiveMQ/job/ActiveMQ-Artemis-JDK8/ws/>
The recommended git tool is: NONE
No credentials specified
Cloning the remote Git repository
Cloning repository https://gitbox.apache.org/repos/asf/activemq-artemis.git
 > git init <https://ci-builds.apache.org/job/ActiveMQ/job/ActiveMQ-Artemis-JDK8/ws/> # timeout=10
Fetching upstream changes from https://gitbox.apache.org/repos/asf/activemq-artemis.git
 > git --version # timeout=10
 > git --version # 'git version 2.34.1'
 > git fetch --tags --force --progress -- https://gitbox.apache.org/repos/asf/activemq-artemis.git +refs/heads/*:refs/remotes/origin/* # timeout=10
 > git config remote.origin.url https://gitbox.apache.org/repos/asf/activemq-artemis.git # timeout=10
 > git config --add remote.origin.fetch +refs/heads/*:refs/remotes/origin/* # timeout=10
Avoid second fetch
 > git rev-parse refs/remotes/origin/main^{commit} # timeout=10
Checking out Revision aab1c484b211c7efb76aae3d2a1d9ddbe3f16067 (refs/remotes/origin/main)
 > git config core.sparsecheckout # timeout=10
 > git checkout -f aab1c484b211c7efb76aae3d2a1d9ddbe3f16067 # timeout=10
Commit message: "NO-JIRA Fix a few cases of federation test fails on unexpected frames"
 > git rev-list --no-walk 7d6ab48763330bb77552809a6425550467e5642a # timeout=10
[ActiveMQ-Artemis-JDK8] $ /bin/sh -xe /tmp/jenkins9429917027744964684.sh
+ echo ===== Env Details =====
===== Env Details =====
+ java -version
openjdk version "1.8.0_362"
OpenJDK Runtime Environment (Temurin)(build 1.8.0_362-b09)
OpenJDK 64-Bit Server VM (Temurin)(build 25.362-b09, mixed mode)
+ javac -version
javac 1.8.0_362
+ echo JAVA_HOME=/home/jenkins/tools/java/latest1.8
JAVA_HOME=/home/jenkins/tools/java/latest1.8
+ echo PATH=/home/jenkins/tools/maven/latest3/bin:/home/jenkins/tools/java/latest1.8/bin:/usr/local/sbin:/usr/local/bin:/usr/sbin:/usr/bin:/sbin:/bin:/snap/bin
PATH=/home/jenkins/tools/maven/latest3/bin:/home/jenkins/tools/java/latest1.8/bin:/usr/local/sbin:/usr/local/bin:/usr/sbin:/usr/bin:/sbin:/bin:/snap/bin
+ echo =======================
=======================
Parsing POMs
Modules changed, recalculating dependency graph
Established TCP socket on 36381
maven35-agent.jar already up to date
maven35-interceptor.jar already up to date
maven3-interceptor-commons.jar already up to date
[ActiveMQ-Artemis-JDK8] $ /home/jenkins/tools/java/latest1.8/bin/java -cp /home/jenkins/jenkins-agent/maven35-agent.jar:/home/jenkins/tools/maven/latest3/boot/plexus-classworlds-2.7.0.jar:/home/jenkins/tools/maven/latest3/conf/logging jenkins.maven3.agent.Maven35Main /home/jenkins/tools/maven/latest3 /home/jenkins/jenkins-agent/agent.jar /home/jenkins/jenkins-agent/maven35-interceptor.jar /home/jenkins/jenkins-agent/maven3-interceptor-commons.jar 36381
Exception in thread "main" java.lang.UnsupportedClassVersionError: hudson/remoting/Launcher has been compiled by a more recent version of the Java Runtime (class file version 55.0), this version of the Java Runtime only recognizes class file versions up to 52.0
	at java.lang.ClassLoader.defineClass1(Native Method)
	at java.lang.ClassLoader.defineClass(ClassLoader.java:756)
	at java.security.SecureClassLoader.defineClass(SecureClassLoader.java:142)
	at java.net.URLClassLoader.defineClass(URLClassLoader.java:473)
	at java.net.URLClassLoader.access$100(URLClassLoader.java:74)
	at java.net.URLClassLoader$1.run(URLClassLoader.java:369)
	at java.net.URLClassLoader$1.run(URLClassLoader.java:363)
	at java.security.AccessController.doPrivileged(Native Method)
	at java.net.URLClassLoader.findClass(URLClassLoader.java:362)
	at org.codehaus.plexus.classworlds.realm.ClassRealm.findClassInternal(ClassRealm.java:313)
	at org.codehaus.plexus.classworlds.realm.ClassRealm.loadClassFromSelf(ClassRealm.java:432)
	at org.codehaus.plexus.classworlds.strategy.SelfFirstStrategy.loadClass(SelfFirstStrategy.java:42)
	at org.codehaus.plexus.classworlds.realm.ClassRealm.unsynchronizedLoadClass(ClassRealm.java:271)
	at org.codehaus.plexus.classworlds.realm.ClassRealm.loadClass(ClassRealm.java:247)
	at org.codehaus.plexus.classworlds.realm.ClassRealm.loadClass(ClassRealm.java:239)
	at jenkins.maven3.agent.Maven35Main.main(Maven35Main.java:136)
	at jenkins.maven3.agent.Maven35Main.main(Maven35Main.java:66)
ERROR: Failed to parse POMs
java.io.EOFException: unexpected stream termination
	at hudson.remoting.ChannelBuilder.negotiate(ChannelBuilder.java:459)
	at hudson.remoting.ChannelBuilder.build(ChannelBuilder.java:404)
	at hudson.slaves.Channels.forProcess(Channels.java:121)
	at hudson.maven.AbstractMavenProcessFactory.newProcess(AbstractMavenProcessFactory.java:298)
	at hudson.maven.ProcessCache.get(ProcessCache.java:237)
	at hudson.maven.MavenModuleSetBuild$MavenModuleSetBuildExecution.doRun(MavenModuleSetBuild.java:802)
	at hudson.model.AbstractBuild$AbstractBuildExecution.run(AbstractBuild.java:526)
	at hudson.model.Run.execute(Run.java:1841)
	at hudson.maven.MavenModuleSetBuild.run(MavenModuleSetBuild.java:543)
	at hudson.model.ResourceController.execute(ResourceController.java:101)
	at hudson.model.Executor.run(Executor.java:442)

---------------------------------------------------------------------
To unsubscribe, e-mail: commits-unsubscribe@activemq.apache.org
For additional commands, e-mail: commits-help@activemq.apache.org
For further information, visit: https://activemq.apache.org/contact