You are viewing a plain text version of this content. The canonical link for it is here.
Posted to commits@flink.apache.org by Apache Jenkins Server <je...@builds.apache.org> on 2019/03/16 04:16:01 UTC
Build failed in Jenkins: flink-snapshot-deployment #1134
See <https://builds.apache.org/job/flink-snapshot-deployment/1134/display/redirect>
------------------------------------------
[...truncated 1.89 MB...]
[INFO] Including org.apache.commons:commons-compress:jar:1.18 in the shaded jar.
[INFO] Including org.apache.flink:flink-java:jar:1.9-SNAPSHOT in the shaded jar.
[INFO] Including org.apache.flink:flink-shaded-asm-6:jar:6.2.1-6.0 in the shaded jar.
[INFO] Including org.apache.flink:flink-queryable-state-client-java_2.11:jar:1.9-SNAPSHOT in the shaded jar.
[INFO] Including org.apache.flink:flink-hadoop-fs:jar:1.9-SNAPSHOT in the shaded jar.
[INFO] Including commons-io:commons-io:jar:2.4 in the shaded jar.
[INFO] Including org.apache.flink:flink-shaded-netty:jar:4.1.32.Final-6.0 in the shaded jar.
[INFO] Including org.apache.flink:flink-shaded-asm:jar:5.0.4-6.0 in the shaded jar.
[INFO] Including org.apache.flink:flink-shaded-jackson:jar:2.7.9-6.0 in the shaded jar.
[INFO] Including org.apache.commons:commons-lang3:jar:3.3.2 in the shaded jar.
[INFO] Including commons-cli:commons-cli:jar:1.3.1 in the shaded jar.
[INFO] Including org.javassist:javassist:jar:3.19.0-GA in the shaded jar.
[INFO] Including com.typesafe.akka:akka-stream_2.11:jar:2.4.20 in the shaded jar.
[INFO] Including org.reactivestreams:reactive-streams:jar:1.0.0 in the shaded jar.
[INFO] Including com.typesafe:ssl-config-core_2.11:jar:0.2.1 in the shaded jar.
[INFO] Including org.scala-lang.modules:scala-parser-combinators_2.11:jar:1.0.4 in the shaded jar.
[INFO] Including com.typesafe.akka:akka-protobuf_2.11:jar:2.4.20 in the shaded jar.
[INFO] Including com.typesafe.akka:akka-slf4j_2.11:jar:2.4.20 in the shaded jar.
[INFO] Including org.clapper:grizzled-slf4j_2.11:jar:1.3.2 in the shaded jar.
[INFO] Including com.github.scopt:scopt_2.11:jar:3.5.0 in the shaded jar.
[INFO] Including com.twitter:chill_2.11:jar:0.7.6 in the shaded jar.
[INFO] Including com.twitter:chill-java:jar:0.7.6 in the shaded jar.
[INFO] Including org.apache.flink:flink-clients_2.11:jar:1.9-SNAPSHOT in the shaded jar.
[INFO] Including org.apache.flink:flink-optimizer_2.11:jar:1.9-SNAPSHOT in the shaded jar.
[INFO] Including org.apache.flink:flink-shaded-guava:jar:18.0-6.0 in the shaded jar.
[INFO] Including org.apache.commons:commons-math3:jar:3.5 in the shaded jar.
[INFO] Including org.apache.flink:force-shading:jar:1.9-SNAPSHOT in the shaded jar.
[INFO] Excluding org.slf4j:slf4j-api:jar:1.7.15 from the shaded jar.
[INFO] Excluding com.google.code.findbugs:jsr305:jar:1.3.9 from the shaded jar.
[INFO] Including org.objenesis:objenesis:jar:2.1 in the shaded jar.
[INFO] Including org.scala-lang:scala-library:jar:2.11.12 in the shaded jar.
[INFO] Including com.typesafe.akka:akka-actor_2.11:jar:2.4.20 in the shaded jar.
[INFO] Including com.typesafe:config:jar:1.3.0 in the shaded jar.
[INFO] Including org.scala-lang.modules:scala-java8-compat_2.11:jar:0.7.0 in the shaded jar.
[INFO] Replacing <https://builds.apache.org/job/flink-snapshot-deployment/ws/flink-end-to-end-tests/flink-streaming-kafka010-test/target/Kafka010Example.jar> with <https://builds.apache.org/job/flink-snapshot-deployment/ws/flink-end-to-end-tests/flink-streaming-kafka010-test/target/flink-streaming-kafka010-test_2.11-1.9-SNAPSHOT-shaded.jar>
[INFO]
[INFO] >>> maven-source-plugin:2.2.1:jar (attach-sources) > generate-sources @ flink-streaming-kafka010-test_2.11 >>>
[INFO]
[INFO] --- maven-checkstyle-plugin:2.17:check (validate) @ flink-streaming-kafka010-test_2.11 ---
[INFO]
[INFO] --- maven-enforcer-plugin:3.0.0-M1:enforce (enforce-maven-version) @ flink-streaming-kafka010-test_2.11 ---
[INFO]
[INFO] --- maven-enforcer-plugin:3.0.0-M1:enforce (enforce-maven) @ flink-streaming-kafka010-test_2.11 ---
[INFO]
[INFO] --- maven-enforcer-plugin:3.0.0-M1:enforce (enforce-versions) @ flink-streaming-kafka010-test_2.11 ---
[INFO]
[INFO] --- directory-maven-plugin:0.1:highest-basedir (directories) @ flink-streaming-kafka010-test_2.11 ---
[INFO] Highest basedir set to: <https://builds.apache.org/job/flink-snapshot-deployment/ws/>
[INFO]
[INFO] <<< maven-source-plugin:2.2.1:jar (attach-sources) < generate-sources @ flink-streaming-kafka010-test_2.11 <<<
[INFO]
[INFO] --- maven-source-plugin:2.2.1:jar (attach-sources) @ flink-streaming-kafka010-test_2.11 ---
[INFO] Building jar: <https://builds.apache.org/job/flink-snapshot-deployment/ws/flink-end-to-end-tests/flink-streaming-kafka010-test/target/flink-streaming-kafka010-test_2.11-1.9-SNAPSHOT-sources.jar>
[INFO]
[INFO] --- maven-javadoc-plugin:2.9.1:jar (attach-javadocs) @ flink-streaming-kafka010-test_2.11 ---
[INFO] Building jar: <https://builds.apache.org/job/flink-snapshot-deployment/ws/flink-end-to-end-tests/flink-streaming-kafka010-test/target/flink-streaming-kafka010-test_2.11-1.9-SNAPSHOT-javadoc.jar>
[INFO]
[INFO] --- maven-install-plugin:2.5.2:install (default-install) @ flink-streaming-kafka010-test_2.11 ---
[INFO] Installing <https://builds.apache.org/job/flink-snapshot-deployment/ws/flink-end-to-end-tests/flink-streaming-kafka010-test/target/flink-streaming-kafka010-test_2.11-1.9-SNAPSHOT.jar> to /home/jenkins/.m2/repository/org/apache/flink/flink-streaming-kafka010-test_2.11/1.9-SNAPSHOT/flink-streaming-kafka010-test_2.11-1.9-SNAPSHOT.jar
[INFO] Installing <https://builds.apache.org/job/flink-snapshot-deployment/ws/flink-end-to-end-tests/flink-streaming-kafka010-test/target/dependency-reduced-pom.xml> to /home/jenkins/.m2/repository/org/apache/flink/flink-streaming-kafka010-test_2.11/1.9-SNAPSHOT/flink-streaming-kafka010-test_2.11-1.9-SNAPSHOT.pom
[INFO] Installing <https://builds.apache.org/job/flink-snapshot-deployment/ws/flink-end-to-end-tests/flink-streaming-kafka010-test/target/flink-streaming-kafka010-test_2.11-1.9-SNAPSHOT-tests.jar> to /home/jenkins/.m2/repository/org/apache/flink/flink-streaming-kafka010-test_2.11/1.9-SNAPSHOT/flink-streaming-kafka010-test_2.11-1.9-SNAPSHOT-tests.jar
[INFO] Installing <https://builds.apache.org/job/flink-snapshot-deployment/ws/flink-end-to-end-tests/flink-streaming-kafka010-test/target/flink-streaming-kafka010-test_2.11-1.9-SNAPSHOT-sources.jar> to /home/jenkins/.m2/repository/org/apache/flink/flink-streaming-kafka010-test_2.11/1.9-SNAPSHOT/flink-streaming-kafka010-test_2.11-1.9-SNAPSHOT-sources.jar
[INFO] Installing <https://builds.apache.org/job/flink-snapshot-deployment/ws/flink-end-to-end-tests/flink-streaming-kafka010-test/target/flink-streaming-kafka010-test_2.11-1.9-SNAPSHOT-javadoc.jar> to /home/jenkins/.m2/repository/org/apache/flink/flink-streaming-kafka010-test_2.11/1.9-SNAPSHOT/flink-streaming-kafka010-test_2.11-1.9-SNAPSHOT-javadoc.jar
[INFO]
[INFO] --- maven-deploy-plugin:2.8.2:deploy (default-deploy) @ flink-streaming-kafka010-test_2.11 ---
[INFO] Skipping artifact deployment
[INFO]
[INFO] ------------------------------------------------------------------------
[INFO] Building flink-streaming-kinesis-test 1.9-SNAPSHOT
[INFO] ------------------------------------------------------------------------
[INFO] Downloading: http://repository.apache.org/snapshots/org/apache/flink/flink-connector-kinesis_2.11/1.9-SNAPSHOT/maven-metadata.xml
[INFO] Downloading: http://repository.apache.org/snapshots/org/apache/flink/flink-connector-kinesis_2.11/1.9-SNAPSHOT/flink-connector-kinesis_2.11-1.9-SNAPSHOT.pom
[WARNING] The POM for org.apache.flink:flink-connector-kinesis_2.11:jar:1.9-SNAPSHOT is missing, no dependency information available
[INFO] Downloading: http://repository.apache.org/snapshots/org/apache/flink/flink-connector-kinesis_2.11/1.9-SNAPSHOT/flink-connector-kinesis_2.11-1.9-SNAPSHOT.jar
[INFO] ------------------------------------------------------------------------
[INFO] Reactor Summary:
[INFO]
[INFO] force-shading ...................................... SUCCESS [ 9.366 s]
[INFO] flink .............................................. SUCCESS [ 7.836 s]
[INFO] flink-annotations .................................. SUCCESS [ 13.334 s]
[INFO] flink-shaded-hadoop ................................ SUCCESS [ 4.237 s]
[INFO] flink-shaded-hadoop2 ............................... SUCCESS [ 25.626 s]
[INFO] flink-shaded-hadoop2-uber .......................... SUCCESS [ 28.718 s]
[INFO] flink-shaded-yarn-tests ............................ SUCCESS [ 31.322 s]
[INFO] flink-shaded-curator ............................... SUCCESS [ 10.337 s]
[INFO] flink-metrics ...................................... SUCCESS [ 4.460 s]
[INFO] flink-metrics-core ................................. SUCCESS [ 17.125 s]
[INFO] flink-test-utils-parent ............................ SUCCESS [ 4.062 s]
[INFO] flink-test-utils-junit ............................. SUCCESS [ 13.142 s]
[INFO] flink-core ......................................... SUCCESS [ 42.964 s]
[INFO] flink-java ......................................... SUCCESS [ 24.043 s]
[INFO] flink-queryable-state .............................. SUCCESS [ 4.122 s]
[INFO] flink-queryable-state-client-java .................. SUCCESS [ 16.479 s]
[INFO] flink-filesystems .................................. SUCCESS [ 4.306 s]
[INFO] flink-hadoop-fs .................................... SUCCESS [ 15.366 s]
[INFO] flink-runtime ...................................... SUCCESS [01:38 min]
[INFO] flink-scala ........................................ SUCCESS [01:09 min]
[INFO] flink-mapr-fs ...................................... SUCCESS [ 13.721 s]
[INFO] flink-filesystems :: flink-fs-hadoop-shaded ........ SUCCESS [ 8.904 s]
[INFO] flink-s3-fs-base ................................... SUCCESS [ 12.311 s]
[INFO] flink-s3-fs-hadoop ................................. SUCCESS [ 20.035 s]
[INFO] flink-s3-fs-presto ................................. SUCCESS [ 32.889 s]
[INFO] flink-swift-fs-hadoop .............................. SUCCESS [ 52.532 s]
[INFO] flink-oss-fs-hadoop ................................ SUCCESS [ 20.472 s]
[INFO] flink-optimizer .................................... SUCCESS [ 20.362 s]
[INFO] flink-clients ...................................... SUCCESS [ 17.530 s]
[INFO] flink-streaming-java ............................... SUCCESS [ 34.549 s]
[INFO] flink-test-utils ................................... SUCCESS [ 17.805 s]
[INFO] flink-runtime-web .................................. SUCCESS [ 17.840 s]
[INFO] flink-examples ..................................... SUCCESS [ 4.176 s]
[INFO] flink-examples-batch ............................... SUCCESS [ 44.872 s]
[INFO] flink-connectors ................................... SUCCESS [ 4.260 s]
[INFO] flink-hadoop-compatibility ......................... SUCCESS [ 21.957 s]
[INFO] flink-state-backends ............................... SUCCESS [ 4.129 s]
[INFO] flink-statebackend-rocksdb ......................... SUCCESS [ 15.301 s]
[INFO] flink-tests ........................................ SUCCESS [ 57.090 s]
[INFO] flink-streaming-scala .............................. SUCCESS [ 55.964 s]
[INFO] flink-table ........................................ SUCCESS [ 4.123 s]
[INFO] flink-table-common ................................. SUCCESS [ 16.749 s]
[INFO] flink-table-api-java ............................... SUCCESS [ 12.244 s]
[INFO] flink-table-api-java-bridge ........................ SUCCESS [ 9.225 s]
[INFO] flink-libraries .................................... SUCCESS [ 4.261 s]
[INFO] flink-cep .......................................... SUCCESS [ 20.441 s]
[INFO] flink-table-planner ................................ SUCCESS [02:59 min]
[INFO] flink-orc .......................................... SUCCESS [ 13.928 s]
[INFO] flink-jdbc ......................................... SUCCESS [ 13.397 s]
[INFO] flink-hbase ........................................ SUCCESS [ 17.128 s]
[INFO] flink-hcatalog ..................................... SUCCESS [ 20.035 s]
[INFO] flink-metrics-jmx .................................. SUCCESS [ 12.526 s]
[INFO] flink-connector-kafka-base ......................... SUCCESS [ 20.501 s]
[INFO] flink-connector-kafka-0.9 .......................... SUCCESS [ 18.574 s]
[INFO] flink-connector-kafka-0.10 ......................... SUCCESS [ 17.700 s]
[INFO] flink-connector-kafka-0.11 ......................... SUCCESS [ 18.090 s]
[INFO] flink-formats ...................................... SUCCESS [ 3.965 s]
[INFO] flink-json ......................................... SUCCESS [ 15.054 s]
[INFO] flink-connector-elasticsearch-base ................. SUCCESS [ 18.262 s]
[INFO] flink-connector-elasticsearch ...................... SUCCESS [ 30.398 s]
[INFO] flink-connector-elasticsearch2 ..................... SUCCESS [ 38.819 s]
[INFO] flink-connector-elasticsearch5 ..................... SUCCESS [ 42.920 s]
[INFO] flink-connector-elasticsearch6 ..................... SUCCESS [ 19.890 s]
[INFO] flink-connector-rabbitmq ........................... SUCCESS [ 13.208 s]
[INFO] flink-connector-twitter ............................ SUCCESS [ 18.248 s]
[INFO] flink-connector-nifi ............................... SUCCESS [ 15.111 s]
[INFO] flink-connector-cassandra .......................... SUCCESS [ 19.913 s]
[INFO] flink-avro ......................................... SUCCESS [ 20.940 s]
[INFO] flink-connector-filesystem ......................... SUCCESS [ 14.622 s]
[INFO] flink-connector-kafka .............................. SUCCESS [ 18.190 s]
[INFO] flink-sql-connector-elasticsearch6 ................. SUCCESS [ 22.108 s]
[INFO] flink-sql-connector-kafka-0.9 ...................... SUCCESS [ 9.688 s]
[INFO] flink-sql-connector-kafka-0.10 ..................... SUCCESS [ 10.007 s]
[INFO] flink-sql-connector-kafka-0.11 ..................... SUCCESS [ 10.307 s]
[INFO] flink-sql-connector-kafka .......................... SUCCESS [ 8.308 s]
[INFO] flink-connector-kafka-0.8 .......................... SUCCESS [ 14.239 s]
[INFO] flink-avro-confluent-registry ...................... SUCCESS [ 13.884 s]
[INFO] flink-parquet ...................................... SUCCESS [ 13.840 s]
[INFO] flink-sequence-file ................................ SUCCESS [ 12.302 s]
[INFO] flink-csv .......................................... SUCCESS [ 14.714 s]
[INFO] flink-examples-streaming ........................... SUCCESS [ 49.904 s]
[INFO] flink-table-api-scala .............................. SUCCESS [ 9.056 s]
[INFO] flink-table-api-scala-bridge ....................... SUCCESS [ 8.892 s]
[INFO] flink-examples-table ............................... SUCCESS [ 24.323 s]
[INFO] flink-examples-build-helper ........................ SUCCESS [ 4.172 s]
[INFO] flink-examples-streaming-twitter ................... SUCCESS [ 1.340 s]
[INFO] flink-examples-streaming-state-machine ............. SUCCESS [ 0.759 s]
[INFO] flink-container .................................... SUCCESS [ 12.221 s]
[INFO] flink-queryable-state-runtime ...................... SUCCESS [ 15.354 s]
[INFO] flink-end-to-end-tests ............................. SUCCESS [ 0.084 s]
[INFO] flink-cli-test ..................................... SUCCESS [ 1.552 s]
[INFO] flink-parent-child-classloading-test-program ....... SUCCESS [ 2.050 s]
[INFO] flink-parent-child-classloading-test-lib-package ... SUCCESS [ 1.574 s]
[INFO] flink-dataset-allround-test ........................ SUCCESS [ 1.827 s]
[INFO] flink-datastream-allround-test ..................... SUCCESS [ 4.387 s]
[INFO] flink-stream-sql-test .............................. SUCCESS [ 2.272 s]
[INFO] flink-bucketing-sink-test .......................... SUCCESS [ 2.103 s]
[INFO] flink-distributed-cache-via-blob ................... SUCCESS [ 1.709 s]
[INFO] flink-high-parallelism-iterations-test ............. SUCCESS [ 10.683 s]
[INFO] flink-stream-stateful-job-upgrade-test ............. SUCCESS [ 2.135 s]
[INFO] flink-queryable-state-test ......................... SUCCESS [ 3.740 s]
[INFO] flink-local-recovery-and-allocation-test ........... SUCCESS [ 1.511 s]
[INFO] flink-elasticsearch1-test .......................... SUCCESS [ 5.420 s]
[INFO] flink-elasticsearch2-test .......................... SUCCESS [ 5.705 s]
[INFO] flink-elasticsearch5-test .......................... SUCCESS [ 5.551 s]
[INFO] flink-elasticsearch6-test .......................... SUCCESS [ 5.891 s]
[INFO] flink-quickstart ................................... SUCCESS [ 6.517 s]
[INFO] flink-quickstart-java .............................. SUCCESS [ 11.493 s]
[INFO] flink-quickstart-scala ............................. SUCCESS [ 9.018 s]
[INFO] flink-quickstart-test .............................. SUCCESS [ 2.209 s]
[INFO] flink-confluent-schema-registry .................... SUCCESS [ 4.097 s]
[INFO] flink-stream-state-ttl-test ........................ SUCCESS [ 6.456 s]
[INFO] flink-sql-client-test .............................. SUCCESS [ 2.340 s]
[INFO] flink-streaming-file-sink-test ..................... SUCCESS [ 1.900 s]
[INFO] flink-state-evolution-test ......................... SUCCESS [ 5.235 s]
[INFO] flink-e2e-test-utils ............................... SUCCESS [ 9.904 s]
[INFO] flink-streaming-python ............................. SUCCESS [ 23.382 s]
[INFO] flink-mesos ........................................ SUCCESS [ 42.653 s]
[INFO] flink-yarn ......................................... SUCCESS [ 17.359 s]
[INFO] flink-gelly ........................................ SUCCESS [ 20.258 s]
[INFO] flink-gelly-scala .................................. SUCCESS [ 33.063 s]
[INFO] flink-gelly-examples ............................... SUCCESS [ 27.113 s]
[INFO] flink-metrics-dropwizard ........................... SUCCESS [ 12.477 s]
[INFO] flink-metrics-graphite ............................. SUCCESS [ 12.456 s]
[INFO] flink-metrics-influxdb ............................. SUCCESS [ 15.142 s]
[INFO] flink-metrics-prometheus ........................... SUCCESS [ 13.241 s]
[INFO] flink-metrics-statsd ............................... SUCCESS [ 11.942 s]
[INFO] flink-metrics-datadog .............................. SUCCESS [ 12.863 s]
[INFO] flink-metrics-slf4j ................................ SUCCESS [ 12.080 s]
[INFO] flink-python ....................................... SUCCESS [ 16.117 s]
[INFO] flink-cep-scala .................................... SUCCESS [ 23.559 s]
[INFO] flink-ml ........................................... SUCCESS [ 59.100 s]
[INFO] flink-ml-uber ...................................... SUCCESS [ 5.891 s]
[INFO] flink-table-uber ................................... SUCCESS [ 12.731 s]
[INFO] flink-sql-client ................................... SUCCESS [ 19.584 s]
[INFO] flink-scala-shell .................................. SUCCESS [ 27.393 s]
[INFO] flink-dist ......................................... SUCCESS [ 18.020 s]
[INFO] flink-end-to-end-tests-common ...................... SUCCESS [ 2.639 s]
[INFO] flink-metrics-availability-test .................... SUCCESS [ 0.327 s]
[INFO] flink-metrics-reporter-prometheus-test ............. SUCCESS [ 0.252 s]
[INFO] flink-heavy-deployment-stress-test ................. SUCCESS [ 10.009 s]
[INFO] flink-streaming-kafka-test-base .................... SUCCESS [ 2.041 s]
[INFO] flink-streaming-kafka-test ......................... SUCCESS [ 8.449 s]
[INFO] flink-streaming-kafka011-test ...................... SUCCESS [ 12.847 s]
[INFO] flink-streaming-kafka010-test ...................... SUCCESS [ 8.493 s]
[INFO] flink-streaming-kinesis-test ....................... FAILURE [ 0.503 s]
[INFO] flink-table-runtime-blink .......................... SKIPPED
[INFO] flink-table-planner-blink .......................... SKIPPED
[INFO] flink-contrib ...................................... SKIPPED
[INFO] flink-connector-wikiedits .......................... SKIPPED
[INFO] flink-yarn-tests ................................... SKIPPED
[INFO] flink-fs-tests ..................................... SKIPPED
[INFO] flink-docs ......................................... SKIPPED
[INFO] ------------------------------------------------------------------------
[INFO] BUILD FAILURE
[INFO] ------------------------------------------------------------------------
[INFO] Total time: 41:06 min
[INFO] Finished at: 2019-03-16T04:15:58+00:00
[INFO] Final Memory: 723M/10083M
[INFO] ------------------------------------------------------------------------
[ERROR] Failed to execute goal on project flink-streaming-kinesis-test_2.11: Could not resolve dependencies for project org.apache.flink:flink-streaming-kinesis-test_2.11:jar:1.9-SNAPSHOT: Could not find artifact org.apache.flink:flink-connector-kinesis_2.11:jar:1.9-SNAPSHOT in Nexus (http://repository.apache.org/snapshots) -> [Help 1]
[ERROR]
[ERROR] To see the full stack trace of the errors, re-run Maven with the -e switch.
[ERROR] Re-run Maven using the -X switch to enable full debug logging.
[ERROR]
[ERROR] For more information about the errors and possible solutions, please read the following articles:
[ERROR] [Help 1] http://cwiki.apache.org/confluence/display/MAVEN/DependencyResolutionException
[ERROR]
[ERROR] After correcting the problems, you can resume the build with the command
[ERROR] mvn <goals> -rf :flink-streaming-kinesis-test_2.11
Build step 'Execute shell' marked build as failure
Setting MAVEN_3_2_5_HOME=/home/jenkins/tools/maven/apache-maven-3.2.5
Jenkins build is back to normal : flink-snapshot-deployment #1137
Posted by Apache Jenkins Server <je...@builds.apache.org>.
See <https://builds.apache.org/job/flink-snapshot-deployment/1137/display/redirect>
Build failed in Jenkins: flink-snapshot-deployment #1136
Posted by Apache Jenkins Server <je...@builds.apache.org>.
See <https://builds.apache.org/job/flink-snapshot-deployment/1136/display/redirect>
------------------------------------------
[...truncated 1.88 MB...]
[INFO] Including org.apache.commons:commons-compress:jar:1.18 in the shaded jar.
[INFO] Including org.apache.flink:flink-java:jar:1.9-SNAPSHOT in the shaded jar.
[INFO] Including org.apache.flink:flink-shaded-asm-6:jar:6.2.1-6.0 in the shaded jar.
[INFO] Including org.apache.flink:flink-queryable-state-client-java_2.11:jar:1.9-SNAPSHOT in the shaded jar.
[INFO] Including org.apache.flink:flink-hadoop-fs:jar:1.9-SNAPSHOT in the shaded jar.
[INFO] Including commons-io:commons-io:jar:2.4 in the shaded jar.
[INFO] Including org.apache.flink:flink-shaded-netty:jar:4.1.32.Final-6.0 in the shaded jar.
[INFO] Including org.apache.flink:flink-shaded-asm:jar:5.0.4-6.0 in the shaded jar.
[INFO] Including org.apache.flink:flink-shaded-jackson:jar:2.7.9-6.0 in the shaded jar.
[INFO] Including org.apache.commons:commons-lang3:jar:3.3.2 in the shaded jar.
[INFO] Including commons-cli:commons-cli:jar:1.3.1 in the shaded jar.
[INFO] Including org.javassist:javassist:jar:3.19.0-GA in the shaded jar.
[INFO] Including com.typesafe.akka:akka-stream_2.11:jar:2.4.20 in the shaded jar.
[INFO] Including org.reactivestreams:reactive-streams:jar:1.0.0 in the shaded jar.
[INFO] Including com.typesafe:ssl-config-core_2.11:jar:0.2.1 in the shaded jar.
[INFO] Including org.scala-lang.modules:scala-parser-combinators_2.11:jar:1.0.4 in the shaded jar.
[INFO] Including com.typesafe.akka:akka-protobuf_2.11:jar:2.4.20 in the shaded jar.
[INFO] Including com.typesafe.akka:akka-slf4j_2.11:jar:2.4.20 in the shaded jar.
[INFO] Including org.clapper:grizzled-slf4j_2.11:jar:1.3.2 in the shaded jar.
[INFO] Including com.github.scopt:scopt_2.11:jar:3.5.0 in the shaded jar.
[INFO] Including com.twitter:chill_2.11:jar:0.7.6 in the shaded jar.
[INFO] Including com.twitter:chill-java:jar:0.7.6 in the shaded jar.
[INFO] Including org.apache.flink:flink-clients_2.11:jar:1.9-SNAPSHOT in the shaded jar.
[INFO] Including org.apache.flink:flink-optimizer_2.11:jar:1.9-SNAPSHOT in the shaded jar.
[INFO] Including org.apache.flink:flink-shaded-guava:jar:18.0-6.0 in the shaded jar.
[INFO] Including org.apache.commons:commons-math3:jar:3.5 in the shaded jar.
[INFO] Including org.apache.flink:force-shading:jar:1.9-SNAPSHOT in the shaded jar.
[INFO] Excluding org.slf4j:slf4j-api:jar:1.7.15 from the shaded jar.
[INFO] Excluding com.google.code.findbugs:jsr305:jar:1.3.9 from the shaded jar.
[INFO] Including org.objenesis:objenesis:jar:2.1 in the shaded jar.
[INFO] Including org.scala-lang:scala-library:jar:2.11.12 in the shaded jar.
[INFO] Including com.typesafe.akka:akka-actor_2.11:jar:2.4.20 in the shaded jar.
[INFO] Including com.typesafe:config:jar:1.3.0 in the shaded jar.
[INFO] Including org.scala-lang.modules:scala-java8-compat_2.11:jar:0.7.0 in the shaded jar.
[INFO] Replacing <https://builds.apache.org/job/flink-snapshot-deployment/ws/flink-end-to-end-tests/flink-streaming-kafka010-test/target/Kafka010Example.jar> with <https://builds.apache.org/job/flink-snapshot-deployment/ws/flink-end-to-end-tests/flink-streaming-kafka010-test/target/flink-streaming-kafka010-test_2.11-1.9-SNAPSHOT-shaded.jar>
[INFO]
[INFO] >>> maven-source-plugin:2.2.1:jar (attach-sources) > generate-sources @ flink-streaming-kafka010-test_2.11 >>>
[INFO]
[INFO] --- maven-checkstyle-plugin:2.17:check (validate) @ flink-streaming-kafka010-test_2.11 ---
[INFO]
[INFO] --- maven-enforcer-plugin:3.0.0-M1:enforce (enforce-maven-version) @ flink-streaming-kafka010-test_2.11 ---
[INFO]
[INFO] --- maven-enforcer-plugin:3.0.0-M1:enforce (enforce-maven) @ flink-streaming-kafka010-test_2.11 ---
[INFO]
[INFO] --- maven-enforcer-plugin:3.0.0-M1:enforce (enforce-versions) @ flink-streaming-kafka010-test_2.11 ---
[INFO]
[INFO] --- directory-maven-plugin:0.1:highest-basedir (directories) @ flink-streaming-kafka010-test_2.11 ---
[INFO] Highest basedir set to: <https://builds.apache.org/job/flink-snapshot-deployment/ws/>
[INFO]
[INFO] <<< maven-source-plugin:2.2.1:jar (attach-sources) < generate-sources @ flink-streaming-kafka010-test_2.11 <<<
[INFO]
[INFO] --- maven-source-plugin:2.2.1:jar (attach-sources) @ flink-streaming-kafka010-test_2.11 ---
[INFO] Building jar: <https://builds.apache.org/job/flink-snapshot-deployment/ws/flink-end-to-end-tests/flink-streaming-kafka010-test/target/flink-streaming-kafka010-test_2.11-1.9-SNAPSHOT-sources.jar>
[INFO]
[INFO] --- maven-javadoc-plugin:2.9.1:jar (attach-javadocs) @ flink-streaming-kafka010-test_2.11 ---
[INFO] Building jar: <https://builds.apache.org/job/flink-snapshot-deployment/ws/flink-end-to-end-tests/flink-streaming-kafka010-test/target/flink-streaming-kafka010-test_2.11-1.9-SNAPSHOT-javadoc.jar>
[INFO]
[INFO] --- maven-install-plugin:2.5.2:install (default-install) @ flink-streaming-kafka010-test_2.11 ---
[INFO] Installing <https://builds.apache.org/job/flink-snapshot-deployment/ws/flink-end-to-end-tests/flink-streaming-kafka010-test/target/flink-streaming-kafka010-test_2.11-1.9-SNAPSHOT.jar> to /home/jenkins/.m2/repository/org/apache/flink/flink-streaming-kafka010-test_2.11/1.9-SNAPSHOT/flink-streaming-kafka010-test_2.11-1.9-SNAPSHOT.jar
[INFO] Installing <https://builds.apache.org/job/flink-snapshot-deployment/ws/flink-end-to-end-tests/flink-streaming-kafka010-test/target/dependency-reduced-pom.xml> to /home/jenkins/.m2/repository/org/apache/flink/flink-streaming-kafka010-test_2.11/1.9-SNAPSHOT/flink-streaming-kafka010-test_2.11-1.9-SNAPSHOT.pom
[INFO] Installing <https://builds.apache.org/job/flink-snapshot-deployment/ws/flink-end-to-end-tests/flink-streaming-kafka010-test/target/flink-streaming-kafka010-test_2.11-1.9-SNAPSHOT-tests.jar> to /home/jenkins/.m2/repository/org/apache/flink/flink-streaming-kafka010-test_2.11/1.9-SNAPSHOT/flink-streaming-kafka010-test_2.11-1.9-SNAPSHOT-tests.jar
[INFO] Installing <https://builds.apache.org/job/flink-snapshot-deployment/ws/flink-end-to-end-tests/flink-streaming-kafka010-test/target/flink-streaming-kafka010-test_2.11-1.9-SNAPSHOT-sources.jar> to /home/jenkins/.m2/repository/org/apache/flink/flink-streaming-kafka010-test_2.11/1.9-SNAPSHOT/flink-streaming-kafka010-test_2.11-1.9-SNAPSHOT-sources.jar
[INFO] Installing <https://builds.apache.org/job/flink-snapshot-deployment/ws/flink-end-to-end-tests/flink-streaming-kafka010-test/target/flink-streaming-kafka010-test_2.11-1.9-SNAPSHOT-javadoc.jar> to /home/jenkins/.m2/repository/org/apache/flink/flink-streaming-kafka010-test_2.11/1.9-SNAPSHOT/flink-streaming-kafka010-test_2.11-1.9-SNAPSHOT-javadoc.jar
[INFO]
[INFO] --- maven-deploy-plugin:2.8.2:deploy (default-deploy) @ flink-streaming-kafka010-test_2.11 ---
[INFO] Skipping artifact deployment
[INFO]
[INFO] ------------------------------------------------------------------------
[INFO] Building flink-streaming-kinesis-test 1.9-SNAPSHOT
[INFO] ------------------------------------------------------------------------
[INFO] Downloading: http://repository.apache.org/snapshots/org/apache/flink/flink-connector-kinesis_2.11/1.9-SNAPSHOT/maven-metadata.xml
[INFO] Downloading: http://repository.apache.org/snapshots/org/apache/flink/flink-connector-kinesis_2.11/1.9-SNAPSHOT/flink-connector-kinesis_2.11-1.9-SNAPSHOT.pom
[WARNING] The POM for org.apache.flink:flink-connector-kinesis_2.11:jar:1.9-SNAPSHOT is missing, no dependency information available
[INFO] Downloading: http://repository.apache.org/snapshots/org/apache/flink/flink-connector-kinesis_2.11/1.9-SNAPSHOT/flink-connector-kinesis_2.11-1.9-SNAPSHOT.jar
[INFO] ------------------------------------------------------------------------
[INFO] Reactor Summary:
[INFO]
[INFO] force-shading ...................................... SUCCESS [ 8.637 s]
[INFO] flink .............................................. SUCCESS [ 7.288 s]
[INFO] flink-annotations .................................. SUCCESS [ 13.728 s]
[INFO] flink-shaded-hadoop ................................ SUCCESS [ 4.045 s]
[INFO] flink-shaded-hadoop2 ............................... SUCCESS [ 26.744 s]
[INFO] flink-shaded-hadoop2-uber .......................... SUCCESS [ 29.273 s]
[INFO] flink-shaded-yarn-tests ............................ SUCCESS [ 32.185 s]
[INFO] flink-shaded-curator ............................... SUCCESS [ 10.268 s]
[INFO] flink-metrics ...................................... SUCCESS [ 3.981 s]
[INFO] flink-metrics-core ................................. SUCCESS [ 17.033 s]
[INFO] flink-test-utils-parent ............................ SUCCESS [ 3.966 s]
[INFO] flink-test-utils-junit ............................. SUCCESS [ 13.429 s]
[INFO] flink-core ......................................... SUCCESS [ 50.678 s]
[INFO] flink-java ......................................... SUCCESS [ 26.822 s]
[INFO] flink-queryable-state .............................. SUCCESS [ 3.963 s]
[INFO] flink-queryable-state-client-java .................. SUCCESS [ 16.550 s]
[INFO] flink-filesystems .................................. SUCCESS [ 3.901 s]
[INFO] flink-hadoop-fs .................................... SUCCESS [ 15.802 s]
[INFO] flink-runtime ...................................... SUCCESS [01:55 min]
[INFO] flink-scala ........................................ SUCCESS [01:26 min]
[INFO] flink-mapr-fs ...................................... SUCCESS [ 13.619 s]
[INFO] flink-filesystems :: flink-fs-hadoop-shaded ........ SUCCESS [ 10.178 s]
[INFO] flink-s3-fs-base ................................... SUCCESS [ 14.218 s]
[INFO] flink-s3-fs-hadoop ................................. SUCCESS [ 21.649 s]
[INFO] flink-s3-fs-presto ................................. SUCCESS [ 33.394 s]
[INFO] flink-swift-fs-hadoop .............................. SUCCESS [ 53.027 s]
[INFO] flink-oss-fs-hadoop ................................ SUCCESS [ 22.454 s]
[INFO] flink-optimizer .................................... SUCCESS [ 22.448 s]
[INFO] flink-clients ...................................... SUCCESS [ 18.315 s]
[INFO] flink-streaming-java ............................... SUCCESS [ 41.790 s]
[INFO] flink-test-utils ................................... SUCCESS [ 20.169 s]
[INFO] flink-runtime-web .................................. SUCCESS [ 18.902 s]
[INFO] flink-examples ..................................... SUCCESS [ 4.122 s]
[INFO] flink-examples-batch ............................... SUCCESS [ 52.137 s]
[INFO] flink-connectors ................................... SUCCESS [ 4.034 s]
[INFO] flink-hadoop-compatibility ......................... SUCCESS [ 24.314 s]
[INFO] flink-state-backends ............................... SUCCESS [ 3.998 s]
[INFO] flink-statebackend-rocksdb ......................... SUCCESS [ 15.510 s]
[INFO] flink-tests ........................................ SUCCESS [01:10 min]
[INFO] flink-streaming-scala .............................. SUCCESS [01:10 min]
[INFO] flink-table ........................................ SUCCESS [ 4.005 s]
[INFO] flink-table-common ................................. SUCCESS [ 16.888 s]
[INFO] flink-table-api-java ............................... SUCCESS [ 12.361 s]
[INFO] flink-table-api-java-bridge ........................ SUCCESS [ 8.993 s]
[INFO] flink-libraries .................................... SUCCESS [ 3.952 s]
[INFO] flink-cep .......................................... SUCCESS [ 21.456 s]
[INFO] flink-table-planner ................................ SUCCESS [03:50 min]
[INFO] flink-orc .......................................... SUCCESS [ 14.484 s]
[INFO] flink-jdbc ......................................... SUCCESS [ 13.431 s]
[INFO] flink-hbase ........................................ SUCCESS [ 17.789 s]
[INFO] flink-hcatalog ..................................... SUCCESS [ 21.024 s]
[INFO] flink-metrics-jmx .................................. SUCCESS [ 12.698 s]
[INFO] flink-connector-kafka-base ......................... SUCCESS [ 19.778 s]
[INFO] flink-connector-kafka-0.9 .......................... SUCCESS [ 18.177 s]
[INFO] flink-connector-kafka-0.10 ......................... SUCCESS [ 17.558 s]
[INFO] flink-connector-kafka-0.11 ......................... SUCCESS [ 18.558 s]
[INFO] flink-formats ...................................... SUCCESS [ 3.951 s]
[INFO] flink-json ......................................... SUCCESS [ 14.874 s]
[INFO] flink-connector-elasticsearch-base ................. SUCCESS [ 17.174 s]
[INFO] flink-connector-elasticsearch ...................... SUCCESS [ 30.276 s]
[INFO] flink-connector-elasticsearch2 ..................... SUCCESS [ 34.559 s]
[INFO] flink-connector-elasticsearch5 ..................... SUCCESS [ 38.802 s]
[INFO] flink-connector-elasticsearch6 ..................... SUCCESS [ 15.332 s]
[INFO] flink-connector-rabbitmq ........................... SUCCESS [ 13.091 s]
[INFO] flink-connector-twitter ............................ SUCCESS [ 18.065 s]
[INFO] flink-connector-nifi ............................... SUCCESS [ 13.319 s]
[INFO] flink-connector-cassandra .......................... SUCCESS [ 18.040 s]
[INFO] flink-avro ......................................... SUCCESS [ 20.747 s]
[INFO] flink-connector-filesystem ......................... SUCCESS [ 14.767 s]
[INFO] flink-connector-kafka .............................. SUCCESS [ 18.410 s]
[INFO] flink-sql-connector-elasticsearch6 ................. SUCCESS [ 21.006 s]
[INFO] flink-sql-connector-kafka-0.9 ...................... SUCCESS [ 9.354 s]
[INFO] flink-sql-connector-kafka-0.10 ..................... SUCCESS [ 9.586 s]
[INFO] flink-sql-connector-kafka-0.11 ..................... SUCCESS [ 10.235 s]
[INFO] flink-sql-connector-kafka .......................... SUCCESS [ 8.599 s]
[INFO] flink-connector-kafka-0.8 .......................... SUCCESS [ 14.255 s]
[INFO] flink-avro-confluent-registry ...................... SUCCESS [ 13.683 s]
[INFO] flink-parquet ...................................... SUCCESS [ 14.386 s]
[INFO] flink-sequence-file ................................ SUCCESS [ 12.353 s]
[INFO] flink-csv .......................................... SUCCESS [ 14.813 s]
[INFO] flink-examples-streaming ........................... SUCCESS [ 55.915 s]
[INFO] flink-table-api-scala .............................. SUCCESS [ 8.800 s]
[INFO] flink-table-api-scala-bridge ....................... SUCCESS [ 8.951 s]
[INFO] flink-examples-table ............................... SUCCESS [ 28.127 s]
[INFO] flink-examples-build-helper ........................ SUCCESS [ 4.047 s]
[INFO] flink-examples-streaming-twitter ................... SUCCESS [ 1.273 s]
[INFO] flink-examples-streaming-state-machine ............. SUCCESS [ 0.693 s]
[INFO] flink-container .................................... SUCCESS [ 12.536 s]
[INFO] flink-queryable-state-runtime ...................... SUCCESS [ 15.672 s]
[INFO] flink-end-to-end-tests ............................. SUCCESS [ 0.066 s]
[INFO] flink-cli-test ..................................... SUCCESS [ 1.853 s]
[INFO] flink-parent-child-classloading-test-program ....... SUCCESS [ 1.929 s]
[INFO] flink-parent-child-classloading-test-lib-package ... SUCCESS [ 1.466 s]
[INFO] flink-dataset-allround-test ........................ SUCCESS [ 1.992 s]
[INFO] flink-datastream-allround-test ..................... SUCCESS [ 4.879 s]
[INFO] flink-stream-sql-test .............................. SUCCESS [ 2.396 s]
[INFO] flink-bucketing-sink-test .......................... SUCCESS [ 2.414 s]
[INFO] flink-distributed-cache-via-blob ................... SUCCESS [ 1.976 s]
[INFO] flink-high-parallelism-iterations-test ............. SUCCESS [ 10.917 s]
[INFO] flink-stream-stateful-job-upgrade-test ............. SUCCESS [ 3.171 s]
[INFO] flink-queryable-state-test ......................... SUCCESS [ 5.285 s]
[INFO] flink-local-recovery-and-allocation-test ........... SUCCESS [ 2.049 s]
[INFO] flink-elasticsearch1-test .......................... SUCCESS [ 5.392 s]
[INFO] flink-elasticsearch2-test .......................... SUCCESS [ 5.758 s]
[INFO] flink-elasticsearch5-test .......................... SUCCESS [ 6.363 s]
[INFO] flink-elasticsearch6-test .......................... SUCCESS [ 6.418 s]
[INFO] flink-quickstart ................................... SUCCESS [ 6.803 s]
[INFO] flink-quickstart-java .............................. SUCCESS [ 9.027 s]
[INFO] flink-quickstart-scala ............................. SUCCESS [ 8.688 s]
[INFO] flink-quickstart-test .............................. SUCCESS [ 2.193 s]
[INFO] flink-confluent-schema-registry .................... SUCCESS [ 4.582 s]
[INFO] flink-stream-state-ttl-test ........................ SUCCESS [ 7.350 s]
[INFO] flink-sql-client-test .............................. SUCCESS [ 2.568 s]
[INFO] flink-streaming-file-sink-test ..................... SUCCESS [ 2.143 s]
[INFO] flink-state-evolution-test ......................... SUCCESS [ 3.733 s]
[INFO] flink-e2e-test-utils ............................... SUCCESS [ 8.722 s]
[INFO] flink-streaming-python ............................. SUCCESS [ 23.686 s]
[INFO] flink-mesos ........................................ SUCCESS [ 50.287 s]
[INFO] flink-yarn ......................................... SUCCESS [ 17.358 s]
[INFO] flink-gelly ........................................ SUCCESS [ 21.598 s]
[INFO] flink-gelly-scala .................................. SUCCESS [ 40.053 s]
[INFO] flink-gelly-examples ............................... SUCCESS [ 31.192 s]
[INFO] flink-metrics-dropwizard ........................... SUCCESS [ 12.608 s]
[INFO] flink-metrics-graphite ............................. SUCCESS [ 12.026 s]
[INFO] flink-metrics-influxdb ............................. SUCCESS [ 13.817 s]
[INFO] flink-metrics-prometheus ........................... SUCCESS [ 13.006 s]
[INFO] flink-metrics-statsd ............................... SUCCESS [ 12.179 s]
[INFO] flink-metrics-datadog .............................. SUCCESS [ 13.018 s]
[INFO] flink-metrics-slf4j ................................ SUCCESS [ 11.971 s]
[INFO] flink-python ....................................... SUCCESS [ 16.471 s]
[INFO] flink-cep-scala .................................... SUCCESS [ 27.635 s]
[INFO] flink-ml ........................................... SUCCESS [01:19 min]
[INFO] flink-ml-uber ...................................... SUCCESS [ 5.864 s]
[INFO] flink-table-uber ................................... SUCCESS [ 13.145 s]
[INFO] flink-sql-client ................................... SUCCESS [ 20.713 s]
[INFO] flink-scala-shell .................................. SUCCESS [ 32.501 s]
[INFO] flink-dist ......................................... SUCCESS [ 19.642 s]
[INFO] flink-end-to-end-tests-common ...................... SUCCESS [ 3.059 s]
[INFO] flink-metrics-availability-test .................... SUCCESS [ 0.320 s]
[INFO] flink-metrics-reporter-prometheus-test ............. SUCCESS [ 0.262 s]
[INFO] flink-heavy-deployment-stress-test ................. SUCCESS [ 12.086 s]
[INFO] flink-streaming-kafka-test-base .................... SUCCESS [ 2.493 s]
[INFO] flink-streaming-kafka-test ......................... SUCCESS [ 9.988 s]
[INFO] flink-streaming-kafka011-test ...................... SUCCESS [ 9.418 s]
[INFO] flink-streaming-kafka010-test ...................... SUCCESS [ 8.988 s]
[INFO] flink-streaming-kinesis-test ....................... FAILURE [ 0.491 s]
[INFO] flink-table-runtime-blink .......................... SKIPPED
[INFO] flink-table-planner-blink .......................... SKIPPED
[INFO] flink-contrib ...................................... SKIPPED
[INFO] flink-connector-wikiedits .......................... SKIPPED
[INFO] flink-yarn-tests ................................... SKIPPED
[INFO] flink-fs-tests ..................................... SKIPPED
[INFO] flink-docs ......................................... SKIPPED
[INFO] ------------------------------------------------------------------------
[INFO] BUILD FAILURE
[INFO] ------------------------------------------------------------------------
[INFO] Total time: 44:31 min
[INFO] Finished at: 2019-03-18T04:18:59+00:00
[INFO] Final Memory: 1182M/10209M
[INFO] ------------------------------------------------------------------------
[ERROR] Failed to execute goal on project flink-streaming-kinesis-test_2.11: Could not resolve dependencies for project org.apache.flink:flink-streaming-kinesis-test_2.11:jar:1.9-SNAPSHOT: Could not find artifact org.apache.flink:flink-connector-kinesis_2.11:jar:1.9-SNAPSHOT in Nexus (http://repository.apache.org/snapshots) -> [Help 1]
[ERROR]
[ERROR] To see the full stack trace of the errors, re-run Maven with the -e switch.
[ERROR] Re-run Maven using the -X switch to enable full debug logging.
[ERROR]
[ERROR] For more information about the errors and possible solutions, please read the following articles:
[ERROR] [Help 1] http://cwiki.apache.org/confluence/display/MAVEN/DependencyResolutionException
[ERROR]
[ERROR] After correcting the problems, you can resume the build with the command
[ERROR] mvn <goals> -rf :flink-streaming-kinesis-test_2.11
Build step 'Execute shell' marked build as failure
Setting MAVEN_3_2_5_HOME=/home/jenkins/tools/maven/apache-maven-3.2.5
Build failed in Jenkins: flink-snapshot-deployment #1135
Posted by Apache Jenkins Server <je...@builds.apache.org>.
See <https://builds.apache.org/job/flink-snapshot-deployment/1135/display/redirect>
------------------------------------------
[...truncated 1.88 MB...]
[INFO] Including org.apache.commons:commons-compress:jar:1.18 in the shaded jar.
[INFO] Including org.apache.flink:flink-java:jar:1.9-SNAPSHOT in the shaded jar.
[INFO] Including org.apache.flink:flink-shaded-asm-6:jar:6.2.1-6.0 in the shaded jar.
[INFO] Including org.apache.flink:flink-queryable-state-client-java_2.11:jar:1.9-SNAPSHOT in the shaded jar.
[INFO] Including org.apache.flink:flink-hadoop-fs:jar:1.9-SNAPSHOT in the shaded jar.
[INFO] Including commons-io:commons-io:jar:2.4 in the shaded jar.
[INFO] Including org.apache.flink:flink-shaded-netty:jar:4.1.32.Final-6.0 in the shaded jar.
[INFO] Including org.apache.flink:flink-shaded-asm:jar:5.0.4-6.0 in the shaded jar.
[INFO] Including org.apache.flink:flink-shaded-jackson:jar:2.7.9-6.0 in the shaded jar.
[INFO] Including org.apache.commons:commons-lang3:jar:3.3.2 in the shaded jar.
[INFO] Including commons-cli:commons-cli:jar:1.3.1 in the shaded jar.
[INFO] Including org.javassist:javassist:jar:3.19.0-GA in the shaded jar.
[INFO] Including com.typesafe.akka:akka-stream_2.11:jar:2.4.20 in the shaded jar.
[INFO] Including org.reactivestreams:reactive-streams:jar:1.0.0 in the shaded jar.
[INFO] Including com.typesafe:ssl-config-core_2.11:jar:0.2.1 in the shaded jar.
[INFO] Including org.scala-lang.modules:scala-parser-combinators_2.11:jar:1.0.4 in the shaded jar.
[INFO] Including com.typesafe.akka:akka-protobuf_2.11:jar:2.4.20 in the shaded jar.
[INFO] Including com.typesafe.akka:akka-slf4j_2.11:jar:2.4.20 in the shaded jar.
[INFO] Including org.clapper:grizzled-slf4j_2.11:jar:1.3.2 in the shaded jar.
[INFO] Including com.github.scopt:scopt_2.11:jar:3.5.0 in the shaded jar.
[INFO] Including com.twitter:chill_2.11:jar:0.7.6 in the shaded jar.
[INFO] Including com.twitter:chill-java:jar:0.7.6 in the shaded jar.
[INFO] Including org.apache.flink:flink-clients_2.11:jar:1.9-SNAPSHOT in the shaded jar.
[INFO] Including org.apache.flink:flink-optimizer_2.11:jar:1.9-SNAPSHOT in the shaded jar.
[INFO] Including org.apache.flink:flink-shaded-guava:jar:18.0-6.0 in the shaded jar.
[INFO] Including org.apache.commons:commons-math3:jar:3.5 in the shaded jar.
[INFO] Including org.apache.flink:force-shading:jar:1.9-SNAPSHOT in the shaded jar.
[INFO] Excluding org.slf4j:slf4j-api:jar:1.7.15 from the shaded jar.
[INFO] Excluding com.google.code.findbugs:jsr305:jar:1.3.9 from the shaded jar.
[INFO] Including org.objenesis:objenesis:jar:2.1 in the shaded jar.
[INFO] Including org.scala-lang:scala-library:jar:2.11.12 in the shaded jar.
[INFO] Including com.typesafe.akka:akka-actor_2.11:jar:2.4.20 in the shaded jar.
[INFO] Including com.typesafe:config:jar:1.3.0 in the shaded jar.
[INFO] Including org.scala-lang.modules:scala-java8-compat_2.11:jar:0.7.0 in the shaded jar.
[INFO] Replacing <https://builds.apache.org/job/flink-snapshot-deployment/ws/flink-end-to-end-tests/flink-streaming-kafka010-test/target/Kafka010Example.jar> with <https://builds.apache.org/job/flink-snapshot-deployment/ws/flink-end-to-end-tests/flink-streaming-kafka010-test/target/flink-streaming-kafka010-test_2.11-1.9-SNAPSHOT-shaded.jar>
[INFO]
[INFO] >>> maven-source-plugin:2.2.1:jar (attach-sources) > generate-sources @ flink-streaming-kafka010-test_2.11 >>>
[INFO]
[INFO] --- maven-checkstyle-plugin:2.17:check (validate) @ flink-streaming-kafka010-test_2.11 ---
[INFO]
[INFO] --- maven-enforcer-plugin:3.0.0-M1:enforce (enforce-maven-version) @ flink-streaming-kafka010-test_2.11 ---
[INFO]
[INFO] --- maven-enforcer-plugin:3.0.0-M1:enforce (enforce-maven) @ flink-streaming-kafka010-test_2.11 ---
[INFO]
[INFO] --- maven-enforcer-plugin:3.0.0-M1:enforce (enforce-versions) @ flink-streaming-kafka010-test_2.11 ---
[INFO]
[INFO] --- directory-maven-plugin:0.1:highest-basedir (directories) @ flink-streaming-kafka010-test_2.11 ---
[INFO] Highest basedir set to: <https://builds.apache.org/job/flink-snapshot-deployment/ws/>
[INFO]
[INFO] <<< maven-source-plugin:2.2.1:jar (attach-sources) < generate-sources @ flink-streaming-kafka010-test_2.11 <<<
[INFO]
[INFO] --- maven-source-plugin:2.2.1:jar (attach-sources) @ flink-streaming-kafka010-test_2.11 ---
[INFO] Building jar: <https://builds.apache.org/job/flink-snapshot-deployment/ws/flink-end-to-end-tests/flink-streaming-kafka010-test/target/flink-streaming-kafka010-test_2.11-1.9-SNAPSHOT-sources.jar>
[INFO]
[INFO] --- maven-javadoc-plugin:2.9.1:jar (attach-javadocs) @ flink-streaming-kafka010-test_2.11 ---
[INFO] Building jar: <https://builds.apache.org/job/flink-snapshot-deployment/ws/flink-end-to-end-tests/flink-streaming-kafka010-test/target/flink-streaming-kafka010-test_2.11-1.9-SNAPSHOT-javadoc.jar>
[INFO]
[INFO] --- maven-install-plugin:2.5.2:install (default-install) @ flink-streaming-kafka010-test_2.11 ---
[INFO] Installing <https://builds.apache.org/job/flink-snapshot-deployment/ws/flink-end-to-end-tests/flink-streaming-kafka010-test/target/flink-streaming-kafka010-test_2.11-1.9-SNAPSHOT.jar> to /home/jenkins/.m2/repository/org/apache/flink/flink-streaming-kafka010-test_2.11/1.9-SNAPSHOT/flink-streaming-kafka010-test_2.11-1.9-SNAPSHOT.jar
[INFO] Installing <https://builds.apache.org/job/flink-snapshot-deployment/ws/flink-end-to-end-tests/flink-streaming-kafka010-test/target/dependency-reduced-pom.xml> to /home/jenkins/.m2/repository/org/apache/flink/flink-streaming-kafka010-test_2.11/1.9-SNAPSHOT/flink-streaming-kafka010-test_2.11-1.9-SNAPSHOT.pom
[INFO] Installing <https://builds.apache.org/job/flink-snapshot-deployment/ws/flink-end-to-end-tests/flink-streaming-kafka010-test/target/flink-streaming-kafka010-test_2.11-1.9-SNAPSHOT-tests.jar> to /home/jenkins/.m2/repository/org/apache/flink/flink-streaming-kafka010-test_2.11/1.9-SNAPSHOT/flink-streaming-kafka010-test_2.11-1.9-SNAPSHOT-tests.jar
[INFO] Installing <https://builds.apache.org/job/flink-snapshot-deployment/ws/flink-end-to-end-tests/flink-streaming-kafka010-test/target/flink-streaming-kafka010-test_2.11-1.9-SNAPSHOT-sources.jar> to /home/jenkins/.m2/repository/org/apache/flink/flink-streaming-kafka010-test_2.11/1.9-SNAPSHOT/flink-streaming-kafka010-test_2.11-1.9-SNAPSHOT-sources.jar
[INFO] Installing <https://builds.apache.org/job/flink-snapshot-deployment/ws/flink-end-to-end-tests/flink-streaming-kafka010-test/target/flink-streaming-kafka010-test_2.11-1.9-SNAPSHOT-javadoc.jar> to /home/jenkins/.m2/repository/org/apache/flink/flink-streaming-kafka010-test_2.11/1.9-SNAPSHOT/flink-streaming-kafka010-test_2.11-1.9-SNAPSHOT-javadoc.jar
[INFO]
[INFO] --- maven-deploy-plugin:2.8.2:deploy (default-deploy) @ flink-streaming-kafka010-test_2.11 ---
[INFO] Skipping artifact deployment
[INFO]
[INFO] ------------------------------------------------------------------------
[INFO] Building flink-streaming-kinesis-test 1.9-SNAPSHOT
[INFO] ------------------------------------------------------------------------
[INFO] Downloading: http://repository.apache.org/snapshots/org/apache/flink/flink-connector-kinesis_2.11/1.9-SNAPSHOT/maven-metadata.xml
[INFO] Downloading: http://repository.apache.org/snapshots/org/apache/flink/flink-connector-kinesis_2.11/1.9-SNAPSHOT/flink-connector-kinesis_2.11-1.9-SNAPSHOT.pom
[WARNING] The POM for org.apache.flink:flink-connector-kinesis_2.11:jar:1.9-SNAPSHOT is missing, no dependency information available
[INFO] Downloading: http://repository.apache.org/snapshots/org/apache/flink/flink-connector-kinesis_2.11/1.9-SNAPSHOT/flink-connector-kinesis_2.11-1.9-SNAPSHOT.jar
[INFO] ------------------------------------------------------------------------
[INFO] Reactor Summary:
[INFO]
[INFO] force-shading ...................................... SUCCESS [ 8.612 s]
[INFO] flink .............................................. SUCCESS [ 6.729 s]
[INFO] flink-annotations .................................. SUCCESS [ 14.221 s]
[INFO] flink-shaded-hadoop ................................ SUCCESS [ 4.203 s]
[INFO] flink-shaded-hadoop2 ............................... SUCCESS [ 23.479 s]
[INFO] flink-shaded-hadoop2-uber .......................... SUCCESS [ 26.791 s]
[INFO] flink-shaded-yarn-tests ............................ SUCCESS [ 30.220 s]
[INFO] flink-shaded-curator ............................... SUCCESS [ 10.740 s]
[INFO] flink-metrics ...................................... SUCCESS [ 4.093 s]
[INFO] flink-metrics-core ................................. SUCCESS [ 16.542 s]
[INFO] flink-test-utils-parent ............................ SUCCESS [ 4.075 s]
[INFO] flink-test-utils-junit ............................. SUCCESS [ 13.044 s]
[INFO] flink-core ......................................... SUCCESS [ 42.211 s]
[INFO] flink-java ......................................... SUCCESS [ 23.687 s]
[INFO] flink-queryable-state .............................. SUCCESS [ 4.065 s]
[INFO] flink-queryable-state-client-java .................. SUCCESS [ 16.276 s]
[INFO] flink-filesystems .................................. SUCCESS [ 4.116 s]
[INFO] flink-hadoop-fs .................................... SUCCESS [ 15.546 s]
[INFO] flink-runtime ...................................... SUCCESS [01:34 min]
[INFO] flink-scala ........................................ SUCCESS [01:08 min]
[INFO] flink-mapr-fs ...................................... SUCCESS [ 13.045 s]
[INFO] flink-filesystems :: flink-fs-hadoop-shaded ........ SUCCESS [ 7.897 s]
[INFO] flink-s3-fs-base ................................... SUCCESS [ 11.310 s]
[INFO] flink-s3-fs-hadoop ................................. SUCCESS [ 20.318 s]
[INFO] flink-s3-fs-presto ................................. SUCCESS [ 30.922 s]
[INFO] flink-swift-fs-hadoop .............................. SUCCESS [ 44.850 s]
[INFO] flink-oss-fs-hadoop ................................ SUCCESS [ 18.416 s]
[INFO] flink-optimizer .................................... SUCCESS [ 20.584 s]
[INFO] flink-clients ...................................... SUCCESS [ 18.253 s]
[INFO] flink-streaming-java ............................... SUCCESS [ 33.037 s]
[INFO] flink-test-utils ................................... SUCCESS [ 18.079 s]
[INFO] flink-runtime-web .................................. SUCCESS [ 17.784 s]
[INFO] flink-examples ..................................... SUCCESS [ 4.269 s]
[INFO] flink-examples-batch ............................... SUCCESS [ 45.783 s]
[INFO] flink-connectors ................................... SUCCESS [ 4.139 s]
[INFO] flink-hadoop-compatibility ......................... SUCCESS [ 21.670 s]
[INFO] flink-state-backends ............................... SUCCESS [ 4.116 s]
[INFO] flink-statebackend-rocksdb ......................... SUCCESS [ 15.661 s]
[INFO] flink-tests ........................................ SUCCESS [ 55.292 s]
[INFO] flink-streaming-scala .............................. SUCCESS [ 55.424 s]
[INFO] flink-table ........................................ SUCCESS [ 4.077 s]
[INFO] flink-table-common ................................. SUCCESS [ 16.974 s]
[INFO] flink-table-api-java ............................... SUCCESS [ 12.144 s]
[INFO] flink-table-api-java-bridge ........................ SUCCESS [ 9.017 s]
[INFO] flink-libraries .................................... SUCCESS [ 4.055 s]
[INFO] flink-cep .......................................... SUCCESS [ 20.300 s]
[INFO] flink-table-planner ................................ SUCCESS [02:56 min]
[INFO] flink-orc .......................................... SUCCESS [ 13.812 s]
[INFO] flink-jdbc ......................................... SUCCESS [ 13.113 s]
[INFO] flink-hbase ........................................ SUCCESS [ 16.650 s]
[INFO] flink-hcatalog ..................................... SUCCESS [ 18.892 s]
[INFO] flink-metrics-jmx .................................. SUCCESS [ 12.477 s]
[INFO] flink-connector-kafka-base ......................... SUCCESS [ 19.034 s]
[INFO] flink-connector-kafka-0.9 .......................... SUCCESS [ 17.665 s]
[INFO] flink-connector-kafka-0.10 ......................... SUCCESS [ 17.565 s]
[INFO] flink-connector-kafka-0.11 ......................... SUCCESS [ 17.993 s]
[INFO] flink-formats ...................................... SUCCESS [ 4.092 s]
[INFO] flink-json ......................................... SUCCESS [ 14.648 s]
[INFO] flink-connector-elasticsearch-base ................. SUCCESS [ 17.251 s]
[INFO] flink-connector-elasticsearch ...................... SUCCESS [ 28.736 s]
[INFO] flink-connector-elasticsearch2 ..................... SUCCESS [ 32.952 s]
[INFO] flink-connector-elasticsearch5 ..................... SUCCESS [ 35.821 s]
[INFO] flink-connector-elasticsearch6 ..................... SUCCESS [ 15.001 s]
[INFO] flink-connector-rabbitmq ........................... SUCCESS [ 12.949 s]
[INFO] flink-connector-twitter ............................ SUCCESS [ 17.501 s]
[INFO] flink-connector-nifi ............................... SUCCESS [ 13.156 s]
[INFO] flink-connector-cassandra .......................... SUCCESS [ 17.151 s]
[INFO] flink-avro ......................................... SUCCESS [ 20.000 s]
[INFO] flink-connector-filesystem ......................... SUCCESS [ 13.938 s]
[INFO] flink-connector-kafka .............................. SUCCESS [ 17.986 s]
[INFO] flink-sql-connector-elasticsearch6 ................. SUCCESS [ 19.761 s]
[INFO] flink-sql-connector-kafka-0.9 ...................... SUCCESS [ 9.491 s]
[INFO] flink-sql-connector-kafka-0.10 ..................... SUCCESS [ 9.774 s]
[INFO] flink-sql-connector-kafka-0.11 ..................... SUCCESS [ 10.115 s]
[INFO] flink-sql-connector-kafka .......................... SUCCESS [ 8.534 s]
[INFO] flink-connector-kafka-0.8 .......................... SUCCESS [ 13.646 s]
[INFO] flink-avro-confluent-registry ...................... SUCCESS [ 13.097 s]
[INFO] flink-parquet ...................................... SUCCESS [ 13.844 s]
[INFO] flink-sequence-file ................................ SUCCESS [ 12.211 s]
[INFO] flink-csv .......................................... SUCCESS [ 14.782 s]
[INFO] flink-examples-streaming ........................... SUCCESS [ 51.170 s]
[INFO] flink-table-api-scala .............................. SUCCESS [ 8.714 s]
[INFO] flink-table-api-scala-bridge ....................... SUCCESS [ 8.958 s]
[INFO] flink-examples-table ............................... SUCCESS [ 24.216 s]
[INFO] flink-examples-build-helper ........................ SUCCESS [ 4.162 s]
[INFO] flink-examples-streaming-twitter ................... SUCCESS [ 1.014 s]
[INFO] flink-examples-streaming-state-machine ............. SUCCESS [ 0.520 s]
[INFO] flink-container .................................... SUCCESS [ 12.146 s]
[INFO] flink-queryable-state-runtime ...................... SUCCESS [ 15.492 s]
[INFO] flink-end-to-end-tests ............................. SUCCESS [ 0.072 s]
[INFO] flink-cli-test ..................................... SUCCESS [ 1.711 s]
[INFO] flink-parent-child-classloading-test-program ....... SUCCESS [ 1.665 s]
[INFO] flink-parent-child-classloading-test-lib-package ... SUCCESS [ 1.370 s]
[INFO] flink-dataset-allround-test ........................ SUCCESS [ 1.567 s]
[INFO] flink-datastream-allround-test ..................... SUCCESS [ 3.879 s]
[INFO] flink-stream-sql-test .............................. SUCCESS [ 1.898 s]
[INFO] flink-bucketing-sink-test .......................... SUCCESS [ 2.081 s]
[INFO] flink-distributed-cache-via-blob ................... SUCCESS [ 1.612 s]
[INFO] flink-high-parallelism-iterations-test ............. SUCCESS [ 9.696 s]
[INFO] flink-stream-stateful-job-upgrade-test ............. SUCCESS [ 3.075 s]
[INFO] flink-queryable-state-test ......................... SUCCESS [ 4.018 s]
[INFO] flink-local-recovery-and-allocation-test ........... SUCCESS [ 1.701 s]
[INFO] flink-elasticsearch1-test .......................... SUCCESS [ 4.516 s]
[INFO] flink-elasticsearch2-test .......................... SUCCESS [ 4.861 s]
[INFO] flink-elasticsearch5-test .......................... SUCCESS [ 5.663 s]
[INFO] flink-elasticsearch6-test .......................... SUCCESS [ 5.624 s]
[INFO] flink-quickstart ................................... SUCCESS [ 6.915 s]
[INFO] flink-quickstart-java .............................. SUCCESS [ 9.162 s]
[INFO] flink-quickstart-scala ............................. SUCCESS [ 8.660 s]
[INFO] flink-quickstart-test .............................. SUCCESS [ 1.690 s]
[INFO] flink-confluent-schema-registry .................... SUCCESS [ 7.521 s]
[INFO] flink-stream-state-ttl-test ........................ SUCCESS [ 6.643 s]
[INFO] flink-sql-client-test .............................. SUCCESS [ 2.353 s]
[INFO] flink-streaming-file-sink-test ..................... SUCCESS [ 1.537 s]
[INFO] flink-state-evolution-test ......................... SUCCESS [ 2.943 s]
[INFO] flink-e2e-test-utils ............................... SUCCESS [ 7.769 s]
[INFO] flink-streaming-python ............................. SUCCESS [ 23.068 s]
[INFO] flink-mesos ........................................ SUCCESS [ 42.362 s]
[INFO] flink-yarn ......................................... SUCCESS [ 16.139 s]
[INFO] flink-gelly ........................................ SUCCESS [ 19.290 s]
[INFO] flink-gelly-scala .................................. SUCCESS [ 33.184 s]
[INFO] flink-gelly-examples ............................... SUCCESS [ 26.199 s]
[INFO] flink-metrics-dropwizard ........................... SUCCESS [ 12.445 s]
[INFO] flink-metrics-graphite ............................. SUCCESS [ 11.904 s]
[INFO] flink-metrics-influxdb ............................. SUCCESS [ 13.498 s]
[INFO] flink-metrics-prometheus ........................... SUCCESS [ 12.667 s]
[INFO] flink-metrics-statsd ............................... SUCCESS [ 11.779 s]
[INFO] flink-metrics-datadog .............................. SUCCESS [ 12.637 s]
[INFO] flink-metrics-slf4j ................................ SUCCESS [ 11.881 s]
[INFO] flink-python ....................................... SUCCESS [ 35.841 s]
[INFO] flink-cep-scala .................................... SUCCESS [ 45.689 s]
[INFO] flink-ml ........................................... SUCCESS [01:02 min]
[INFO] flink-ml-uber ...................................... SUCCESS [ 5.431 s]
[INFO] flink-table-uber ................................... SUCCESS [ 12.613 s]
[INFO] flink-sql-client ................................... SUCCESS [ 18.675 s]
[INFO] flink-scala-shell .................................. SUCCESS [ 28.034 s]
[INFO] flink-dist ......................................... SUCCESS [ 17.452 s]
[INFO] flink-end-to-end-tests-common ...................... SUCCESS [ 2.204 s]
[INFO] flink-metrics-availability-test .................... SUCCESS [ 0.209 s]
[INFO] flink-metrics-reporter-prometheus-test ............. SUCCESS [ 0.192 s]
[INFO] flink-heavy-deployment-stress-test ................. SUCCESS [ 9.453 s]
[INFO] flink-streaming-kafka-test-base .................... SUCCESS [ 1.935 s]
[INFO] flink-streaming-kafka-test ......................... SUCCESS [ 9.329 s]
[INFO] flink-streaming-kafka011-test ...................... SUCCESS [ 9.747 s]
[INFO] flink-streaming-kafka010-test ...................... SUCCESS [ 7.877 s]
[INFO] flink-streaming-kinesis-test ....................... FAILURE [ 0.514 s]
[INFO] flink-table-runtime-blink .......................... SKIPPED
[INFO] flink-table-planner-blink .......................... SKIPPED
[INFO] flink-contrib ...................................... SKIPPED
[INFO] flink-connector-wikiedits .......................... SKIPPED
[INFO] flink-yarn-tests ................................... SKIPPED
[INFO] flink-fs-tests ..................................... SKIPPED
[INFO] flink-docs ......................................... SKIPPED
[INFO] ------------------------------------------------------------------------
[INFO] BUILD FAILURE
[INFO] ------------------------------------------------------------------------
[INFO] Total time: 40:24 min
[INFO] Finished at: 2019-03-17T04:14:49+00:00
[INFO] Final Memory: 1288M/9585M
[INFO] ------------------------------------------------------------------------
[ERROR] Failed to execute goal on project flink-streaming-kinesis-test_2.11: Could not resolve dependencies for project org.apache.flink:flink-streaming-kinesis-test_2.11:jar:1.9-SNAPSHOT: Could not find artifact org.apache.flink:flink-connector-kinesis_2.11:jar:1.9-SNAPSHOT in Nexus (http://repository.apache.org/snapshots) -> [Help 1]
[ERROR]
[ERROR] To see the full stack trace of the errors, re-run Maven with the -e switch.
[ERROR] Re-run Maven using the -X switch to enable full debug logging.
[ERROR]
[ERROR] For more information about the errors and possible solutions, please read the following articles:
[ERROR] [Help 1] http://cwiki.apache.org/confluence/display/MAVEN/DependencyResolutionException
[ERROR]
[ERROR] After correcting the problems, you can resume the build with the command
[ERROR] mvn <goals> -rf :flink-streaming-kinesis-test_2.11
Build step 'Execute shell' marked build as failure
Setting MAVEN_3_2_5_HOME=/home/jenkins/tools/maven/apache-maven-3.2.5