You are viewing a plain text version of this content. The canonical link for it is here.
Posted to dev@joshua.apache.org by Apache Jenkins Server <je...@builds.apache.org> on 2016/05/31 16:15:53 UTC

Build failed in Jenkins: joshua_master #41

See <https://builds.apache.org/job/joshua_master/41/changes>

Changes:

[post] added comments clarifying importance of a weird vocab call

[post] removed unused file

[post] made a place for constants and pushed a few things into it

[fhieber] StructuredTranslation objects can now be generated from KBest

[fhieber] Handled an edge case where a null hypergraph with topn!=0 would not

[fhieber] Fixed Word Alignment code using linked lists

[fhieber] revert change to ivy.xml

------------------------------------------
[...truncated 37 lines...]
[ivy:configure] :: Ivy 2.2.0 - 20100923230623 :: http://ant.apache.org/ivy/ ::
[ivy:configure] :: loading settings :: file = <https://builds.apache.org/job/joshua_master/ws/lib/ivysettings.xml>
[ivy:resolve] :: resolving dependencies :: joshua#joshua;working@proserpina.apache.org
[ivy:resolve] 	confs: [default]
[ivy:resolve] 	found net.sf.jung#jung-algorithms;2.0 in central
[ivy:resolve] 	found net.sf.jung#jung-api;2.0 in central
[ivy:resolve] 	found net.sourceforge.collections#collections-generic;4.01 in central
[ivy:resolve] 	found colt#colt;1.2.0 in central
[ivy:resolve] 	found concurrent#concurrent;1.3.4 in central
[ivy:resolve] 	found net.sf.jung#jung-graph-impl;2.0 in central
[ivy:resolve] 	found net.sf.jung#jung-visualization;2.0 in central
[ivy:resolve] 	found org.testng#testng;6.7 in central
[ivy:resolve] 	found junit#junit;4.10 in central
[ivy:resolve] 	found org.hamcrest#hamcrest-core;1.1 in central
[ivy:resolve] 	found org.beanshell#bsh;2.0b4 in central
[ivy:resolve] 	found com.beust#jcommander;1.12 in central
[ivy:resolve] 	found org.yaml#snakeyaml;1.6 in central
[ivy:resolve] 	found com.google.inject#guice;2.0 in central
[ivy:resolve] 	found aopalliance#aopalliance;1.0 in central
[ivy:resolve] 	found org.apache.ant#ant;1.7.0 in central
[ivy:resolve] 	found org.apache.ant#ant-launcher;1.7.0 in central
[ivy:resolve] 	found args4j#args4j;2.0.29 in central
[ivy:resolve] 	found com.google.code.gson#gson;2.5 in central
[ivy:resolve] 	found com.google.guava#guava;19.0 in central
[ivy:resolve] 	found com.google.code.findbugs#jsr305;1.3.9 in central
[ivy:resolve] 	found com.google.errorprone#error_prone_annotations;2.0.2 in central
[ivy:resolve] 	found com.google.j2objc#j2objc-annotations;0.1 in central
[ivy:resolve] 	found org.codehaus.mojo#animal-sniffer-annotations;1.14 in central
[ivy:resolve] downloading http://repo1.maven.org/maven2/net/sf/jung/jung-algorithms/2.0/jung-algorithms-2.0-sources.jar ...
[ivy:resolve] ............. (203kB)
[ivy:resolve] .. (0kB)
[ivy:resolve] 	[SUCCESSFUL ] net.sf.jung#jung-algorithms;2.0!jung-algorithms.jar(source) (313ms)
[ivy:resolve] downloading http://repo1.maven.org/maven2/net/sf/jung/jung-algorithms/2.0/jung-algorithms-2.0.jar ...
[ivy:resolve] ........... (229kB)
[ivy:resolve] .. (0kB)
[ivy:resolve] 	[SUCCESSFUL ] net.sf.jung#jung-algorithms;2.0!jung-algorithms.jar (187ms)
[ivy:resolve] downloading http://repo1.maven.org/maven2/net/sf/jung/jung-api/2.0/jung-api-2.0.jar ...
[ivy:resolve] .. (39kB)
[ivy:resolve] .. (0kB)
[ivy:resolve] 	[SUCCESSFUL ] net.sf.jung#jung-api;2.0!jung-api.jar (195ms)
[ivy:resolve] downloading http://repo1.maven.org/maven2/net/sf/jung/jung-api/2.0/jung-api-2.0-sources.jar ...
[ivy:resolve] .. (30kB)
[ivy:resolve] .. (0kB)
[ivy:resolve] 	[SUCCESSFUL ] net.sf.jung#jung-api;2.0!jung-api.jar(source) (222ms)
[ivy:resolve] downloading http://repo1.maven.org/maven2/net/sf/jung/jung-graph-impl/2.0/jung-graph-impl-2.0-sources.jar ...
[ivy:resolve] .. (35kB)
[ivy:resolve] .. (0kB)
[ivy:resolve] 	[SUCCESSFUL ] net.sf.jung#jung-graph-impl;2.0!jung-graph-impl.jar(source) (233ms)
[ivy:resolve] downloading http://repo1.maven.org/maven2/net/sf/jung/jung-graph-impl/2.0/jung-graph-impl-2.0.jar ...
[ivy:resolve] ... (60kB)
[ivy:resolve] .. (0kB)
[ivy:resolve] 	[SUCCESSFUL ] net.sf.jung#jung-graph-impl;2.0!jung-graph-impl.jar (233ms)
[ivy:resolve] downloading http://repo1.maven.org/maven2/net/sf/jung/jung-visualization/2.0/jung-visualization-2.0-sources.jar ...
[ivy:resolve] ......... (210kB)
[ivy:resolve] .. (0kB)
[ivy:resolve] 	[SUCCESSFUL ] net.sf.jung#jung-visualization;2.0!jung-visualization.jar(source) (219ms)
[ivy:resolve] downloading http://repo1.maven.org/maven2/net/sf/jung/jung-visualization/2.0/jung-visualization-2.0.jar ...
[ivy:resolve] ...... (314kB)
[ivy:resolve] .. (0kB)
[ivy:resolve] 	[SUCCESSFUL ] net.sf.jung#jung-visualization;2.0!jung-visualization.jar (204ms)
[ivy:resolve] downloading http://repo1.maven.org/maven2/org/testng/testng/6.7/testng-6.7-javadoc.jar ...
[ivy:resolve] ......................................................... (1272kB)
[ivy:resolve] .. (0kB)
[ivy:resolve] 	[SUCCESSFUL ] org.testng#testng;6.7!testng.jar(javadoc) (272ms)
[ivy:resolve] downloading http://repo1.maven.org/maven2/org/testng/testng/6.7/testng-6.7-sources.jar ...
[ivy:resolve] ..................... (466kB)
[ivy:resolve] .. (0kB)
[ivy:resolve] 	[SUCCESSFUL ] org.testng#testng;6.7!testng.jar(source) (200ms)
[ivy:resolve] downloading http://repo1.maven.org/maven2/org/testng/testng/6.7/testng-6.7.jar ...
[ivy:resolve] .................................. (735kB)
[ivy:resolve] .. (0kB)
[ivy:resolve] 	[SUCCESSFUL ] org.testng#testng;6.7!testng.jar (200ms)
[ivy:resolve] downloading http://repo1.maven.org/maven2/junit/junit/4.10/junit-4.10.jar ...
[ivy:resolve] ........... (247kB)
[ivy:resolve] .. (0kB)
[ivy:resolve] 	[SUCCESSFUL ] junit#junit;4.10!junit.jar (202ms)
[ivy:resolve] downloading http://repo1.maven.org/maven2/junit/junit/4.10/junit-4.10-javadoc.jar ...
[ivy:resolve] ................... (414kB)
[ivy:resolve] .. (0kB)
[ivy:resolve] 	[SUCCESSFUL ] junit#junit;4.10!junit.jar(javadoc) (195ms)
[ivy:resolve] downloading http://repo1.maven.org/maven2/junit/junit/4.10/junit-4.10-sources.jar ...
[ivy:resolve] ....... (137kB)
[ivy:resolve] .. (0kB)
[ivy:resolve] 	[SUCCESSFUL ] junit#junit;4.10!junit.jar(source) (194ms)
[ivy:resolve] downloading http://repo1.maven.org/maven2/net/sourceforge/collections/collections-generic/4.01/collections-generic-4.01-javadoc.jar ...
[ivy:resolve] ................................................................................................................. (1934kB)
[ivy:resolve] .. (0kB)
[ivy:resolve] 	[SUCCESSFUL ] net.sourceforge.collections#collections-generic;4.01!collections-generic.jar(javadoc) (238ms)
[ivy:resolve] downloading http://repo1.maven.org/maven2/net/sourceforge/collections/collections-generic/4.01/collections-generic-4.01-sources.jar ...
[ivy:resolve] ........................................... (899kB)
[ivy:resolve] .. (0kB)
[ivy:resolve] 	[SUCCESSFUL ] net.sourceforge.collections#collections-generic;4.01!collections-generic.jar(source) (207ms)
[ivy:resolve] downloading http://repo1.maven.org/maven2/net/sourceforge/collections/collections-generic/4.01/collections-generic-4.01.jar ...
[ivy:resolve] ........................ (519kB)
[ivy:resolve] .. (0kB)
[ivy:resolve] 	[SUCCESSFUL ] net.sourceforge.collections#collections-generic;4.01!collections-generic.jar (191ms)
[ivy:resolve] downloading http://repo1.maven.org/maven2/args4j/args4j/2.0.29/args4j-2.0.29-javadoc.jar ...
[ivy:resolve] ................ (341kB)
[ivy:resolve] .. (0kB)
[ivy:resolve] 	[SUCCESSFUL ] args4j#args4j;2.0.29!args4j.jar(javadoc) (190ms)
[ivy:resolve] downloading http://repo1.maven.org/maven2/args4j/args4j/2.0.29/args4j-2.0.29-sources.jar ...
[ivy:resolve] ... (60kB)
[ivy:resolve] .. (0kB)
[ivy:resolve] 	[SUCCESSFUL ] args4j#args4j;2.0.29!args4j.jar(source) (182ms)
[ivy:resolve] downloading http://repo1.maven.org/maven2/args4j/args4j/2.0.29/args4j-2.0.29.jar ...
[ivy:resolve] ..... (82kB)
[ivy:resolve] .. (0kB)
[ivy:resolve] 	[SUCCESSFUL ] args4j#args4j;2.0.29!args4j.jar(bundle) (183ms)
[ivy:resolve] downloading http://repo1.maven.org/maven2/com/google/code/gson/gson/2.5/gson-2.5.jar ...
[ivy:resolve] ......... (227kB)
[ivy:resolve] .. (0kB)
[ivy:resolve] 	[SUCCESSFUL ] com.google.code.gson#gson;2.5!gson.jar (199ms)
[ivy:resolve] downloading http://repo1.maven.org/maven2/com/google/code/gson/gson/2.5/gson-2.5-javadoc.jar ...
[ivy:resolve] ............ (258kB)
[ivy:resolve] .. (0kB)
[ivy:resolve] 	[SUCCESSFUL ] com.google.code.gson#gson;2.5!gson.jar(javadoc) (189ms)
[ivy:resolve] downloading http://repo1.maven.org/maven2/com/google/code/gson/gson/2.5/gson-2.5-sources.jar ...
[ivy:resolve] ....... (142kB)
[ivy:resolve] .. (0kB)
[ivy:resolve] 	[SUCCESSFUL ] com.google.code.gson#gson;2.5!gson.jar(source) (192ms)
[ivy:resolve] downloading http://repo1.maven.org/maven2/com/google/guava/guava/19.0/guava-19.0-javadoc.jar ...
[ivy:resolve] .................................................................................................................................................................................................. (5137kB)
[ivy:resolve] .. (0kB)
[ivy:resolve] 	[SUCCESSFUL ] com.google.guava#guava;19.0!guava.jar(javadoc) (388ms)
[ivy:resolve] downloading http://repo1.maven.org/maven2/com/google/guava/guava/19.0/guava-19.0-sources.jar ...
[ivy:resolve] .................................................................. (1288kB)
[ivy:resolve] .. (0kB)
[ivy:resolve] 	[SUCCESSFUL ] com.google.guava#guava;19.0!guava.jar(source) (378ms)
[ivy:resolve] downloading http://repo1.maven.org/maven2/com/google/guava/guava/19.0/guava-19.0.jar ...
[ivy:resolve] ..................................................................................................... (2254kB)
[ivy:resolve] .. (0kB)
[ivy:resolve] 	[SUCCESSFUL ] com.google.guava#guava;19.0!guava.jar(bundle) (349ms)
[ivy:resolve] downloading http://repo1.maven.org/maven2/colt/colt/1.2.0/colt-1.2.0.jar ...
[ivy:resolve] ........................... (568kB)
[ivy:resolve] .. (0kB)
[ivy:resolve] 	[SUCCESSFUL ] colt#colt;1.2.0!colt.jar (192ms)
[ivy:resolve] downloading http://repo1.maven.org/maven2/concurrent/concurrent/1.3.4/concurrent-1.3.4.jar ...
[ivy:resolve] ......... (184kB)
[ivy:resolve] .. (0kB)
[ivy:resolve] 	[SUCCESSFUL ] concurrent#concurrent;1.3.4!concurrent.jar (186ms)
[ivy:resolve] downloading http://repo1.maven.org/maven2/org/beanshell/bsh/2.0b4/bsh-2.0b4.jar ...
[ivy:resolve] ............. (275kB)
[ivy:resolve] .. (0kB)
[ivy:resolve] 	[SUCCESSFUL ] org.beanshell#bsh;2.0b4!bsh.jar (187ms)
[ivy:resolve] downloading http://repo1.maven.org/maven2/com/beust/jcommander/1.12/jcommander-1.12.jar ...
[ivy:resolve] .. (30kB)
[ivy:resolve] .. (0kB)
[ivy:resolve] 	[SUCCESSFUL ] com.beust#jcommander;1.12!jcommander.jar (216ms)
[ivy:resolve] downloading http://repo1.maven.org/maven2/org/yaml/snakeyaml/1.6/snakeyaml-1.6.jar ...
[ivy:resolve] ........... (226kB)
[ivy:resolve] .. (0kB)
[ivy:resolve] 	[SUCCESSFUL ] org.yaml#snakeyaml;1.6!snakeyaml.jar (184ms)
[ivy:resolve] downloading http://repo1.maven.org/maven2/org/hamcrest/hamcrest-core/1.1/hamcrest-core-1.1.jar ...
[ivy:resolve] .... (74kB)
[ivy:resolve] .. (0kB)
[ivy:resolve] 	[SUCCESSFUL ] org.hamcrest#hamcrest-core;1.1!hamcrest-core.jar (183ms)
[ivy:resolve] downloading http://repo1.maven.org/maven2/com/google/inject/guice/2.0/guice-2.0.jar ...
[ivy:resolve] ............................ (651kB)
[ivy:resolve] .. (0kB)
[ivy:resolve] 	[SUCCESSFUL ] com.google.inject#guice;2.0!guice.jar (190ms)
[ivy:resolve] downloading http://repo1.maven.org/maven2/aopalliance/aopalliance/1.0/aopalliance-1.0.jar ...
[ivy:resolve] .. (4kB)
[ivy:resolve] .. (0kB)
[ivy:resolve] 	[SUCCESSFUL ] aopalliance#aopalliance;1.0!aopalliance.jar (196ms)
[ivy:resolve] downloading http://repo1.maven.org/maven2/org/apache/ant/ant/1.7.0/ant-1.7.0.jar ...
[ivy:resolve] .......................................................... (1259kB)
[ivy:resolve] .. (0kB)
[ivy:resolve] 	[SUCCESSFUL ] org.apache.ant#ant;1.7.0!ant.jar (199ms)
[ivy:resolve] downloading http://repo1.maven.org/maven2/org/apache/ant/ant-launcher/1.7.0/ant-launcher-1.7.0.jar ...
[ivy:resolve] .. (11kB)
[ivy:resolve] .. (0kB)
[ivy:resolve] 	[SUCCESSFUL ] org.apache.ant#ant-launcher;1.7.0!ant-launcher.jar (181ms)
[ivy:resolve] downloading http://repo1.maven.org/maven2/com/google/code/findbugs/jsr305/1.3.9/jsr305-1.3.9.jar ...
[ivy:resolve] ... (32kB)
[ivy:resolve] .. (0kB)
[ivy:resolve] 	[SUCCESSFUL ] com.google.code.findbugs#jsr305;1.3.9!jsr305.jar (185ms)
[ivy:resolve] downloading http://repo1.maven.org/maven2/com/google/errorprone/error_prone_annotations/2.0.2/error_prone_annotations-2.0.2.jar ...
[ivy:resolve] .. (6kB)
[ivy:resolve] .. (0kB)
[ivy:resolve] 	[SUCCESSFUL ] com.google.errorprone#error_prone_annotations;2.0.2!error_prone_annotations.jar (185ms)
[ivy:resolve] downloading http://repo1.maven.org/maven2/com/google/j2objc/j2objc-annotations/0.1/j2objc-annotations-0.1.jar ...
[ivy:resolve] .. (7kB)
[ivy:resolve] .. (0kB)
[ivy:resolve] 	[SUCCESSFUL ] com.google.j2objc#j2objc-annotations;0.1!j2objc-annotations.jar (196ms)
[ivy:resolve] downloading http://repo1.maven.org/maven2/org/codehaus/mojo/animal-sniffer-annotations/1.14/animal-sniffer-annotations-1.14.jar ...
[ivy:resolve] .. (3kB)
[ivy:resolve] .. (0kB)
[ivy:resolve] 	[SUCCESSFUL ] org.codehaus.mojo#animal-sniffer-annotations;1.14!animal-sniffer-annotations.jar (190ms)
[ivy:resolve] :: resolution report :: resolve 32469ms :: artifacts dl 8679ms
	---------------------------------------------------------------------
	|                  |            modules            ||   artifacts   |
	|       conf       | number| search|dwnlded|evicted|| number|dwnlded|
	---------------------------------------------------------------------
	|      default     |   26  |   24  |   24  |   0   ||   40  |   40  |
	---------------------------------------------------------------------
[ivy:resolve] 
[ivy:resolve] :: problems summary ::
[ivy:resolve] :::: WARNINGS
[ivy:resolve] 		module not found: net.sourceforge.ant-doxygen#ant-doxygen;1.6.1
[ivy:resolve] 	==== filesystem: tried
[ivy:resolve] 	  <https://builds.apache.org/job/joshua_master/ws/lib/cache/net.sourceforge.ant-doxygen/ant-doxygen/ivys/ivy-1.6.1.xml>
[ivy:resolve] 	  -- artifact net.sourceforge.ant-doxygen#ant-doxygen;1.6.1!ant-doxygen.jar:
[ivy:resolve] 	  <https://builds.apache.org/job/joshua_master/ws/lib/ant-doxygen-1.6.1.jar>
[ivy:resolve] 	==== central: tried
[ivy:resolve] 	  http://repo1.maven.org/maven2/net/sourceforge/ant-doxygen/ant-doxygen/1.6.1/ant-doxygen-1.6.1.pom
[ivy:resolve] 	  -- artifact net.sourceforge.ant-doxygen#ant-doxygen;1.6.1!ant-doxygen.jar:
[ivy:resolve] 	  http://repo1.maven.org/maven2/net/sourceforge/ant-doxygen/ant-doxygen/1.6.1/ant-doxygen-1.6.1.jar
[ivy:resolve] 	==== tools.gbif.org: tried
[ivy:resolve] 	  http://tools.gbif.org/maven/repository/net/sourceforge/ant-doxygen/ant-doxygen/1.6.1/ant-doxygen-1.6.1.pom
[ivy:resolve] 	  -- artifact net.sourceforge.ant-doxygen#ant-doxygen;1.6.1!ant-doxygen.jar:
[ivy:resolve] 	  http://tools.gbif.org/maven/repository/net/sourceforge/ant-doxygen/ant-doxygen/1.6.1/ant-doxygen-1.6.1.jar
[ivy:resolve] 	==== roundup: tried
[ivy:resolve] 	  http://ivyroundup.googlecode.com/svn/trunk/repo/modules/net.sourceforge.ant-doxygen/ant-doxygen/1.6.1/ivy.xml
[ivy:resolve] 	  -- artifact net.sourceforge.ant-doxygen#ant-doxygen;1.6.1!ant-doxygen.jar:
[ivy:resolve] 	  http://ivyroundup.googlecode.com/svn/trunk/repo/modules/net.sourceforge.ant-doxygen/ant-doxygen/1.6.1/packager.xml
[ivy:resolve] 		module not found: org.apache.commons#commons-cli;1.2
[ivy:resolve] 	==== filesystem: tried
[ivy:resolve] 	  <https://builds.apache.org/job/joshua_master/ws/lib/cache/org.apache.commons/commons-cli/ivys/ivy-1.2.xml>
[ivy:resolve] 	  -- artifact org.apache.commons#commons-cli;1.2!commons-cli.jar:
[ivy:resolve] 	  <https://builds.apache.org/job/joshua_master/ws/lib/commons-cli-1.2.jar>
[ivy:resolve] 	==== central: tried
[ivy:resolve] 	  http://repo1.maven.org/maven2/org/apache/commons/commons-cli/1.2/commons-cli-1.2.pom
[ivy:resolve] 	  -- artifact org.apache.commons#commons-cli;1.2!commons-cli.jar:
[ivy:resolve] 	  http://repo1.maven.org/maven2/org/apache/commons/commons-cli/1.2/commons-cli-1.2.jar
[ivy:resolve] 	==== tools.gbif.org: tried
[ivy:resolve] 	  http://tools.gbif.org/maven/repository/org/apache/commons/commons-cli/1.2/commons-cli-1.2.pom
[ivy:resolve] 	  -- artifact org.apache.commons#commons-cli;1.2!commons-cli.jar:
[ivy:resolve] 	  http://tools.gbif.org/maven/repository/org/apache/commons/commons-cli/1.2/commons-cli-1.2.jar
[ivy:resolve] 	==== roundup: tried
[ivy:resolve] 	  http://ivyroundup.googlecode.com/svn/trunk/repo/modules/org.apache.commons/commons-cli/1.2/ivy.xml
[ivy:resolve] 	  -- artifact org.apache.commons#commons-cli;1.2!commons-cli.jar:
[ivy:resolve] 	  http://ivyroundup.googlecode.com/svn/trunk/repo/modules/org.apache.commons/commons-cli/1.2/packager.xml
[ivy:resolve] 		::::::::::::::::::::::::::::::::::::::::::::::
[ivy:resolve] 		::          UNRESOLVED DEPENDENCIES         ::
[ivy:resolve] 		::::::::::::::::::::::::::::::::::::::::::::::
[ivy:resolve] 		:: net.sourceforge.ant-doxygen#ant-doxygen;1.6.1: not found
[ivy:resolve] 		:: org.apache.commons#commons-cli;1.2: not found
[ivy:resolve] 		::::::::::::::::::::::::::::::::::::::::::::::
[ivy:resolve] 
[ivy:resolve] :: USE VERBOSE OR DEBUG MESSAGE LEVEL FOR MORE DETAILS

BUILD FAILED
<https://builds.apache.org/job/joshua_master/ws/build.xml>:163: The following error occurred while executing this line:
<https://builds.apache.org/job/joshua_master/ws/build.xml>:356: impossible to resolve dependencies:
	resolve failed - see output for details

Total time: 42 seconds
Build step 'Invoke Ant' marked build as failure
Publishing Javadoc

Build failed in Jenkins: joshua_master #42

Posted by Apache Jenkins Server <je...@builds.apache.org>.
See <https://builds.apache.org/job/joshua_master/42/changes>

Changes:

[lewis.mcgibbney] JOSHUA-252 Make it possible to use Maven to build Joshua

[lewis.mcgibbney] JOSHUA-252 Make it possible to use Maven to build Joshua

[lewis.mcgibbney] JOSHUA-252 Make it possible to use Maven to build Joshua

[lewis.mcgibbney] JOSHUA-252 Make it possible to use Maven to build Joshua

[lewis.mcgibbney] JOSHUA-252 Make it possible to use Maven to build Joshua

[lewis.mcgibbney] JOSHUA-252 correctly specify test dependency in NodeTest.java

[tgowdan] System.exit() removed and replaced with RuntimeException(...)

[tgowdan] Added Maven assembly plugin

[lewis.mcgibbney] JOSHUA-252 Make it possible to use Maven to build Joshua

[lewis.mcgibbney] JOSHUA-252 Make it possible to use Maven to build Joshua

[tgowdan] Log4j - Slf4j bridge

[tgowdan] Read me updated

[tgowdan] LOG scope is privatized

[tgowdan] Clean LOGs, no redudant if(enabled) checks, no eager toString()s

[tgowdan] Fix spaces

[tgowdan] Fix log issues such as redundant checks and spaces

[tgowdan] Replaced System.err.print* with logger api

[tom] move dockerfile so all deployment stuff lives in the same place

[tom] joshua runtime juju charm

[tom] Joshua Full charm

[tom] fix metadata

[tom] update layer

[lewis.mcgibbney] JOSHUA-252 Make it possible to use Maven to build Joshua

[lewis.mcgibbney] JOSHUA-252 Make it possible to use Maven to build Joshua

[lewis.mcgibbney] JOSHUA-252 Make it possible to use Maven to build Joshua

[tom] fix language pack code

[lewis.mcgibbney] JOSHUA-252 Make it possible to use Maven to build Joshua

[lewis.mcgibbney] JOSHUA-252 Make it possible to use Maven to build Joshua

[lewis.mcgibbney] JOSHUA-252 Make it possible to use Maven to build Joshua

[tgowdan] Pulled JOSHUA-252 changes and Resolved Merge Conflicts

[post] Updated hard-coded class paths

[post] fixed decoder invocation

[post] fixed logger invocation

[post] changed some debugging levels

[post] point to internal properties file

[post] wrapping some debugging calls in boolean checks for speed

[post] removed file removed in master

[tgowdan] FIX: override logger settings at runtime

[post] fixing javadoc formatting

[tgowdan] Added the licence header

[fhieber] Added Sparse lexical feature function. Revised various other sparse

[fhieber] revert change to ivy.xml

[post] info output should go to stderr

[post] Moved all docker files under distribution/docker

[post] Fixed Jenkins compile errors

[post] moved misplaced file

[post] removed useless functions from FeatureFunction class

[post] updated README

[post] fixed test cases by referring to $JOSHUA

------------------------------------------
Started by user lewismc
[EnvInject] - Loading node environment variables.
Building remotely on ubuntu-us1 (Ubuntu ubuntu ubuntu-us golang-ppa) in workspace <https://builds.apache.org/job/joshua_master/ws/>
 > git rev-parse --is-inside-work-tree # timeout=10
Fetching changes from the remote Git repository
 > git config remote.origin.url https://git-wip-us.apache.org/repos/asf/incubator-joshua.git # timeout=10
Fetching upstream changes from https://git-wip-us.apache.org/repos/asf/incubator-joshua.git
 > git --version # timeout=10
 > git -c core.askpass=true fetch --tags --progress https://git-wip-us.apache.org/repos/asf/incubator-joshua.git +refs/heads/*:refs/remotes/origin/*
 > git rev-parse refs/remotes/origin/master^{commit} # timeout=10
 > git rev-parse refs/remotes/origin/origin/master^{commit} # timeout=10
Checking out Revision 9e6707fc046d0fe31bfdad49ec480eb36eff1dec (refs/remotes/origin/master)
 > git config core.sparsecheckout # timeout=10
 > git checkout -f 9e6707fc046d0fe31bfdad49ec480eb36eff1dec
 > git rev-list 15c7619d8ce547bfa085819c8bac3e9a48c3e8cd # timeout=10
[joshua_master] $ /home/jenkins/tools/ant/latest/bin/ant test
Buildfile: <https://builds.apache.org/job/joshua_master/ws/build.xml>

setup:

check-joshua-home:
     [echo] JOSHUA = <https://builds.apache.org/job/joshua_master/ws/> basedir = <https://builds.apache.org/job/joshua_master/ws/>

download-ivy:
      [get] Destination already exists (skipping): <https://builds.apache.org/job/joshua_master/ws/lib/ivy.jar>

init-ivy:

resolve:
[ivy:configure] :: Ivy 2.2.0 - 20100923230623 :: http://ant.apache.org/ivy/ ::

BUILD FAILED
<https://builds.apache.org/job/joshua_master/ws/build.xml>:163: The following error occurred while executing this line:
<https://builds.apache.org/job/joshua_master/ws/build.xml>:355: settings file does not exist: <https://builds.apache.org/job/joshua_master/ws/lib/ivysettings.xml>

Total time: 1 second
Build step 'Invoke Ant' marked build as failure
Publishing Javadoc
FATAL: Unable to copy Javadoc from <https://builds.apache.org/job/joshua_master/ws/> to /x1/jenkins/jenkins-home/jobs/joshua_master/builds/42/javadoc
java.io.IOException: java.io.IOException: Failed to extract <https://builds.apache.org/job/joshua_master/ws/**/*>
	at hudson.FilePath.readFromTar(FilePath.java:2300)
	at hudson.FilePath.copyRecursiveTo(FilePath.java:2209)
	at hudson.FilePath.copyRecursiveTo(FilePath.java:2113)
	at hudson.FilePath.copyRecursiveTo(FilePath.java:2096)
	at hudson.tasks.JavadocArchiver.perform(JavadocArchiver.java:106)
	at hudson.tasks.BuildStepCompatibilityLayer.perform(BuildStepCompatibilityLayer.java:78)
	at hudson.tasks.BuildStepMonitor$1.perform(BuildStepMonitor.java:20)
	at hudson.model.AbstractBuild$AbstractBuildExecution.perform(AbstractBuild.java:782)
	at hudson.model.AbstractBuild$AbstractBuildExecution.performAllBuildSteps(AbstractBuild.java:723)
	at hudson.model.Build$BuildExecution.post2(Build.java:185)
	at hudson.model.AbstractBuild$AbstractBuildExecution.post(AbstractBuild.java:668)
	at hudson.model.Run.execute(Run.java:1763)
	at hudson.model.FreeStyleBuild.run(FreeStyleBuild.java:43)
	at hudson.model.ResourceController.execute(ResourceController.java:98)
	at hudson.model.Executor.run(Executor.java:410)
Caused by: java.io.IOException: java.lang.InterruptedException
	at hudson.remoting.FastPipedInputStream.read(FastPipedInputStream.java:177)
	at hudson.util.HeadBufferingStream.read(HeadBufferingStream.java:61)
	at com.jcraft.jzlib.InflaterInputStream.fill(InflaterInputStream.java:175)
	at com.jcraft.jzlib.InflaterInputStream.read(InflaterInputStream.java:106)
	at org.apache.commons.compress.archivers.tar.TarArchiveInputStream.read(TarArchiveInputStream.java:614)
	at java.io.InputStream.read(InputStream.java:101)
	at org.apache.commons.io.IOUtils.copyLarge(IOUtils.java:1792)
	at org.apache.commons.io.IOUtils.copyLarge(IOUtils.java:1769)
	at org.apache.commons.io.IOUtils.copy(IOUtils.java:1744)
	at hudson.util.IOUtils.copy(IOUtils.java:40)
	at hudson.FilePath.readFromTar(FilePath.java:2290)
	... 14 more
Caused by: java.lang.InterruptedException
	at java.lang.Object.wait(Native Method)
	at hudson.remoting.FastPipedInputStream.read(FastPipedInputStream.java:175)
	... 24 more

	at hudson.FilePath.copyRecursiveTo(FilePath.java:2216)
	at hudson.FilePath.copyRecursiveTo(FilePath.java:2113)
	at hudson.FilePath.copyRecursiveTo(FilePath.java:2096)
	at hudson.tasks.JavadocArchiver.perform(JavadocArchiver.java:106)
	at hudson.tasks.BuildStepCompatibilityLayer.perform(BuildStepCompatibilityLayer.java:78)
	at hudson.tasks.BuildStepMonitor$1.perform(BuildStepMonitor.java:20)
	at hudson.model.AbstractBuild$AbstractBuildExecution.perform(AbstractBuild.java:782)
	at hudson.model.AbstractBuild$AbstractBuildExecution.performAllBuildSteps(AbstractBuild.java:723)
	at hudson.model.Build$BuildExecution.post2(Build.java:185)
	at hudson.model.AbstractBuild$AbstractBuildExecution.post(AbstractBuild.java:668)
	at hudson.model.Run.execute(Run.java:1763)
	at hudson.model.FreeStyleBuild.run(FreeStyleBuild.java:43)
	at hudson.model.ResourceController.execute(ResourceController.java:98)
	at hudson.model.Executor.run(Executor.java:410)
Caused by: java.util.concurrent.ExecutionException: java.io.IOException: This archives contains unclosed entries.
	at hudson.remoting.Channel$2.adapt(Channel.java:813)
	at hudson.remoting.Channel$2.adapt(Channel.java:808)
	at hudson.remoting.FutureAdapter.get(FutureAdapter.java:59)
	at hudson.FilePath.copyRecursiveTo(FilePath.java:2212)
	... 13 more
Caused by: java.io.IOException: This archives contains unclosed entries.
	at org.apache.commons.compress.archivers.tar.TarArchiveOutputStream.finish(TarArchiveOutputStream.java:225)
	at org.apache.commons.compress.archivers.tar.TarArchiveOutputStream.close(TarArchiveOutputStream.java:241)
	at hudson.util.io.TarArchiver.close(TarArchiver.java:111)
	at hudson.FilePath.writeToTar(FilePath.java:2263)
	at hudson.FilePath.access$2100(FilePath.java:190)
	at hudson.FilePath$45.invoke(FilePath.java:2202)
	at hudson.FilePath$45.invoke(FilePath.java:2198)
	at hudson.FilePath$FileCallableWrapper.call(FilePath.java:2719)
	at hudson.remoting.UserRequest.perform(UserRequest.java:120)
	at hudson.remoting.UserRequest.perform(UserRequest.java:48)
	at hudson.remoting.Request$2.run(Request.java:326)
	at hudson.remoting.InterceptingExecutorService$1.call(InterceptingExecutorService.java:68)
	at java.util.concurrent.FutureTask.run(FutureTask.java:262)
	at java.util.concurrent.ThreadPoolExecutor.runWorker(ThreadPoolExecutor.java:1145)
	at java.util.concurrent.ThreadPoolExecutor$Worker.run(ThreadPoolExecutor.java:615)
	at java.lang.Thread.run(Thread.java:745)
	at ......remote call to ubuntu-us1(Native Method)
	at hudson.remoting.Channel.attachCallSiteStackTrace(Channel.java:1416)
	at hudson.remoting.UserResponse.retrieve(UserRequest.java:220)
	at hudson.remoting.Channel$2.adapt(Channel.java:811)
	... 16 more
Updating JOSHUA-252