You are viewing a plain text version of this content. The canonical link for it is here.
Posted to builds@cassandra.apache.org by Apache Jenkins Server <je...@builds.apache.org> on 2022/02/04 23:27:38 UTC

Build complete: Cassandra-trunk #933 [UNSTABLE] df16b3750dc2c1b6b9bcdece6f81dfd3de7ebdfa

-------------------------------------------------------------------------------
Build Cassandra-trunk #933 Still Unstable
URL: https://ci-cassandra.apache.org/job/Cassandra-trunk/933/
-------------------------------------------------------------------------------
Changes:
[David Capwell] When streaming sees a ClosedChannelException this triggers the disk


-------------------------------------------------------------------------------
Failed Tests:
49 tests failed.
FAILED:  dtest-upgrade.upgrade_tests.thrift_upgrade_test.TestUpgradeTo40.test_keys_index_3_11_created
FAILED:  org.apache.cassandra.distributed.test.RepairErrorsTest.testNoSuchRepairSessionAnticompaction
FAILED:  org.apache.cassandra.distributed.test.NodeToolEnableDisableBinaryTest.testMaybeChangeDocs
FAILED:  org.apache.cassandra.cql3.validation.operations.SelectMultiColumnRelationTest.testMultiplePartitionKeyAndMultiClusteringWithIndex-cdc
FAILED:  org.apache.cassandra.cql3.validation.operations.SelectMultiColumnRelationTest.testSimpleTupleQuery-cdc
FAILED:  org.apache.cassandra.cql3.validation.operations.SelectMultiColumnRelationTest.testMultipleClusteringWithIndexAndValueOver64K-cdc
FAILED:  org.apache.cassandra.cql3.validation.operations.SelectMultiColumnRelationTest.testMultiAndSingleColumnRelationMix-cdc
FAILED:  org.apache.cassandra.cql3.validation.operations.SelectMultiColumnRelationTest.testInRestrictionsWithAllowFiltering-cdc
FAILED:  org.apache.cassandra.cql3.validation.operations.SelectMultiColumnRelationTest.testWithUnsetValues-cdc
FAILED:  org.apache.cassandra.cql3.validation.operations.SelectMultiColumnRelationTest.testMultiColumnRestrictionsWithIndex-cdc
FAILED:  org.apache.cassandra.cql3.validation.operations.SelectMultiColumnRelationTest.testMixedOrderColumnsInReverse-cdc
FAILED:  org.apache.cassandra.cql3.validation.operations.SelectMultiColumnRelationTest.testNonEqualsRelation-cdc
FAILED:  org.apache.cassandra.cql3.validation.operations.SelectMultiColumnRelationTest.testInRestrictionsWithIndex-cdc
FAILED:  org.apache.cassandra.cql3.validation.operations.SelectMultiColumnRelationTest.testMultiClusteringInvalidQueries-cdc
FAILED:  org.apache.cassandra.cql3.validation.operations.SelectMultiColumnRelationTest.testInvalidColumnNames-cdc
FAILED:  org.apache.cassandra.cql3.validation.operations.SelectMultiColumnRelationTest.testMixedOrderColumns1-cdc
FAILED:  org.apache.cassandra.cql3.validation.operations.SelectMultiColumnRelationTest.testMixedOrderColumns2-cdc
FAILED:  org.apache.cassandra.cql3.validation.operations.SelectMultiColumnRelationTest.testMixedOrderColumns3-cdc
FAILED:  org.apache.cassandra.cql3.validation.operations.SelectMultiColumnRelationTest.testMixedOrderColumns4-cdc
FAILED:  org.apache.cassandra.cql3.validation.operations.SelectMultiColumnRelationTest.testSingleClustering-cdc
FAILED:  org.apache.cassandra.db.MultiKeyspaceTest.testSameTableNames-cdc
FAILED:  org.apache.cassandra.cql3.validation.operations.SelectOrderedPartitionerTest.testMultiColumnPartitionKeyWithIndexAndTokenNonTokenRestrictionsMix-cdc
FAILED:  org.apache.cassandra.cql3.validation.operations.SelectOrderedPartitionerTest.testTokenAndIndex-cdc
FAILED:  org.apache.cassandra.cql3.validation.operations.SelectOrderedPartitionerTest.testTokenAndCollections-cdc
FAILED:  org.apache.cassandra.cql3.validation.operations.SelectOrderedPartitionerTest.testCompositeIndexWithPK-cdc
FAILED:  org.apache.cassandra.cql3.validation.operations.SelectOrderedPartitionerTest.testTokenFunctionWithCompoundPartitionAndClusteringCols-cdc
FAILED:  org.apache.cassandra.cql3.validation.operations.SelectOrderedPartitionerTest.testPrimaryKeyOnly-cdc
FAILED:  org.apache.cassandra.cql3.validation.operations.SelectOrderedPartitionerTest.testTokenFunctionWithMultiColumnPartitionKey-cdc
FAILED:  org.apache.cassandra.cql3.validation.operations.SelectOrderedPartitionerTest.testRangeKey-cdc
FAILED:  org.apache.cassandra.cql3.validation.operations.SelectOrderedPartitionerTest.testOrderByMultikey-cdc
FAILED:  org.apache.cassandra.cql3.validation.operations.SelectOrderedPartitionerTest.testTruncateWithCaching-cdc
FAILED:  org.apache.cassandra.cql3.validation.operations.SelectOrderedPartitionerTest.testTokenFunctionWithSingleColumnPartitionKey-cdc
FAILED:  org.apache.cassandra.cql3.validation.operations.SelectOrderedPartitionerTest.testFilteringOnAllPartitionKeysWithTokenRestriction-cdc
FAILED:  org.apache.cassandra.cql3.validation.operations.SelectOrderedPartitionerTest.testLimitBug-cdc
FAILED:  org.apache.cassandra.db.CellTest.BeforeFirstTest
FAILED:  org.apache.cassandra.db.commitlog.CommitLogSegmentManagerCDCTest.testSwitchingCDCWriteModes
FAILED:  org.apache.cassandra.db.commitlog.CommitLogSegmentManagerCDCTest.testNonblockingShouldMaintainSteadyDiskUsage
FAILED:  org.apache.cassandra.db.commitlog.CommitLogSegmentManagerCDCTest.testNonblockingShouldMaintainSteadyDiskUsage
FAILED:  org.apache.cassandra.db.commitlog.CommitLogSegmentManagerCDCTest.testNonblockingShouldMaintainSteadyDiskUsage
FAILED:  org.apache.cassandra.db.commitlog.CommitLogSegmentManagerCDCTest.testNonblockingShouldMaintainSteadyDiskUsage
FAILED:  org.apache.cassandra.db.commitlog.CommitLogSegmentManagerCDCTest.testNonblockingShouldMaintainSteadyDiskUsage
FAILED:  org.apache.cassandra.cql3.KeywordTest.test[keyword KEY isReserved false]
FAILED:  org.apache.cassandra.tools.BulkLoaderTest.testBulkLoader_WithArgs1-compression
FAILED:  org.apache.cassandra.utils.IntegerIntervalsTest.testSetAddMultiThread-compression
FAILED:  org.apache.cassandra.db.commitlog.GroupCommitLogTest.testOutOfOrderLogDiscard[1]
FAILED:  dtest-upgrade.upgrade_tests.upgrade_through_versions_test.TestProtoV3Upgrade_AllVersions_EndsAt_3_11_X.test_rolling_upgrade
FAILED:  dtest-upgrade.upgrade_tests.upgrade_through_versions_test.TestProtoV3Upgrade_AllVersions_EndsAt_3_11_X.test_rolling_upgrade_with_internode_ssl
FAILED:  dtest-upgrade.upgrade_tests.upgrade_through_versions_test.TestProtoV3Upgrade_AllVersions_RandomPartitioner_EndsAt_3_11_X_HEAD.test_rolling_upgrade
FAILED:  dtest-upgrade.upgrade_tests.upgrade_through_versions_test.TestProtoV3Upgrade_AllVersions_RandomPartitioner_EndsAt_3_11_X_HEAD.test_rolling_upgrade_with_internode_ssl

-------------------------------------------------------------------------------
For complete test report and logs see https://nightlies.apache.org/cassandra/Cassandra-trunk/933/