You are viewing a plain text version of this content. The canonical link for it is here.
Posted to dev@lucene.apache.org by Apache Jenkins Server <je...@builds.apache.org> on 2015/10/13 21:24:01 UTC

[JENKINS] Lucene-Solr-Tests-trunk-Java8 - Build # 482 - Still Failing

Build: https://builds.apache.org/job/Lucene-Solr-Tests-trunk-Java8/482/

1 tests failed.
FAILED:  org.apache.solr.cloud.SolrCloudExampleTest.testLoadDocsIntoGettingStartedCollection

Error Message:
Delete action failed!

Stack Trace:
java.lang.AssertionError: Delete action failed!
	at __randomizedtesting.SeedInfo.seed([CCAF670AC0F667D4:DFCC5565F199DE72]:0)
	at org.junit.Assert.fail(Assert.java:93)
	at org.junit.Assert.assertTrue(Assert.java:43)
	at org.apache.solr.cloud.SolrCloudExampleTest.doTestDeleteAction(SolrCloudExampleTest.java:169)
	at org.apache.solr.cloud.SolrCloudExampleTest.testLoadDocsIntoGettingStartedCollection(SolrCloudExampleTest.java:145)
	at sun.reflect.NativeMethodAccessorImpl.invoke0(Native Method)
	at sun.reflect.NativeMethodAccessorImpl.invoke(NativeMethodAccessorImpl.java:62)
	at sun.reflect.DelegatingMethodAccessorImpl.invoke(DelegatingMethodAccessorImpl.java:43)
	at java.lang.reflect.Method.invoke(Method.java:497)
	at com.carrotsearch.randomizedtesting.RandomizedRunner.invoke(RandomizedRunner.java:1665)
	at com.carrotsearch.randomizedtesting.RandomizedRunner$8.evaluate(RandomizedRunner.java:864)
	at com.carrotsearch.randomizedtesting.RandomizedRunner$9.evaluate(RandomizedRunner.java:900)
	at com.carrotsearch.randomizedtesting.RandomizedRunner$10.evaluate(RandomizedRunner.java:914)
	at org.apache.solr.BaseDistributedSearchTestCase$ShardsRepeatRule$ShardsFixedStatement.callStatement(BaseDistributedSearchTestCase.java:963)
	at org.apache.solr.BaseDistributedSearchTestCase$ShardsRepeatRule$ShardsStatement.evaluate(BaseDistributedSearchTestCase.java:938)
	at com.carrotsearch.randomizedtesting.rules.SystemPropertiesRestoreRule$1.evaluate(SystemPropertiesRestoreRule.java:57)
	at org.apache.lucene.util.TestRuleSetupTeardownChained$1.evaluate(TestRuleSetupTeardownChained.java:50)
	at org.apache.lucene.util.AbstractBeforeAfterRule$1.evaluate(AbstractBeforeAfterRule.java:46)
	at org.apache.lucene.util.TestRuleThreadAndTestName$1.evaluate(TestRuleThreadAndTestName.java:49)
	at org.apache.lucene.util.TestRuleIgnoreAfterMaxFailures$1.evaluate(TestRuleIgnoreAfterMaxFailures.java:65)
	at org.apache.lucene.util.TestRuleMarkFailure$1.evaluate(TestRuleMarkFailure.java:48)
	at com.carrotsearch.randomizedtesting.rules.StatementAdapter.evaluate(StatementAdapter.java:36)
	at com.carrotsearch.randomizedtesting.ThreadLeakControl$StatementRunner.run(ThreadLeakControl.java:367)
	at com.carrotsearch.randomizedtesting.ThreadLeakControl.forkTimeoutingTask(ThreadLeakControl.java:809)
	at com.carrotsearch.randomizedtesting.ThreadLeakControl$3.evaluate(ThreadLeakControl.java:460)
	at com.carrotsearch.randomizedtesting.RandomizedRunner.runSingleTest(RandomizedRunner.java:873)
	at com.carrotsearch.randomizedtesting.RandomizedRunner$5.evaluate(RandomizedRunner.java:775)
	at com.carrotsearch.randomizedtesting.RandomizedRunner$6.evaluate(RandomizedRunner.java:809)
	at com.carrotsearch.randomizedtesting.RandomizedRunner$7.evaluate(RandomizedRunner.java:820)
	at com.carrotsearch.randomizedtesting.rules.StatementAdapter.evaluate(StatementAdapter.java:36)
	at com.carrotsearch.randomizedtesting.rules.SystemPropertiesRestoreRule$1.evaluate(SystemPropertiesRestoreRule.java:57)
	at org.apache.lucene.util.AbstractBeforeAfterRule$1.evaluate(AbstractBeforeAfterRule.java:46)
	at com.carrotsearch.randomizedtesting.rules.StatementAdapter.evaluate(StatementAdapter.java:36)
	at org.apache.lucene.util.TestRuleStoreClassName$1.evaluate(TestRuleStoreClassName.java:42)
	at com.carrotsearch.randomizedtesting.rules.NoShadowingOrOverridesOnMethodsRule$1.evaluate(NoShadowingOrOverridesOnMethodsRule.java:39)
	at com.carrotsearch.randomizedtesting.rules.NoShadowingOrOverridesOnMethodsRule$1.evaluate(NoShadowingOrOverridesOnMethodsRule.java:39)
	at com.carrotsearch.randomizedtesting.rules.StatementAdapter.evaluate(StatementAdapter.java:36)
	at com.carrotsearch.randomizedtesting.rules.StatementAdapter.evaluate(StatementAdapter.java:36)
	at com.carrotsearch.randomizedtesting.rules.StatementAdapter.evaluate(StatementAdapter.java:36)
	at org.apache.lucene.util.TestRuleAssertionsRequired$1.evaluate(TestRuleAssertionsRequired.java:54)
	at org.apache.lucene.util.TestRuleMarkFailure$1.evaluate(TestRuleMarkFailure.java:48)
	at org.apache.lucene.util.TestRuleIgnoreAfterMaxFailures$1.evaluate(TestRuleIgnoreAfterMaxFailures.java:65)
	at org.apache.lucene.util.TestRuleIgnoreTestSuites$1.evaluate(TestRuleIgnoreTestSuites.java:55)
	at com.carrotsearch.randomizedtesting.rules.StatementAdapter.evaluate(StatementAdapter.java:36)
	at com.carrotsearch.randomizedtesting.ThreadLeakControl$StatementRunner.run(ThreadLeakControl.java:367)
	at java.lang.Thread.run(Thread.java:745)




Build Log:
[...truncated 10498 lines...]
   [junit4] Suite: org.apache.solr.cloud.SolrCloudExampleTest
   [junit4]   2> Creating dataDir: /x1/jenkins/jenkins-slave/workspace/Lucene-Solr-Tests-trunk-Java8/solr/build/solr-core/test/J2/temp/solr.cloud.SolrCloudExampleTest_CCAF670AC0F667D4-001/init-core-data-001
   [junit4]   2> 1617566 INFO  (SUITE-SolrCloudExampleTest-seed#[CCAF670AC0F667D4]-worker) [    ] o.a.s.SolrTestCaseJ4 Randomized ssl (false) and clientAuth (false)
   [junit4]   2> 1617566 INFO  (SUITE-SolrCloudExampleTest-seed#[CCAF670AC0F667D4]-worker) [    ] o.a.s.BaseDistributedSearchTestCase Setting hostContext system property: /
   [junit4]   2> 1617568 INFO  (TEST-SolrCloudExampleTest.testLoadDocsIntoGettingStartedCollection-seed#[CCAF670AC0F667D4]) [    ] o.a.s.c.ZkTestServer STARTING ZK TEST SERVER
   [junit4]   2> 1617568 INFO  (Thread-4316) [    ] o.a.s.c.ZkTestServer client port:0.0.0.0/0.0.0.0:0
   [junit4]   2> 1617569 INFO  (Thread-4316) [    ] o.a.s.c.ZkTestServer Starting server
   [junit4]   2> 1617669 INFO  (TEST-SolrCloudExampleTest.testLoadDocsIntoGettingStartedCollection-seed#[CCAF670AC0F667D4]) [    ] o.a.s.c.ZkTestServer start zk server on port:58780
   [junit4]   2> 1617669 INFO  (TEST-SolrCloudExampleTest.testLoadDocsIntoGettingStartedCollection-seed#[CCAF670AC0F667D4]) [    ] o.a.s.c.c.SolrZkClient Using default ZkCredentialsProvider
   [junit4]   2> 1617669 INFO  (TEST-SolrCloudExampleTest.testLoadDocsIntoGettingStartedCollection-seed#[CCAF670AC0F667D4]) [    ] o.a.s.c.c.ConnectionManager Waiting for client to connect to ZooKeeper
   [junit4]   2> 1617672 INFO  (zkCallback-1380-thread-1) [    ] o.a.s.c.c.ConnectionManager Watcher org.apache.solr.common.cloud.ConnectionManager@2ce12222 name:ZooKeeperConnection Watcher:127.0.0.1:58780 got event WatchedEvent state:SyncConnected type:None path:null path:null type:None
   [junit4]   2> 1617672 INFO  (TEST-SolrCloudExampleTest.testLoadDocsIntoGettingStartedCollection-seed#[CCAF670AC0F667D4]) [    ] o.a.s.c.c.ConnectionManager Client is connected to ZooKeeper
   [junit4]   2> 1617673 INFO  (TEST-SolrCloudExampleTest.testLoadDocsIntoGettingStartedCollection-seed#[CCAF670AC0F667D4]) [    ] o.a.s.c.c.SolrZkClient Using default ZkACLProvider
   [junit4]   2> 1617673 INFO  (TEST-SolrCloudExampleTest.testLoadDocsIntoGettingStartedCollection-seed#[CCAF670AC0F667D4]) [    ] o.a.s.c.c.SolrZkClient makePath: /solr
   [junit4]   2> 1617675 INFO  (TEST-SolrCloudExampleTest.testLoadDocsIntoGettingStartedCollection-seed#[CCAF670AC0F667D4]) [    ] o.a.s.c.c.SolrZkClient Using default ZkCredentialsProvider
   [junit4]   2> 1617676 INFO  (TEST-SolrCloudExampleTest.testLoadDocsIntoGettingStartedCollection-seed#[CCAF670AC0F667D4]) [    ] o.a.s.c.c.ConnectionManager Waiting for client to connect to ZooKeeper
   [junit4]   2> 1617677 INFO  (zkCallback-1381-thread-1) [    ] o.a.s.c.c.ConnectionManager Watcher org.apache.solr.common.cloud.ConnectionManager@46615427 name:ZooKeeperConnection Watcher:127.0.0.1:58780/solr got event WatchedEvent state:SyncConnected type:None path:null path:null type:None
   [junit4]   2> 1617677 INFO  (TEST-SolrCloudExampleTest.testLoadDocsIntoGettingStartedCollection-seed#[CCAF670AC0F667D4]) [    ] o.a.s.c.c.ConnectionManager Client is connected to ZooKeeper
   [junit4]   2> 1617677 INFO  (TEST-SolrCloudExampleTest.testLoadDocsIntoGettingStartedCollection-seed#[CCAF670AC0F667D4]) [    ] o.a.s.c.c.SolrZkClient Using default ZkACLProvider
   [junit4]   2> 1617677 INFO  (TEST-SolrCloudExampleTest.testLoadDocsIntoGettingStartedCollection-seed#[CCAF670AC0F667D4]) [    ] o.a.s.c.c.SolrZkClient makePath: /collections/collection1
   [junit4]   2> 1617679 INFO  (TEST-SolrCloudExampleTest.testLoadDocsIntoGettingStartedCollection-seed#[CCAF670AC0F667D4]) [    ] o.a.s.c.c.SolrZkClient makePath: /collections/collection1/shards
   [junit4]   2> 1617681 INFO  (TEST-SolrCloudExampleTest.testLoadDocsIntoGettingStartedCollection-seed#[CCAF670AC0F667D4]) [    ] o.a.s.c.c.SolrZkClient makePath: /collections/control_collection
   [junit4]   2> 1617682 INFO  (TEST-SolrCloudExampleTest.testLoadDocsIntoGettingStartedCollection-seed#[CCAF670AC0F667D4]) [    ] o.a.s.c.c.SolrZkClient makePath: /collections/control_collection/shards
   [junit4]   2> 1617684 INFO  (TEST-SolrCloudExampleTest.testLoadDocsIntoGettingStartedCollection-seed#[CCAF670AC0F667D4]) [    ] o.a.s.c.AbstractZkTestCase put /x1/jenkins/jenkins-slave/workspace/Lucene-Solr-Tests-trunk-Java8/solr/core/src/test-files/solr/collection1/conf/solrconfig-tlog.xml to /configs/conf1/solrconfig.xml
   [junit4]   2> 1617684 INFO  (TEST-SolrCloudExampleTest.testLoadDocsIntoGettingStartedCollection-seed#[CCAF670AC0F667D4]) [    ] o.a.s.c.c.SolrZkClient makePath: /configs/conf1/solrconfig.xml
   [junit4]   2> 1617687 INFO  (TEST-SolrCloudExampleTest.testLoadDocsIntoGettingStartedCollection-seed#[CCAF670AC0F667D4]) [    ] o.a.s.c.AbstractZkTestCase put /x1/jenkins/jenkins-slave/workspace/Lucene-Solr-Tests-trunk-Java8/solr/core/src/test-files/solr/collection1/conf/schema.xml to /configs/conf1/schema.xml
   [junit4]   2> 1617687 INFO  (TEST-SolrCloudExampleTest.testLoadDocsIntoGettingStartedCollection-seed#[CCAF670AC0F667D4]) [    ] o.a.s.c.c.SolrZkClient makePath: /configs/conf1/schema.xml
   [junit4]   2> 1617689 INFO  (TEST-SolrCloudExampleTest.testLoadDocsIntoGettingStartedCollection-seed#[CCAF670AC0F667D4]) [    ] o.a.s.c.AbstractZkTestCase put /x1/jenkins/jenkins-slave/workspace/Lucene-Solr-Tests-trunk-Java8/solr/core/src/test-files/solr/collection1/conf/solrconfig.snippet.randomindexconfig.xml to /configs/conf1/solrconfig.snippet.randomindexconfig.xml
   [junit4]   2> 1617689 INFO  (TEST-SolrCloudExampleTest.testLoadDocsIntoGettingStartedCollection-seed#[CCAF670AC0F667D4]) [    ] o.a.s.c.c.SolrZkClient makePath: /configs/conf1/solrconfig.snippet.randomindexconfig.xml
   [junit4]   2> 1617691 INFO  (TEST-SolrCloudExampleTest.testLoadDocsIntoGettingStartedCollection-seed#[CCAF670AC0F667D4]) [    ] o.a.s.c.AbstractZkTestCase put /x1/jenkins/jenkins-slave/workspace/Lucene-Solr-Tests-trunk-Java8/solr/core/src/test-files/solr/collection1/conf/stopwords.txt to /configs/conf1/stopwords.txt
   [junit4]   2> 1617691 INFO  (TEST-SolrCloudExampleTest.testLoadDocsIntoGettingStartedCollection-seed#[CCAF670AC0F667D4]) [    ] o.a.s.c.c.SolrZkClient makePath: /configs/conf1/stopwords.txt
   [junit4]   2> 1617693 INFO  (TEST-SolrCloudExampleTest.testLoadDocsIntoGettingStartedCollection-seed#[CCAF670AC0F667D4]) [    ] o.a.s.c.AbstractZkTestCase put /x1/jenkins/jenkins-slave/workspace/Lucene-Solr-Tests-trunk-Java8/solr/core/src/test-files/solr/collection1/conf/protwords.txt to /configs/conf1/protwords.txt
   [junit4]   2> 1617693 INFO  (TEST-SolrCloudExampleTest.testLoadDocsIntoGettingStartedCollection-seed#[CCAF670AC0F667D4]) [    ] o.a.s.c.c.SolrZkClient makePath: /configs/conf1/protwords.txt
   [junit4]   2> 1617695 INFO  (TEST-SolrCloudExampleTest.testLoadDocsIntoGettingStartedCollection-seed#[CCAF670AC0F667D4]) [    ] o.a.s.c.AbstractZkTestCase put /x1/jenkins/jenkins-slave/workspace/Lucene-Solr-Tests-trunk-Java8/solr/core/src/test-files/solr/collection1/conf/currency.xml to /configs/conf1/currency.xml
   [junit4]   2> 1617695 INFO  (TEST-SolrCloudExampleTest.testLoadDocsIntoGettingStartedCollection-seed#[CCAF670AC0F667D4]) [    ] o.a.s.c.c.SolrZkClient makePath: /configs/conf1/currency.xml
   [junit4]   2> 1617697 INFO  (TEST-SolrCloudExampleTest.testLoadDocsIntoGettingStartedCollection-seed#[CCAF670AC0F667D4]) [    ] o.a.s.c.AbstractZkTestCase put /x1/jenkins/jenkins-slave/workspace/Lucene-Solr-Tests-trunk-Java8/solr/core/src/test-files/solr/collection1/conf/enumsConfig.xml to /configs/conf1/enumsConfig.xml
   [junit4]   2> 1617697 INFO  (TEST-SolrCloudExampleTest.testLoadDocsIntoGettingStartedCollection-seed#[CCAF670AC0F667D4]) [    ] o.a.s.c.c.SolrZkClient makePath: /configs/conf1/enumsConfig.xml
   [junit4]   2> 1617698 INFO  (TEST-SolrCloudExampleTest.testLoadDocsIntoGettingStartedCollection-seed#[CCAF670AC0F667D4]) [    ] o.a.s.c.AbstractZkTestCase put /x1/jenkins/jenkins-slave/workspace/Lucene-Solr-Tests-trunk-Java8/solr/core/src/test-files/solr/collection1/conf/open-exchange-rates.json to /configs/conf1/open-exchange-rates.json
   [junit4]   2> 1617699 INFO  (TEST-SolrCloudExampleTest.testLoadDocsIntoGettingStartedCollection-seed#[CCAF670AC0F667D4]) [    ] o.a.s.c.c.SolrZkClient makePath: /configs/conf1/open-exchange-rates.json
   [junit4]   2> 1617700 INFO  (TEST-SolrCloudExampleTest.testLoadDocsIntoGettingStartedCollection-seed#[CCAF670AC0F667D4]) [    ] o.a.s.c.AbstractZkTestCase put /x1/jenkins/jenkins-slave/workspace/Lucene-Solr-Tests-trunk-Java8/solr/core/src/test-files/solr/collection1/conf/mapping-ISOLatin1Accent.txt to /configs/conf1/mapping-ISOLatin1Accent.txt
   [junit4]   2> 1617700 INFO  (TEST-SolrCloudExampleTest.testLoadDocsIntoGettingStartedCollection-seed#[CCAF670AC0F667D4]) [    ] o.a.s.c.c.SolrZkClient makePath: /configs/conf1/mapping-ISOLatin1Accent.txt
   [junit4]   2> 1617702 INFO  (TEST-SolrCloudExampleTest.testLoadDocsIntoGettingStartedCollection-seed#[CCAF670AC0F667D4]) [    ] o.a.s.c.AbstractZkTestCase put /x1/jenkins/jenkins-slave/workspace/Lucene-Solr-Tests-trunk-Java8/solr/core/src/test-files/solr/collection1/conf/old_synonyms.txt to /configs/conf1/old_synonyms.txt
   [junit4]   2> 1617702 INFO  (TEST-SolrCloudExampleTest.testLoadDocsIntoGettingStartedCollection-seed#[CCAF670AC0F667D4]) [    ] o.a.s.c.c.SolrZkClient makePath: /configs/conf1/old_synonyms.txt
   [junit4]   2> 1617703 INFO  (TEST-SolrCloudExampleTest.testLoadDocsIntoGettingStartedCollection-seed#[CCAF670AC0F667D4]) [    ] o.a.s.c.AbstractZkTestCase put /x1/jenkins/jenkins-slave/workspace/Lucene-Solr-Tests-trunk-Java8/solr/core/src/test-files/solr/collection1/conf/synonyms.txt to /configs/conf1/synonyms.txt
   [junit4]   2> 1617703 INFO  (TEST-SolrCloudExampleTest.testLoadDocsIntoGettingStartedCollection-seed#[CCAF670AC0F667D4]) [    ] o.a.s.c.c.SolrZkClient makePath: /configs/conf1/synonyms.txt
   [junit4]   2> 1618039 INFO  (TEST-SolrCloudExampleTest.testLoadDocsIntoGettingStartedCollection-seed#[CCAF670AC0F667D4]) [    ] o.a.s.SolrTestCaseJ4 Writing core.properties file to /x1/jenkins/jenkins-slave/workspace/Lucene-Solr-Tests-trunk-Java8/solr/build/solr-core/test/J2/temp/solr.cloud.SolrCloudExampleTest_CCAF670AC0F667D4-001/control-001/cores/collection1
   [junit4]   2> 1618041 INFO  (TEST-SolrCloudExampleTest.testLoadDocsIntoGettingStartedCollection-seed#[CCAF670AC0F667D4]) [    ] o.e.j.s.Server jetty-9.2.13.v20150730
   [junit4]   2> 1618043 INFO  (TEST-SolrCloudExampleTest.testLoadDocsIntoGettingStartedCollection-seed#[CCAF670AC0F667D4]) [    ] o.e.j.s.h.ContextHandler Started o.e.j.s.ServletContextHandler@81996e7{/,null,AVAILABLE}
   [junit4]   2> 1618061 INFO  (TEST-SolrCloudExampleTest.testLoadDocsIntoGettingStartedCollection-seed#[CCAF670AC0F667D4]) [    ] o.e.j.s.ServerConnector Started ServerConnector@7af09a7e{HTTP/1.1}{127.0.0.1:33044}
   [junit4]   2> 1618061 INFO  (TEST-SolrCloudExampleTest.testLoadDocsIntoGettingStartedCollection-seed#[CCAF670AC0F667D4]) [    ] o.e.j.s.Server Started @1621455ms
   [junit4]   2> 1618061 INFO  (TEST-SolrCloudExampleTest.testLoadDocsIntoGettingStartedCollection-seed#[CCAF670AC0F667D4]) [    ] o.a.s.c.s.e.JettySolrRunner Jetty properties: {solr.data.dir=/x1/jenkins/jenkins-slave/workspace/Lucene-Solr-Tests-trunk-Java8/solr/build/solr-core/test/J2/temp/solr.cloud.SolrCloudExampleTest_CCAF670AC0F667D4-001/tempDir-001/control/data, hostContext=/, hostPort=33044, coreRootDirectory=/x1/jenkins/jenkins-slave/workspace/Lucene-Solr-Tests-trunk-Java8/solr/build/solr-core/test/J2/temp/solr.cloud.SolrCloudExampleTest_CCAF670AC0F667D4-001/control-001/cores}
   [junit4]   2> 1618061 INFO  (TEST-SolrCloudExampleTest.testLoadDocsIntoGettingStartedCollection-seed#[CCAF670AC0F667D4]) [    ] o.a.s.s.SolrDispatchFilter SolrDispatchFilter.init(): sun.misc.Launcher$AppClassLoader@4e0e2f2a
   [junit4]   2> 1618061 INFO  (TEST-SolrCloudExampleTest.testLoadDocsIntoGettingStartedCollection-seed#[CCAF670AC0F667D4]) [    ] o.a.s.c.SolrResourceLoader new SolrResourceLoader for directory: '/x1/jenkins/jenkins-slave/workspace/Lucene-Solr-Tests-trunk-Java8/solr/build/solr-core/test/J2/temp/solr.cloud.SolrCloudExampleTest_CCAF670AC0F667D4-001/control-001/'
   [junit4]   2> 1618061 INFO  (TEST-SolrCloudExampleTest.testLoadDocsIntoGettingStartedCollection-seed#[CCAF670AC0F667D4]) [    ] o.a.s.c.SolrResourceLoader JNDI not configured for solr (NoInitialContextEx)
   [junit4]   2> 1618062 INFO  (TEST-SolrCloudExampleTest.testLoadDocsIntoGettingStartedCollection-seed#[CCAF670AC0F667D4]) [    ] o.a.s.c.SolrResourceLoader solr home defaulted to 'solr/' (could not find system property or JNDI)
   [junit4]   2> 1618079 INFO  (TEST-SolrCloudExampleTest.testLoadDocsIntoGettingStartedCollection-seed#[CCAF670AC0F667D4]) [    ] o.a.s.c.c.SolrZkClient Using default ZkCredentialsProvider
   [junit4]   2> 1618079 INFO  (TEST-SolrCloudExampleTest.testLoadDocsIntoGettingStartedCollection-seed#[CCAF670AC0F667D4]) [    ] o.a.s.c.c.ConnectionManager Waiting for client to connect to ZooKeeper
   [junit4]   2> 1618081 INFO  (zkCallback-1382-thread-1) [    ] o.a.s.c.c.ConnectionManager Watcher org.apache.solr.common.cloud.ConnectionManager@1012dbbb name:ZooKeeperConnection Watcher:127.0.0.1:58780/solr got event WatchedEvent state:SyncConnected type:None path:null path:null type:None
   [junit4]   2> 1618081 INFO  (TEST-SolrCloudExampleTest.testLoadDocsIntoGettingStartedCollection-seed#[CCAF670AC0F667D4]) [    ] o.a.s.c.c.ConnectionManager Client is connected to ZooKeeper
   [junit4]   2> 1618081 INFO  (TEST-SolrCloudExampleTest.testLoadDocsIntoGettingStartedCollection-seed#[CCAF670AC0F667D4]) [    ] o.a.s.c.c.SolrZkClient Using default ZkACLProvider
   [junit4]   2> 1618082 INFO  (TEST-SolrCloudExampleTest.testLoadDocsIntoGettingStartedCollection-seed#[CCAF670AC0F667D4]) [    ] o.a.s.s.SolrDispatchFilter Loading solr.xml from SolrHome (not found in ZooKeeper)
   [junit4]   2> 1618082 INFO  (TEST-SolrCloudExampleTest.testLoadDocsIntoGettingStartedCollection-seed#[CCAF670AC0F667D4]) [    ] o.a.s.c.SolrXmlConfig Loading container configuration from /x1/jenkins/jenkins-slave/workspace/Lucene-Solr-Tests-trunk-Java8/solr/build/solr-core/test/J2/temp/solr.cloud.SolrCloudExampleTest_CCAF670AC0F667D4-001/control-001/solr.xml
   [junit4]   2> 1618087 INFO  (TEST-SolrCloudExampleTest.testLoadDocsIntoGettingStartedCollection-seed#[CCAF670AC0F667D4]) [    ] o.a.s.c.CoresLocator Config-defined core root directory: /x1/jenkins/jenkins-slave/workspace/Lucene-Solr-Tests-trunk-Java8/solr/build/solr-core/test/J2/temp/solr.cloud.SolrCloudExampleTest_CCAF670AC0F667D4-001/control-001/cores
   [junit4]   2> 1618087 INFO  (TEST-SolrCloudExampleTest.testLoadDocsIntoGettingStartedCollection-seed#[CCAF670AC0F667D4]) [    ] o.a.s.c.CoreContainer New CoreContainer 1197063165
   [junit4]   2> 1618087 INFO  (TEST-SolrCloudExampleTest.testLoadDocsIntoGettingStartedCollection-seed#[CCAF670AC0F667D4]) [    ] o.a.s.c.CoreContainer Loading cores into CoreContainer [instanceDir=/x1/jenkins/jenkins-slave/workspace/Lucene-Solr-Tests-trunk-Java8/solr/build/solr-core/test/J2/temp/solr.cloud.SolrCloudExampleTest_CCAF670AC0F667D4-001/control-001/]
   [junit4]   2> 1618087 INFO  (TEST-SolrCloudExampleTest.testLoadDocsIntoGettingStartedCollection-seed#[CCAF670AC0F667D4]) [    ] o.a.s.c.CoreContainer loading shared library: /x1/jenkins/jenkins-slave/workspace/Lucene-Solr-Tests-trunk-Java8/solr/build/solr-core/test/J2/temp/solr.cloud.SolrCloudExampleTest_CCAF670AC0F667D4-001/control-001/lib
   [junit4]   2> 1618087 WARN  (TEST-SolrCloudExampleTest.testLoadDocsIntoGettingStartedCollection-seed#[CCAF670AC0F667D4]) [    ] o.a.s.c.SolrResourceLoader Can't find (or read) directory to add to classloader: lib (resolved as: /x1/jenkins/jenkins-slave/workspace/Lucene-Solr-Tests-trunk-Java8/solr/build/solr-core/test/J2/temp/solr.cloud.SolrCloudExampleTest_CCAF670AC0F667D4-001/control-001/lib).
   [junit4]   2> 1618094 INFO  (TEST-SolrCloudExampleTest.testLoadDocsIntoGettingStartedCollection-seed#[CCAF670AC0F667D4]) [    ] o.a.s.h.c.HttpShardHandlerFactory created with socketTimeout : 90000,urlScheme : ,connTimeout : 15000,maxConnectionsPerHost : 20,maxConnections : 10000,corePoolSize : 0,maximumPoolSize : 2147483647,maxThreadIdleTime : 5,sizeOfQueue : -1,fairnessPolicy : false,useRetries : false,
   [junit4]   2> 1618096 INFO  (TEST-SolrCloudExampleTest.testLoadDocsIntoGettingStartedCollection-seed#[CCAF670AC0F667D4]) [    ] o.a.s.u.UpdateShardHandler Creating UpdateShardHandler HTTP client with params: socketTimeout=340000&connTimeout=45000&retry=true
   [junit4]   2> 1618096 INFO  (TEST-SolrCloudExampleTest.testLoadDocsIntoGettingStartedCollection-seed#[CCAF670AC0F667D4]) [    ] o.a.s.l.LogWatcher SLF4J impl is org.slf4j.impl.Log4jLoggerFactory
   [junit4]   2> 1618096 INFO  (TEST-SolrCloudExampleTest.testLoadDocsIntoGettingStartedCollection-seed#[CCAF670AC0F667D4]) [    ] o.a.s.l.LogWatcher Registering Log Listener [Log4j (org.slf4j.impl.Log4jLoggerFactory)]
   [junit4]   2> 1618096 INFO  (TEST-SolrCloudExampleTest.testLoadDocsIntoGettingStartedCollection-seed#[CCAF670AC0F667D4]) [    ] o.a.s.c.ZkContainer Zookeeper client=127.0.0.1:58780/solr
   [junit4]   2> 1618096 INFO  (TEST-SolrCloudExampleTest.testLoadDocsIntoGettingStartedCollection-seed#[CCAF670AC0F667D4]) [    ] o.a.s.c.ZkController zkHost includes chroot
   [junit4]   2> 1618096 INFO  (TEST-SolrCloudExampleTest.testLoadDocsIntoGettingStartedCollection-seed#[CCAF670AC0F667D4]) [    ] o.a.s.c.c.SolrZkClient Using default ZkCredentialsProvider
   [junit4]   2> 1618097 INFO  (TEST-SolrCloudExampleTest.testLoadDocsIntoGettingStartedCollection-seed#[CCAF670AC0F667D4]) [    ] o.a.s.c.c.ConnectionManager Waiting for client to connect to ZooKeeper
   [junit4]   2> 1618098 INFO  (zkCallback-1384-thread-1) [    ] o.a.s.c.c.ConnectionManager Watcher org.apache.solr.common.cloud.ConnectionManager@2565547e name:ZooKeeperConnection Watcher:127.0.0.1:58780 got event WatchedEvent state:SyncConnected type:None path:null path:null type:None
   [junit4]   2> 1618098 INFO  (TEST-SolrCloudExampleTest.testLoadDocsIntoGettingStartedCollection-seed#[CCAF670AC0F667D4]) [    ] o.a.s.c.c.ConnectionManager Client is connected to ZooKeeper
   [junit4]   2> 1618098 INFO  (TEST-SolrCloudExampleTest.testLoadDocsIntoGettingStartedCollection-seed#[CCAF670AC0F667D4]) [    ] o.a.s.c.c.SolrZkClient Using default ZkACLProvider
   [junit4]   2> 1618100 INFO  (TEST-SolrCloudExampleTest.testLoadDocsIntoGettingStartedCollection-seed#[CCAF670AC0F667D4]) [n:127.0.0.1:33044_    ] o.a.s.c.c.ConnectionManager Waiting for client to connect to ZooKeeper
   [junit4]   2> 1618100 INFO  (zkCallback-1385-thread-1-processing-n:127.0.0.1:33044_) [n:127.0.0.1:33044_    ] o.a.s.c.c.ConnectionManager Watcher org.apache.solr.common.cloud.ConnectionManager@541323d8 name:ZooKeeperConnection Watcher:127.0.0.1:58780/solr got event WatchedEvent state:SyncConnected type:None path:null path:null type:None
   [junit4]   2> 1618100 INFO  (TEST-SolrCloudExampleTest.testLoadDocsIntoGettingStartedCollection-seed#[CCAF670AC0F667D4]) [n:127.0.0.1:33044_    ] o.a.s.c.c.ConnectionManager Client is connected to ZooKeeper
   [junit4]   2> 1618101 INFO  (TEST-SolrCloudExampleTest.testLoadDocsIntoGettingStartedCollection-seed#[CCAF670AC0F667D4]) [n:127.0.0.1:33044_    ] o.a.s.c.c.SolrZkClient makePath: /overseer/queue
   [junit4]   2> 1618103 INFO  (TEST-SolrCloudExampleTest.testLoadDocsIntoGettingStartedCollection-seed#[CCAF670AC0F667D4]) [n:127.0.0.1:33044_    ] o.a.s.c.c.SolrZkClient makePath: /overseer/collection-queue-work
   [junit4]   2> 1618106 INFO  (TEST-SolrCloudExampleTest.testLoadDocsIntoGettingStartedCollection-seed#[CCAF670AC0F667D4]) [n:127.0.0.1:33044_    ] o.a.s.c.c.SolrZkClient makePath: /overseer/collection-map-running
   [junit4]   2> 1618107 INFO  (TEST-SolrCloudExampleTest.testLoadDocsIntoGettingStartedCollection-seed#[CCAF670AC0F667D4]) [n:127.0.0.1:33044_    ] o.a.s.c.c.SolrZkClient makePath: /overseer/collection-map-completed
   [junit4]   2> 1618109 INFO  (TEST-SolrCloudExampleTest.testLoadDocsIntoGettingStartedCollection-seed#[CCAF670AC0F667D4]) [n:127.0.0.1:33044_    ] o.a.s.c.c.SolrZkClient makePath: /overseer/collection-map-failure
   [junit4]   2> 1618111 INFO  (TEST-SolrCloudExampleTest.testLoadDocsIntoGettingStartedCollection-seed#[CCAF670AC0F667D4]) [n:127.0.0.1:33044_    ] o.a.s.c.c.SolrZkClient makePath: /live_nodes
   [junit4]   2> 1618112 INFO  (TEST-SolrCloudExampleTest.testLoadDocsIntoGettingStartedCollection-seed#[CCAF670AC0F667D4]) [n:127.0.0.1:33044_    ] o.a.s.c.c.SolrZkClient makePath: /aliases.json
   [junit4]   2> 1618114 INFO  (TEST-SolrCloudExampleTest.testLoadDocsIntoGettingStartedCollection-seed#[CCAF670AC0F667D4]) [n:127.0.0.1:33044_    ] o.a.s.c.c.SolrZkClient makePath: /clusterstate.json
   [junit4]   2> 1618115 INFO  (TEST-SolrCloudExampleTest.testLoadDocsIntoGettingStartedCollection-seed#[CCAF670AC0F667D4]) [n:127.0.0.1:33044_    ] o.a.s.c.c.SolrZkClient makePath: /security.json
   [junit4]   2> 1618116 INFO  (TEST-SolrCloudExampleTest.testLoadDocsIntoGettingStartedCollection-seed#[CCAF670AC0F667D4]) [n:127.0.0.1:33044_    ] o.a.s.c.ZkController Register node as live in ZooKeeper:/live_nodes/127.0.0.1:33044_
   [junit4]   2> 1618116 INFO  (TEST-SolrCloudExampleTest.testLoadDocsIntoGettingStartedCollection-seed#[CCAF670AC0F667D4]) [n:127.0.0.1:33044_    ] o.a.s.c.c.SolrZkClient makePath: /live_nodes/127.0.0.1:33044_
   [junit4]   2> 1618117 INFO  (TEST-SolrCloudExampleTest.testLoadDocsIntoGettingStartedCollection-seed#[CCAF670AC0F667D4]) [n:127.0.0.1:33044_    ] o.a.s.c.c.SolrZkClient makePath: /overseer_elect
   [junit4]   2> 1618118 INFO  (TEST-SolrCloudExampleTest.testLoadDocsIntoGettingStartedCollection-seed#[CCAF670AC0F667D4]) [n:127.0.0.1:33044_    ] o.a.s.c.c.SolrZkClient makePath: /overseer_elect/election
   [junit4]   2> 1618119 INFO  (TEST-SolrCloudExampleTest.testLoadDocsIntoGettingStartedCollection-seed#[CCAF670AC0F667D4]) [n:127.0.0.1:33044_    ] o.a.s.c.Overseer Overseer (id=null) closing
   [junit4]   2> 1618120 INFO  (TEST-SolrCloudExampleTest.testLoadDocsIntoGettingStartedCollection-seed#[CCAF670AC0F667D4]) [n:127.0.0.1:33044_    ] o.a.s.c.LeaderElector Joined leadership election with path: /overseer_elect/election/94684035941400580-127.0.0.1:33044_-n_0000000000
   [junit4]   2> 1618120 INFO  (TEST-SolrCloudExampleTest.testLoadDocsIntoGettingStartedCollection-seed#[CCAF670AC0F667D4]) [n:127.0.0.1:33044_    ] o.a.s.c.OverseerElectionContext I am going to be the leader 127.0.0.1:33044_
   [junit4]   2> 1618120 INFO  (TEST-SolrCloudExampleTest.testLoadDocsIntoGettingStartedCollection-seed#[CCAF670AC0F667D4]) [n:127.0.0.1:33044_    ] o.a.s.c.c.SolrZkClient makePath: /overseer_elect/leader
   [junit4]   2> 1618121 INFO  (TEST-SolrCloudExampleTest.testLoadDocsIntoGettingStartedCollection-seed#[CCAF670AC0F667D4]) [n:127.0.0.1:33044_    ] o.a.s.c.Overseer Overseer (id=94684035941400580-127.0.0.1:33044_-n_0000000000) starting
   [junit4]   2> 1618123 INFO  (TEST-SolrCloudExampleTest.testLoadDocsIntoGettingStartedCollection-seed#[CCAF670AC0F667D4]) [n:127.0.0.1:33044_    ] o.a.s.c.c.SolrZkClient makePath: /overseer/queue-work
   [junit4]   2> 1618128 INFO  (TEST-SolrCloudExampleTest.testLoadDocsIntoGettingStartedCollection-seed#[CCAF670AC0F667D4]) [n:127.0.0.1:33044_    ] o.a.s.c.OverseerAutoReplicaFailoverThread Starting OverseerAutoReplicaFailoverThread autoReplicaFailoverWorkLoopDelay=10000 autoReplicaFailoverWaitAfterExpiration=30000 autoReplicaFailoverBadNodeExpiration=60000
   [junit4]   2> 1618128 INFO  (TEST-SolrCloudExampleTest.testLoadDocsIntoGettingStartedCollection-seed#[CCAF670AC0F667D4]) [n:127.0.0.1:33044_    ] o.a.s.c.c.ZkStateReader Updating cluster state from ZooKeeper... 
   [junit4]   2> 1618129 INFO  (OverseerCollectionConfigSetProcessor-94684035941400580-127.0.0.1:33044_-n_0000000000) [n:127.0.0.1:33044_    ] o.a.s.c.OverseerTaskProcessor Process current queue of overseer operations
   [junit4]   2> 1618129 INFO  (OverseerStateUpdate-94684035941400580-127.0.0.1:33044_-n_0000000000) [n:127.0.0.1:33044_    ] o.a.s.c.Overseer Starting to work on the main queue
   [junit4]   2> 1618144 INFO  (TEST-SolrCloudExampleTest.testLoadDocsIntoGettingStartedCollection-seed#[CCAF670AC0F667D4]) [n:127.0.0.1:33044_    ] o.a.s.c.CoreContainer Security conf doesn't exist. Skipping setup for authorization module.
   [junit4]   2> 1618144 INFO  (TEST-SolrCloudExampleTest.testLoadDocsIntoGettingStartedCollection-seed#[CCAF670AC0F667D4]) [n:127.0.0.1:33044_    ] o.a.s.c.CoreContainer No authentication plugin used.
   [junit4]   2> 1618145 INFO  (TEST-SolrCloudExampleTest.testLoadDocsIntoGettingStartedCollection-seed#[CCAF670AC0F667D4]) [n:127.0.0.1:33044_    ] o.a.s.c.CoresLocator Looking for core definitions underneath /x1/jenkins/jenkins-slave/workspace/Lucene-Solr-Tests-trunk-Java8/solr/build/solr-core/test/J2/temp/solr.cloud.SolrCloudExampleTest_CCAF670AC0F667D4-001/control-001/cores
   [junit4]   2> 1618146 INFO  (TEST-SolrCloudExampleTest.testLoadDocsIntoGettingStartedCollection-seed#[CCAF670AC0F667D4]) [n:127.0.0.1:33044_    ] o.a.s.c.SolrCore Created CoreDescriptor: {name=collection1, config=solrconfig.xml, transient=false, schema=schema.xml, loadOnStartup=true, configSetProperties=configsetprops.json, instanceDir=/x1/jenkins/jenkins-slave/workspace/Lucene-Solr-Tests-trunk-Java8/solr/build/solr-core/test/J2/temp/solr.cloud.SolrCloudExampleTest_CCAF670AC0F667D4-001/control-001/cores/collection1, collection=control_collection, absoluteInstDir=/x1/jenkins/jenkins-slave/workspace/Lucene-Solr-Tests-trunk-Java8/solr/build/solr-core/test/J2/temp/solr.cloud.SolrCloudExampleTest_CCAF670AC0F667D4-001/control-001/cores/collection1/, coreNodeName=, dataDir=data/, shard=}
   [junit4]   2> 1618146 INFO  (TEST-SolrCloudExampleTest.testLoadDocsIntoGettingStartedCollection-seed#[CCAF670AC0F667D4]) [n:127.0.0.1:33044_    ] o.a.s.c.CoresLocator Found core collection1 in /x1/jenkins/jenkins-slave/workspace/Lucene-Solr-Tests-trunk-Java8/solr/build/solr-core/test/J2/temp/solr.cloud.SolrCloudExampleTest_CCAF670AC0F667D4-001/control-001/cores/collection1/
   [junit4]   2> 1618146 INFO  (TEST-SolrCloudExampleTest.testLoadDocsIntoGettingStartedCollection-seed#[CCAF670AC0F667D4]) [n:127.0.0.1:33044_    ] o.a.s.c.CoresLocator Found 1 core definitions
   [junit4]   2> 1618147 INFO  (TEST-SolrCloudExampleTest.testLoadDocsIntoGettingStartedCollection-seed#[CCAF670AC0F667D4]) [n:127.0.0.1:33044_    ] o.a.s.s.SolrDispatchFilter user.dir=/x1/jenkins/jenkins-slave/workspace/Lucene-Solr-Tests-trunk-Java8/solr/build/solr-core/test/J2
   [junit4]   2> 1618147 INFO  (coreLoadExecutor-4518-thread-1-processing-n:127.0.0.1:33044_) [n:127.0.0.1:33044_ c:control_collection   x:collection1] o.a.s.c.ZkController publishing state=down
   [junit4]   2> 1618147 INFO  (TEST-SolrCloudExampleTest.testLoadDocsIntoGettingStartedCollection-seed#[CCAF670AC0F667D4]) [n:127.0.0.1:33044_    ] o.a.s.s.SolrDispatchFilter SolrDispatchFilter.init() done
   [junit4]   2> 1618147 INFO  (coreLoadExecutor-4518-thread-1-processing-n:127.0.0.1:33044_) [n:127.0.0.1:33044_ c:control_collection   x:collection1] o.a.s.c.ZkController numShards not found on descriptor - reading it from system property
   [junit4]   2> 1618149 INFO  (OverseerStateUpdate-94684035941400580-127.0.0.1:33044_-n_0000000000) [n:127.0.0.1:33044_    ] o.a.s.c.Overseer processMessage: queueSize: 1, message = {
   [junit4]   2>   "core":"collection1",
   [junit4]   2>   "roles":null,
   [junit4]   2>   "base_url":"http://127.0.0.1:33044",
   [junit4]   2>   "node_name":"127.0.0.1:33044_",
   [junit4]   2>   "numShards":"1",
   [junit4]   2>   "state":"down",
   [junit4]   2>   "shard":null,
   [junit4]   2>   "collection":"control_collection",
   [junit4]   2>   "operation":"state"} current state version: 0
   [junit4]   2> 1618149 INFO  (coreLoadExecutor-4518-thread-1-processing-n:127.0.0.1:33044_) [n:127.0.0.1:33044_ c:control_collection   x:collection1] o.a.s.c.ZkController look for our core node name
   [junit4]   2> 1618149 INFO  (OverseerStateUpdate-94684035941400580-127.0.0.1:33044_-n_0000000000) [n:127.0.0.1:33044_    ] o.a.s.c.o.ReplicaMutator Update state numShards=1 message={
   [junit4]   2>   "core":"collection1",
   [junit4]   2>   "roles":null,
   [junit4]   2>   "base_url":"http://127.0.0.1:33044",
   [junit4]   2>   "node_name":"127.0.0.1:33044_",
   [junit4]   2>   "numShards":"1",
   [junit4]   2>   "state":"down",
   [junit4]   2>   "shard":null,
   [junit4]   2>   "collection":"control_collection",
   [junit4]   2>   "operation":"state"}
   [junit4]   2> 1618150 INFO  (OverseerStateUpdate-94684035941400580-127.0.0.1:33044_-n_0000000000) [n:127.0.0.1:33044_    ] o.a.s.c.o.ClusterStateMutator building a new cName: control_collection
   [junit4]   2> 1618150 INFO  (OverseerStateUpdate-94684035941400580-127.0.0.1:33044_-n_0000000000) [n:127.0.0.1:33044_    ] o.a.s.c.o.ReplicaMutator Assigning new node to shard shard=shard1
   [junit4]   2> 1618152 INFO  (zkCallback-1385-thread-1-processing-n:127.0.0.1:33044_) [n:127.0.0.1:33044_    ] o.a.s.c.c.ZkStateReader A cluster state change: WatchedEvent state:SyncConnected type:NodeDataChanged path:/clusterstate.json, has occurred - updating... (live nodes size: 1)
   [junit4]   2> 1619149 INFO  (coreLoadExecutor-4518-thread-1-processing-n:127.0.0.1:33044_) [n:127.0.0.1:33044_ c:control_collection   x:collection1] o.a.s.c.ZkController waiting to find shard id in clusterstate for collection1
   [junit4]   2> 1619150 INFO  (coreLoadExecutor-4518-thread-1-processing-n:127.0.0.1:33044_) [n:127.0.0.1:33044_ c:control_collection   x:collection1] o.a.s.c.ZkController Check for collection zkNode:control_collection
   [junit4]   2> 1619150 INFO  (coreLoadExecutor-4518-thread-1-processing-n:127.0.0.1:33044_) [n:127.0.0.1:33044_ c:control_collection   x:collection1] o.a.s.c.ZkController Collection zkNode exists
   [junit4]   2> 1619150 INFO  (coreLoadExecutor-4518-thread-1-processing-n:127.0.0.1:33044_) [n:127.0.0.1:33044_ c:control_collection   x:collection1] o.a.s.c.c.ZkStateReader Load collection config from:/collections/control_collection
   [junit4]   2> 1619151 INFO  (coreLoadExecutor-4518-thread-1-processing-n:127.0.0.1:33044_) [n:127.0.0.1:33044_ c:control_collection   x:collection1] o.a.s.c.c.ZkStateReader path=/collections/control_collection configName=conf1 specified config exists in ZooKeeper
   [junit4]   2> 1619151 INFO  (coreLoadExecutor-4518-thread-1-processing-n:127.0.0.1:33044_) [n:127.0.0.1:33044_ c:control_collection   x:collection1] o.a.s.c.SolrResourceLoader new SolrResourceLoader for directory: '/x1/jenkins/jenkins-slave/workspace/Lucene-Solr-Tests-trunk-Java8/solr/build/solr-core/test/J2/temp/solr.cloud.SolrCloudExampleTest_CCAF670AC0F667D4-001/control-001/cores/collection1/'
   [junit4]   2> 1619151 INFO  (coreLoadExecutor-4518-thread-1-processing-n:127.0.0.1:33044_) [n:127.0.0.1:33044_ c:control_collection   x:collection1] o.a.s.c.SolrResourceLoader JNDI not configured for solr (NoInitialContextEx)
   [junit4]   2> 1619151 INFO  (coreLoadExecutor-4518-thread-1-processing-n:127.0.0.1:33044_) [n:127.0.0.1:33044_ c:control_collection   x:collection1] o.a.s.c.SolrResourceLoader solr home defaulted to 'solr/' (could not find system property or JNDI)
   [junit4]   2> 1619167 INFO  (coreLoadExecutor-4518-thread-1-processing-n:127.0.0.1:33044_) [n:127.0.0.1:33044_ c:control_collection   x:collection1] o.a.s.c.Config loaded config solrconfig.xml with version 0 
   [junit4]   2> 1619171 INFO  (coreLoadExecutor-4518-thread-1-processing-n:127.0.0.1:33044_) [n:127.0.0.1:33044_ c:control_collection   x:collection1] o.a.s.c.SolrConfig current version of requestparams : -1
   [junit4]   2> 1619175 INFO  (coreLoadExecutor-4518-thread-1-processing-n:127.0.0.1:33044_) [n:127.0.0.1:33044_ c:control_collection   x:collection1] o.a.s.c.SolrConfig Using Lucene MatchVersion: 6.0.0
   [junit4]   2> 1619182 INFO  (coreLoadExecutor-4518-thread-1-processing-n:127.0.0.1:33044_) [n:127.0.0.1:33044_ c:control_collection   x:collection1] o.a.s.c.Config Loaded SolrConfig: solrconfig.xml
   [junit4]   2> 1619184 INFO  (coreLoadExecutor-4518-thread-1-processing-n:127.0.0.1:33044_) [n:127.0.0.1:33044_ c:control_collection   x:collection1] o.a.s.s.IndexSchema Reading Solr Schema from /configs/conf1/schema.xml
   [junit4]   2> 1619188 INFO  (coreLoadExecutor-4518-thread-1-processing-n:127.0.0.1:33044_) [n:127.0.0.1:33044_ c:control_collection   x:collection1] o.a.s.s.IndexSchema [collection1] Schema name=test
   [junit4]   2> 1619287 INFO  (coreLoadExecutor-4518-thread-1-processing-n:127.0.0.1:33044_) [n:127.0.0.1:33044_ c:control_collection   x:collection1] o.a.s.s.OpenExchangeRatesOrgProvider Initialized with rates=open-exchange-rates.json, refreshInterval=1440.
   [junit4]   2> 1619293 INFO  (coreLoadExecutor-4518-thread-1-processing-n:127.0.0.1:33044_) [n:127.0.0.1:33044_ c:control_collection   x:collection1] o.a.s.s.IndexSchema default search field in schema is text
   [junit4]   2> 1619294 INFO  (coreLoadExecutor-4518-thread-1-processing-n:127.0.0.1:33044_) [n:127.0.0.1:33044_ c:control_collection   x:collection1] o.a.s.s.IndexSchema unique key field: id
   [junit4]   2> 1619302 INFO  (coreLoadExecutor-4518-thread-1-processing-n:127.0.0.1:33044_) [n:127.0.0.1:33044_ c:control_collection   x:collection1] o.a.s.s.FileExchangeRateProvider Reloading exchange rates from file currency.xml
   [junit4]   2> 1619304 INFO  (coreLoadExecutor-4518-thread-1-processing-n:127.0.0.1:33044_) [n:127.0.0.1:33044_ c:control_collection   x:collection1] o.a.s.s.FileExchangeRateProvider Reloading exchange rates from file currency.xml
   [junit4]   2> 1619306 INFO  (coreLoadExecutor-4518-thread-1-processing-n:127.0.0.1:33044_) [n:127.0.0.1:33044_ c:control_collection   x:collection1] o.a.s.s.OpenExchangeRatesOrgProvider Reloading exchange rates from open-exchange-rates.json
   [junit4]   2> 1619307 WARN  (coreLoadExecutor-4518-thread-1-processing-n:127.0.0.1:33044_) [n:127.0.0.1:33044_ c:control_collection   x:collection1] o.a.s.s.OpenExchangeRatesOrgProvider Unknown key IMPORTANT NOTE
   [junit4]   2> 1619307 WARN  (coreLoadExecutor-4518-thread-1-processing-n:127.0.0.1:33044_) [n:127.0.0.1:33044_ c:control_collection   x:collection1] o.a.s.s.OpenExchangeRatesOrgProvider Expected key, got STRING
   [junit4]   2> 1619307 INFO  (coreLoadExecutor-4518-thread-1-processing-n:127.0.0.1:33044_) [n:127.0.0.1:33044_ c:control_collection   x:collection1] o.a.s.s.OpenExchangeRatesOrgProvider Reloading exchange rates from open-exchange-rates.json
   [junit4]   2> 1619308 WARN  (coreLoadExecutor-4518-thread-1-processing-n:127.0.0.1:33044_) [n:127.0.0.1:33044_ c:control_collection   x:collection1] o.a.s.s.OpenExchangeRatesOrgProvider Unknown key IMPORTANT NOTE
   [junit4]   2> 1619308 WARN  (coreLoadExecutor-4518-thread-1-processing-n:127.0.0.1:33044_) [n:127.0.0.1:33044_ c:control_collection   x:collection1] o.a.s.s.OpenExchangeRatesOrgProvider Expected key, got STRING
   [junit4]   2> 1619309 INFO  (coreLoadExecutor-4518-thread-1-processing-n:127.0.0.1:33044_) [n:127.0.0.1:33044_ c:control_collection   x:collection1] o.a.s.c.ConfigSetProperties Did not find ConfigSet properties, assuming default properties: Can't find resource 'configsetprops.json' in classpath or '/configs/conf1', cwd=/x1/jenkins/jenkins-slave/workspace/Lucene-Solr-Tests-trunk-Java8/solr/build/solr-core/test/J2
   [junit4]   2> 1619309 INFO  (coreLoadExecutor-4518-thread-1-processing-n:127.0.0.1:33044_) [n:127.0.0.1:33044_ c:control_collection   x:collection1] o.a.s.c.CoreContainer Creating SolrCore 'collection1' using configuration from collection control_collection
   [junit4]   2> 1619309 INFO  (coreLoadExecutor-4518-thread-1-processing-n:127.0.0.1:33044_) [n:127.0.0.1:33044_ c:control_collection s:shard1 r:core_node1 x:collection1] o.a.s.c.SolrCore org.apache.solr.core.MockDirectoryFactory
   [junit4]   2> 1619310 INFO  (coreLoadExecutor-4518-thread-1-processing-n:127.0.0.1:33044_) [n:127.0.0.1:33044_ c:control_collection s:shard1 r:core_node1 x:collection1] o.a.s.c.SolrCore [[collection1] ] Opening new SolrCore at [/x1/jenkins/jenkins-slave/workspace/Lucene-Solr-Tests-trunk-Java8/solr/build/solr-core/test/J2/temp/solr.cloud.SolrCloudExampleTest_CCAF670AC0F667D4-001/control-001/cores/collection1/], dataDir=[null]
   [junit4]   2> 1619310 INFO  (coreLoadExecutor-4518-thread-1-processing-n:127.0.0.1:33044_) [n:127.0.0.1:33044_ c:control_collection s:shard1 r:core_node1 x:collection1] o.a.s.c.JmxMonitoredMap JMX monitoring is enabled. Adding Solr mbeans to JMX Server: com.sun.jmx.mbeanserver.JmxMBeanServer@47fb200
   [junit4]   2> 1619310 INFO  (coreLoadExecutor-4518-thread-1-processing-n:127.0.0.1:33044_) [n:127.0.0.1:33044_ c:control_collection s:shard1 r:core_node1 x:collection1] o.a.s.c.CachingDirectoryFactory return new directory for /x1/jenkins/jenkins-slave/workspace/Lucene-Solr-Tests-trunk-Java8/solr/build/solr-core/test/J2/temp/solr.cloud.SolrCloudExampleTest_CCAF670AC0F667D4-001/control-001/cores/collection1/data
   [junit4]   2> 1619311 INFO  (coreLoadExecutor-4518-thread-1-processing-n:127.0.0.1:33044_) [n:127.0.0.1:33044_ c:control_collection s:shard1 r:core_node1 x:collection1] o.a.s.c.SolrCore New index directory detected: old=null new=/x1/jenkins/jenkins-slave/workspace/Lucene-Solr-Tests-trunk-Java8/solr/build/solr-core/test/J2/temp/solr.cloud.SolrCloudExampleTest_CCAF670AC0F667D4-001/control-001/cores/collection1/data/index/
   [junit4]   2> 1619311 WARN  (coreLoadExecutor-4518-thread-1-processing-n:127.0.0.1:33044_) [n:127.0.0.1:33044_ c:control_collection s:shard1 r:core_node1 x:collection1] o.a.s.c.SolrCore [collection1] Solr index directory '/x1/jenkins/jenkins-slave/workspace/Lucene-Solr-Tests-trunk-Java8/solr/build/solr-core/test/J2/temp/solr.cloud.SolrCloudExampleTest_CCAF670AC0F667D4-001/control-001/cores/collection1/data/index' doesn't exist. Creating new index...
   [junit4]   2> 1619311 INFO  (coreLoadExecutor-4518-thread-1-processing-n:127.0.0.1:33044_) [n:127.0.0.1:33044_ c:control_collection s:shard1 r:core_node1 x:collection1] o.a.s.c.CachingDirectoryFactory return new directory for /x1/jenkins/jenkins-slave/workspace/Lucene-Solr-Tests-trunk-Java8/solr/build/solr-core/test/J2/temp/solr.cloud.SolrCloudExampleTest_CCAF670AC0F667D4-001/control-001/cores/collection1/data/index
   [junit4]   2> 1619311 INFO  (coreLoadExecutor-4518-thread-1-processing-n:127.0.0.1:33044_) [n:127.0.0.1:33044_ c:control_collection s:shard1 r:core_node1 x:collection1] o.a.s.u.RandomMergePolicy RandomMergePolicy wrapping class org.apache.lucene.index.LogDocMergePolicy: [LogDocMergePolicy: minMergeSize=1000, mergeFactor=43, maxMergeSize=9223372036854775807, maxMergeSizeForForcedMerge=9223372036854775807, calibrateSizeByDeletes=true, maxMergeDocs=2147483647, maxCFSSegmentSizeMB=8.796093022207999E12, noCFSRatio=0.0]
   [junit4]   2> 1619312 INFO  (coreLoadExecutor-4518-thread-1-processing-n:127.0.0.1:33044_) [n:127.0.0.1:33044_ c:control_collection s:shard1 r:core_node1 x:collection1] o.a.s.c.SolrCore SolrDeletionPolicy.onCommit: commits: num=1
   [junit4]   2> 	commit{dir=MockDirectoryWrapper(RAMDirectory@7509c250 lockFactory=org.apache.lucene.store.SingleInstanceLockFactory@268aa6e0),segFN=segments_1,generation=1}
   [junit4]   2> 1619312 INFO  (coreLoadExecutor-4518-thread-1-processing-n:127.0.0.1:33044_) [n:127.0.0.1:33044_ c:control_collection s:shard1 r:core_node1 x:collection1] o.a.s.c.SolrCore newest commit generation = 1
   [junit4]   2> 1619313 INFO  (OldIndexDirectoryCleanupThreadForCore-collection1) [n:127.0.0.1:33044_ c:control_collection s:shard1 r:core_node1 x:collection1] o.a.s.c.SolrCore Looking for old index directories to cleanup for core collection1 in /x1/jenkins/jenkins-slave/workspace/Lucene-Solr-Tests-trunk-Java8/solr/build/solr-core/test/J2/temp/solr.cloud.SolrCloudExampleTest_CCAF670AC0F667D4-001/control-001/cores/collection1/data/
   [junit4]   2> 1619313 WARN  (OldIndexDirectoryCleanupThreadForCore-collection1) [n:127.0.0.1:33044_ c:control_collection s:shard1 r:core_node1 x:collection1] o.a.s.c.DirectoryFactory /x1/jenkins/jenkins-slave/workspace/Lucene-Solr-Tests-trunk-Java8/solr/build/solr-core/test/J2/temp/solr.cloud.SolrCloudExampleTest_CCAF670AC0F667D4-001/control-001/cores/collection1/data/ does not point to a valid data directory; skipping clean-up of old index directories.
   [junit4]   2> 1619316 INFO  (coreLoadExecutor-4518-thread-1-processing-n:127.0.0.1:33044_) [n:127.0.0.1:33044_ c:control_collection s:shard1 r:core_node1 x:collection1] o.a.s.u.p.UpdateRequestProcessorChain creating updateRequestProcessorChain "nodistrib"
   [junit4]   2> 1619316 INFO  (coreLoadExecutor-4518-thread-1-processing-n:127.0.0.1:33044_) [n:127.0.0.1:33044_ c:control_collection s:shard1 r:core_node1 x:collection1] o.a.s.u.p.UpdateRequestProcessorChain creating updateRequestProcessorChain "dedupe"
   [junit4]   2> 1619316 INFO  (coreLoadExecutor-4518-thread-1-processing-n:127.0.0.1:33044_) [n:127.0.0.1:33044_ c:control_collection s:shard1 r:core_node1 x:collection1] o.a.s.u.p.UpdateRequestProcessorChain inserting DistributedUpdateProcessorFactory into updateRequestProcessorChain "dedupe"
   [junit4]   2> 1619316 INFO  (coreLoadExecutor-4518-thread-1-processing-n:127.0.0.1:33044_) [n:127.0.0.1:33044_ c:control_collection s:shard1 r:core_node1 x:collection1] o.a.s.u.p.UpdateRequestProcessorChain creating updateRequestProcessorChain "stored_sig"
   [junit4]   2> 1619316 INFO  (coreLoadExecutor-4518-thread-1-processing-n:127.0.0.1:33044_) [n:127.0.0.1:33044_ c:control_collection s:shard1 r:core_node1 x:collection1] o.a.s.u.p.UpdateRequestProcessorChain inserting DistributedUpdateProcessorFactory into updateRequestProcessorChain "stored_sig"
   [junit4]   2> 1619316 INFO  (coreLoadExecutor-4518-thread-1-processing-n:127.0.0.1:33044_) [n:127.0.0.1:33044_ c:control_collection s:shard1 r:core_node1 x:collection1] o.a.s.u.p.UpdateRequestProcessorChain creating updateRequestProcessorChain "distrib-dup-test-chain-explicit"
   [junit4]   2> 1619317 INFO  (coreLoadExecutor-4518-thread-1-processing-n:127.0.0.1:33044_) [n:127.0.0.1:33044_ c:control_collection s:shard1 r:core_node1 x:collection1] o.a.s.u.p.UpdateRequestProcessorChain creating updateRequestProcessorChain "distrib-dup-test-chain-implicit"
   [junit4]   2> 1619317 INFO  (coreLoadExecutor-4518-thread-1-processing-n:127.0.0.1:33044_) [n:127.0.0.1:33044_ c:control_collection s:shard1 r:core_node1 x:collection1] o.a.s.u.p.UpdateRequestProcessorChain inserting DistributedUpdateProcessorFactory into updateRequestProcessorChain "distrib-dup-test-chain-implicit"
   [junit4]   2> 1619317 INFO  (coreLoadExecutor-4518-thread-1-processing-n:127.0.0.1:33044_) [n:127.0.0.1:33044_ c:control_collection s:shard1 r:core_node1 x:collection1] o.a.s.c.SolrCore no updateRequestProcessorChain defined as default, creating implicit default
   [junit4]   2> 1619319 INFO  (coreLoadExecutor-4518-thread-1-processing-n:127.0.0.1:33044_) [n:127.0.0.1:33044_ c:control_collection s:shard1 r:core_node1 x:collection1] o.a.s.h.l.XMLLoader xsltCacheLifetimeSeconds=60
   [junit4]   2> 1619320 INFO  (coreLoadExecutor-4518-thread-1-processing-n:127.0.0.1:33044_) [n:127.0.0.1:33044_ c:control_collection s:shard1 r:core_node1 x:collection1] o.a.s.h.l.XMLLoader xsltCacheLifetimeSeconds=60
   [junit4]   2> 1619321 INFO  (coreLoadExecutor-4518-thread-1-processing-n:127.0.0.1:33044_) [n:127.0.0.1:33044_ c:control_collection s:shard1 r:core_node1 x:collection1] o.a.s.h.l.XMLLoader xsltCacheLifetimeSeconds=60
   [junit4]   2> 1619322 INFO  (coreLoadExecutor-4518-thread-1-processing-n:127.0.0.1:33044_) [n:127.0.0.1:33044_ c:control_collection s:shard1 r:core_node1 x:collection1] o.a.s.h.l.XMLLoader xsltCacheLifetimeSeconds=60
   [junit4]   2> 1619325 INFO  (coreLoadExecutor-4518-thread-1-processing-n:127.0.0.1:33044_) [n:127.0.0.1:33044_ c:control_collection s:shard1 r:core_node1 x:collection1] o.a.s.c.RequestHandlers Registered paths: /admin/mbeans,standard,/update/csv,/update/json/docs,/admin/luke,/admin/segments,/get,/admin/system,/replication,/admin/properties,/config,/schema,/admin/plugins,/admin/logging,/update/json,/admin/threads,/admin/ping,/update,/admin/file
   [junit4]   2> 1619325 INFO  (coreLoadExecutor-4518-thread-1-processing-n:127.0.0.1:33044_) [n:127.0.0.1:33044_ c:control_collection s:shard1 r:core_node1 x:collection1] o.a.s.c.SolrCore Using default statsCache cache: org.apache.solr.search.stats.LocalStatsCache
   [junit4]   2> 1619326 INFO  (coreLoadExecutor-4518-thread-1-processing-n:127.0.0.1:33044_) [n:127.0.0.1:33044_ c:control_collection s:shard1 r:core_node1 x:collection1] o.a.s.u.UpdateHandler Using UpdateLog implementation: org.apache.solr.update.UpdateLog
   [junit4]   2> 1619326 INFO  (coreLoadExecutor-4518-thread-1-processing-n:127.0.0.1:33044_) [n:127.0.0.1:33044_ c:control_collection s:shard1 r:core_node1 x:collection1] o.a.s.u.UpdateLog Initializing UpdateLog: dataDir= defaultSyncLevel=FLUSH numRecordsToKeep=100 maxNumLogsToKeep=10 numVersionBuckets=65536
   [junit4]   2> 1619327 INFO  (coreLoadExecutor-4518-thread-1-processing-n:127.0.0.1:33044_) [n:127.0.0.1:33044_ c:control_collection s:shard1 r:core_node1 x:collection1] o.a.s.c.SolrCore Hard AutoCommit: disabled
   [junit4]   2> 1619327 INFO  (coreLoadExecutor-4518-thread-1-processing-n:127.0.0.1:33044_) [n:127.0.0.1:33044_ c:control_collection s:shard1 r:core_node1 x:collection1] o.a.s.c.SolrCore Soft AutoCommit: disabled
   [junit4]   2> 1619327 INFO  (coreLoadExecutor-4518-thread-1-processing-n:127.0.0.1:33044_) [n:127.0.0.1:33044_ c:control_collection s:shard1 r:core_node1 x:collection1] o.a.s.u.RandomMergePolicy RandomMergePolicy wrapping class org.apache.lucene.index.TieredMergePolicy: [TieredMergePolicy: maxMergeAtOnce=10, maxMergeAtOnceExplicit=26, maxMergedSegmentMB=0.796875, floorSegmentMB=1.94140625, forceMergeDeletesPctAllowed=8.401262704903132, segmentsPerTier=20.0, maxCFSSegmentSizeMB=8.796093022207999E12, noCFSRatio=0.0
   [junit4]   2> 1619328 INFO  (coreLoadExecutor-4518-thread-1-processing-n:127.0.0.1:33044_) [n:127.0.0.1:33044_ c:control_collection s:shard1 r:core_node1 x:collection1] o.a.s.c.SolrCore SolrDeletionPolicy.onInit: commits: num=1
   [junit4]   2> 	commit{dir=MockDirectoryWrapper(RAMDirectory@7509c250 lockFactory=org.apache.lucene.store.SingleInstanceLockFactory@268aa6e0),segFN=segments_1,generation=1}
   [junit4]   2> 1619328 INFO  (coreLoadExecutor-4518-thread-1-processing-n:127.0.0.1:33044_) [n:127.0.0.1:33044_ c:control_collection s:shard1 r:core_node1 x:collection1] o.a.s.c.SolrCore newest commit generation = 1
   [junit4]   2> 1619328 INFO  (coreLoadExecutor-4518-thread-1-processing-n:127.0.0.1:33044_) [n:127.0.0.1:33044_ c:control_collection s:shard1 r:core_node1 x:collection1] o.a.s.s.SolrIndexSearcher Opening Searcher@35de60e2[collection1] main
   [junit4]   2> 1619328 INFO  (coreLoadExecutor-4518-thread-1-processing-n:127.0.0.1:33044_) [n:127.0.0.1:33044_ c:control_collection s:shard1 r:core_node1 x:collection1] o.a.s.c.c.ZkStateReader Load collection config from:/collections/control_collection
   [junit4]   2> 1619329 INFO  (coreLoadExecutor-4518-thread-1-processing-n:127.0.0.1:33044_) [n:127.0.0.1:33044_ c:control_collection s:shard1 r:core_node1 x:collection1] o.a.s.c.c.ZkStateReader path=/collections/control_collection configName=conf1 specified config exists in ZooKeeper
   [junit4]   2> 1619329 INFO  (coreLoadExecutor-4518-thread-1-processing-n:127.0.0.1:33044_) [n:127.0.0.1:33044_ c:control_collection s:shard1 r:core_node1 x:collection1] o.a.s.r.ManagedResourceStorage Setting up ZooKeeper-based storage for the RestManager with znodeBase: /configs/conf1
   [junit4]   2> 1619329 INFO  (coreLoadExecutor-4518-thread-1-processing-n:127.0.0.1:33044_) [n:127.0.0.1:33044_ c:control_collection s:shard1 r:core_node1 x:collection1] o.a.s.r.ManagedResourceStorage Configured ZooKeeperStorageIO with znodeBase: /configs/conf1
   [junit4]   2> 1619329 INFO  (coreLoadExecutor-4518-thread-1-processing-n:127.0.0.1:33044_) [n:127.0.0.1:33044_ c:control_collection s:shard1 r:core_node1 x:collection1] o.a.s.r.RestManager Initializing RestManager with initArgs: {}
   [junit4]   2> 1619329 INFO  (coreLoadExecutor-4518-thread-1-processing-n:127.0.0.1:33044_) [n:127.0.0.1:33044_ c:control_collection s:shard1 r:core_node1 x:collection1] o.a.s.r.ManagedResourceStorage Reading _rest_managed.json using ZooKeeperStorageIO:path=/configs/conf1
   [junit4]   2> 1619330 INFO  (coreLoadExecutor-4518-thread-1-processing-n:127.0.0.1:33044_) [n:127.0.0.1:33044_ c:control_collection s:shard1 r:core_node1 x:collection1] o.a.s.r.ManagedResourceStorage No data found for znode /configs/conf1/_rest_managed.json
   [junit4]   2> 1619330 INFO  (coreLoadExecutor-4518-thread-1-processing-n:127.0.0.1:33044_) [n:127.0.0.1:33044_ c:control_collection s:shard1 r:core_node1 x:collection1] o.a.s.r.ManagedResourceStorage Loaded null at path _rest_managed.json using ZooKeeperStorageIO:path=/configs/conf1
   [junit4]   2> 1619330 INFO  (coreLoadExecutor-4518-thread-1-processing-n:127.0.0.1:33044_) [n:127.0.0.1:33044_ c:control_collection s:shard1 r:core_node1 x:collection1] o.a.s.r.RestManager Initializing 0 registered ManagedResources
   [junit4]   2> 1619330 INFO  (coreLoadExecutor-4518-thread-1-processing-n:127.0.0.1:33044_) [n:127.0.0.1:33044_ c:control_collection s:shard1 r:core_node1 x:collection1] o.a.s.h.ReplicationHandler Commits will be reserved for  10000
   [junit4]   2> 1619331 INFO  (searcherExecutor-4519-thread-1-processing-n:127.0.0.1:33044_ x:collection1 s:shard1 c:control_collection r:core_node1) [n:127.0.0.1:33044_ c:control_collection s:shard1 r:core_node1 x:collection1] o.a.s.c.SolrCore [collection1] Registered new searcher Searcher@35de60e2[collection1] main{ExitableDirectoryReader(UninvertingDirectoryReader())}
   [junit4]   2> 1619331 INFO  (coreLoadExecutor-4518-thread-1-processing-n:127.0.0.1:33044_) [n:127.0.0.1:33044_ c:control_collection s:shard1 r:core_node1 x:collection1] o.a.s.u.UpdateLog Looking up max value of version field to seed version buckets
   [junit4]   2> 1619331 INFO  (coreLoadExecutor-4518-thread-1-processing-n:127.0.0.1:33044_) [n:127.0.0.1:33044_ c:control_collection s:shard1 r:core_node1 x:collection1] o.a.s.u.VersionInfo Refreshing highest value of _version_ for 65536 version buckets from index
   [junit4]   2> 1619331 INFO  (coreLoadExecutor-4518-thread-1-processing-n:127.0.0.1:33044_) [n:127.0.0.1:33044_ c:control_collection s:shard1 r:core_node1 x:collection1] o.a.s.u.VersionInfo No terms found for _version_, cannot seed version bucket highest value from index
   [junit4]   2> 1619331 INFO  (coreLoadExecutor-4518-thread-1-processing-n:127.0.0.1:33044_) [n:127.0.0.1:33044_ c:control_collection s:shard1 r:core_node1 x:collection1] o.a.s.u.UpdateLog Could not find max version in index or recent updates, using new clock 1514944576908951552
   [junit4]   2> 1619333 INFO  (coreLoadExecutor-4518-thread-1-processing-n:127.0.0.1:33044_) [n:127.0.0.1:33044_ c:control_collection s:shard1 r:core_node1 x:collection1] o.a.s.u.UpdateLog Took 2.0ms to seed version buckets with highest version 1514944576908951552
   [junit4]   2> 1619333 INFO  (coreLoadExecutor-4518-thread-1-processing-n:127.0.0.1:33044_) [n:127.0.0.1:33044_ c:control_collection s:shard1 r:core_node1 x:collection1] o.a.s.c.ZkController watch zkdir /configs/conf1
   [junit4]   2> 1619334 INFO  (coreLoadExecutor-4518-thread-1-processing-n:127.0.0.1:33044_) [n:127.0.0.1:33044_ c:control_collection s:shard1 r:core_node1 x:collection1] o.a.s.c.CoreContainer registering core: collection1
   [junit4]   2> 1619334 INFO  (coreZkRegister-4512-thread-1-processing-n:127.0.0.1:33044_ x:collection1 s:shard1 c:control_collection r:core_node1) [n:127.0.0.1:33044_ c:control_collection s:shard1 r:core_node1 x:collection1] o.a.s.c.ZkController Register replica - core:collection1 address:http://127.0.0.1:33044 collection:control_collection shard:shard1
   [junit4]   2> 1619335 INFO  (coreZkRegister-4512-thread-1-processing-n:127.0.0.1:33044_ x:collection1 s:shard1 c:control_collection r:core_node1) [n:127.0.0.1:33044_ c:control_collection s:shard1 r:core_node1 x:collection1] o.a.s.c.c.SolrZkClient makePath: /collections/control_collection/leader_elect/shard1/election
   [junit4]   2> 1619339 INFO  (coreZkRegister-4512-thread-1-processing-n:127.0.0.1:33044_ x:collection1 s:shard1 c:control_collection r:core_node1) [n:127.0.0.1:33044_ c:control_collection s:shard1 r:core_node1 x:collection1] o.a.s.c.LeaderElector Joined leadership election with path: /collections/control_collection/leader_elect/shard1/election/94684035941400580-core_node1-n_0000000000
   [junit4]   2> 1619340 INFO  (coreZkRegister-4512-thread-1-processing-n:127.0.0.1:33044_ x:collection1 s:shard1 c:control_collection r:core_node1) [n:127.0.0.1:33044_ c:control_collection s:shard1 r:core_node1 x:collection1] o.a.s.c.ShardLeaderElectionContext Running the leader process for shard shard1
   [junit4]   2> 1619341 INFO  (coreZkRegister-4512-thread-1-processing-n:127.0.0.1:33044_ x:collection1 s:shard1 c:control_collection r:core_node1) [n:127.0.0.1:33044_ c:control_collection s:shard1 r:core_node1 x:collection1] o.a.s.c.ShardLeaderElectionContext Enough replicas found to continue.
   [junit4]   2> 1619341 INFO  (coreZkRegister-4512-thread-1-processing-n:127.0.0.1:33044_ x:collection1 s:shard1 c:control_collection r:core_node1) [n:127.0.0.1:33044_ c:control_collection s:shard1 r:core_node1 x:collection1] o.a.s.c.ShardLeaderElectionContext I may be the new leader - try and sync
   [junit4]   2> 1619341 INFO  (coreZkRegister-4512-thread-1-processing-n:127.0.0.1:33044_ x:collection1 s:shard1 c:control_collection r:core_node1) [n:127.0.0.1:33044_ c:control_collection s:shard1 r:core_node1 x:collection1] o.a.s.c.SyncStrategy Sync replicas to http://127.0.0.1:33044/collection1/
   [junit4]   2> 1619341 INFO  (coreZkRegister-4512-thread-1-processing-n:127.0.0.1:33044_ x:collection1 s:shard1 c:control_collection r:core_node1) [n:127.0.0.1:33044_ c:control_collection s:shard1 r:core_node1 x:collection1] o.a.s.c.SyncStrategy Sync Success - now sync replicas to me
   [junit4]   2> 1619341 INFO  (OverseerStateUpdate-94684035941400580-127.0.0.1:33044_-n_0000000000) [n:127.0.0.1:33044_    ] o.a.s.c.Overseer processMessage: queueSize: 1, message = {
   [junit4]   2>   "operation":"leader",
   [junit4]   2>   "shard":"shard1",
   [junit4]   2>   "collection":"control_collection"} current state version: 1
   [junit4]   2> 1619341 INFO  (coreZkRegister-4512-thread-1-processing-n:127.0.0.1:33044_ x:collection1 s:shard1 c:control_collection r:core_node1) [n:127.0.0.1:33044_ c:control_collection s:shard1 r:core_node1 x:collection1] o.a.s.c.SyncStrategy http://127.0.0.1:33044/collection1/ has no replicas
   [junit4]   2> 1619342 INFO  (coreZkRegister-4512-thread-1-processing-n:127.0.0.1:33044_ x:collection1 s:shard1 c:control_collection r:core_node1) [n:127.0.0.1:33044_ c:control_collection s:shard1 r:core_node1 x:collection1] o.a.s.c.ShardLeaderElectionContext I am the new leader: http://127.0.0.1:33044/collection1/ shard1
   [junit4]   2> 1619342 INFO  (coreZkRegister-4512-thread-1-processing-n:127.0.0.1:33044_ x:collection1 s:shard1 c:control_collection r:core_node1) [n:127.0.0.1:33044_ c:control_collection s:shard1 r:core_node1 x:collection1] o.a.s.c.c.SolrZkClient makePath: /collections/control_collection/leaders/shard1
   [junit4]   2> 1619345 INFO  (coreZkRegister-4512-thread-1-processing-n:127.0.0.1:33044_ x:collection1 s:shard1 c:control_collection r:core_node1) [n:127.0.0.1:33044_ c:control_collection s:shard1 r:core_node1 x:collection1] o.a.s.c.ShardLeaderElectionContextBase Creating leader registration node
   [junit4]   2> 1619347 INFO  (OverseerStateUpdate-94684035941400580-127.0.0.1:33044_-n_0000000000) [n:127.0.0.1:33044_    ] o.a.s.c.Overseer processMessage: queueSize: 1, message = {
   [junit4]   2>   "operation":"leader",
   [junit4]   2>   "shard":"shard1",
   [junit4]   2>   "collection":"control_collection",
   [junit4]   2>   "base_url":"http://127.0.0.1:33044",
   [junit4]   2>   "core":"collection1",
   [junit4]   2>   "state":"active"} current state version: 1
   [junit4]   2> 1619449 INFO  (zkCallback-1385-thread-1-processing-n:127.0.0.1:33044_) [n:127.0.0.1:33044_    ] o.a.s.c.c.ZkStateReader A cluster state change: WatchedEvent state:SyncConnected type:NodeDataChanged path:/clusterstate.json, has occurred - updating... (live nodes size: 1)
   [junit4]   2> 1619498 INFO  (coreZkRegister-4512-thread-1-processing-n:127.0.0.1:33044_ x:collection1 s:shard1 c:control_collection r:core_node1) [n:127.0.0.1:33044_ c:control_collection s:shard1 r:core_node1 x:collection1] o.a.s.c.ZkController We are http://127.0.0.1:33044/collection1/ and leader is http://127.0.0.1:33044/collection1/
   [junit4]   2> 1619498 INFO  (coreZkRegister-4512-thread-1-processing-n:127.0.0.1:33044_ x:collection1 s:shard1 c:control_collection r:core_node1) [n:127.0.0.1:33044_ c:control_collection s:shard1 r:core_node1 x:collection1] o.a.s.c.ZkController No LogReplay needed for core=collection1 baseURL=http://127.0.0.1:33044
   [junit4]   2> 1619499 INFO  (coreZkRegister-4512-thread-1-processing-n:127.0.0.1:33044_ x:collection1 s:shard1 c:control_collection r:core_node1) [n:127.0.0.1:33044_ c:control_collection s:shard1 r:core_node1 x:collection1] o.a.s.c.ZkController I am the leader, no recovery necessary
   [junit4]   2> 1619499 INFO  (coreZkRegister-4512-thread-1-processing-n:127.0.0.1:33044_ x:collection1 s:shard1 c:control_collection r:core_node1) [n:127.0.0.1:33044_ c:control_collection s:shard1 r:core_node1 x:collection1] o.a.s.c.ZkController publishing state=active
   [junit4]   2> 1619499 INFO  (coreZkRegister-4512-thread-1-processing-n:127.0.0.1:33044_ x:collection1 s:shard1 c:control_collection r:core_node1) [n:127.0.0.1:33044_ c:control_collection s:shard1 r:core_node1 x:collection1] o.a.s.c.ZkController numShards not found on descriptor - reading it from system property
   [junit4]   2> 1619501 INFO  (OverseerStateUpdate-94684035941400580-127.0.0.1:33044_-n_0000000000) [n:127.0.0.1:33044_    ] o.a.s.c.Overseer processMessage: queueSize: 1, message = {
   [junit4]   2>   "core":"collection1",
   [junit4]   2>   "core_node_name":"core_node1",
   [junit4]   2>   "roles":null,
   [junit4]   2>   "base_url":"http://127.0.0.1:33044",
   [junit4]   2>   "node_name":"127.0.0.1:33044_",
   [junit4]   2>   "numShards":"1",
   [junit4]   2>   "state":"active",
   [junit4]   2>   "shard":"shard1",
   [junit4]   2>   "collection":"control_collection",
   [junit4]   2>   "operation":"state"} current state version: 2
   [junit4]   2> 1619501 INFO  (OverseerStateUpdate-94684035941400580-127.0.0.1:33044_-n_0000000000) [n:127.0.0.1:33044_    ] o.a.s.c.o.ReplicaMutator Update state numShards=1 message={
   [junit4]   2>   "core":"collection1",
   [junit4]   2>   "core_node_name":"core_node1",
   [junit4]   2>   "roles":null,
   [junit4]   2>   "base_url":"http://127.0.0.1:33044",
   [junit4]   2>   "node_name":"127.0.0.1:33044_",
   [junit4]   2>   "numShards":"1",
   [junit4]   2>   "state":"active",
   [junit4]   2>   "shard":"shard1",
   [junit4]   2>   "collection":"control_collection",
   [junit4]   2>   "operation":"state"}
   [junit4]   2> 1619604 INFO  (zkCallback-1385-thread-2-processing-n:127.0.0.1:33044_) [n:127.0.0.1:33044_    ] o.a.s.c.c.ZkStateReader A cluster state change: WatchedEvent state:SyncConnected type:NodeDataChanged path:/clusterstate.json, has occurred - updating... (live nodes size: 1)
   [junit4]   2> 1619649 INFO  (TEST-SolrCloudExampleTest.testLoadDocsIntoGettingStartedCollection-seed#[CCAF670AC0F667D4]) [    ] o.a.s.c.c.SolrZkClient Using default ZkCredentialsProvider
   [junit4]   2> 1619649 INFO  (TEST-SolrCloudExampleTest.testLoadDocsIntoGettingStartedCollection-seed#[CCAF670AC0F667D4]) [    ] o.a.s.c.c.ConnectionManager Waiting for client to connect to ZooKeeper
   [junit4]   2> 1619650 INFO  (zkCallback-1387-thread-1) [    ] o.a.s.c.c.ConnectionManager Watcher org.apache.solr.common.cloud.ConnectionManager@5fecb3a0 name:ZooKeeperConnection Watcher:127.0.0.1:58780/solr got event WatchedEvent state:SyncConnected type:None path:null path:null type:None
   [junit4]   2> 1619650 INFO  (TEST-SolrCloudExampleTest.testLoadDocsIntoGettingStartedCollection-seed#[CCAF670AC0F667D4]) [    ] o.a.s.c.c.ConnectionManager Client is connected to ZooKeeper
   [junit4]   2> 1619651 INFO  (TEST-SolrCloudExampleTest.testLoadDocsIntoGettingStartedCollection-seed#[CCAF670AC0F667D4]) [    ] o.a.s.c.c.SolrZkClient Using default ZkACLProvider
   [junit4]   2> 1619651 INFO  (TEST-SolrCloudExampleTest.testLoadDocsIntoGettingStartedCollection-seed#[CCAF670AC0F667D4]) [    ] o.a.s.c.c.ZkStateReader Updating cluster state from ZooKeeper... 
   [junit4]   2> 1619653 INFO  (TEST-SolrCloudExampleTest.testLoadDocsIntoGettingStartedCollection-seed#[CCAF670AC0F667D4]) [    ] o.a.s.c.ChaosMonkey monkey: init - expire sessions:false cause connection loss:false
   [junit4]   2> 1619981 INFO  (TEST-SolrCloudExampleTest.testLoadDocsIntoGettingStartedCollection-seed#[CCAF670AC0F667D4]) [    ] o.a.s.SolrTestCaseJ4 Writing core.properties file to /x1/jenkins/jenkins-slave/workspace/Lucene-Solr-Tests-trunk-Java8/solr/build/solr-core/test/J2/temp/solr.cloud.SolrCloudExampleTest_CCAF670AC0F667D4-001/shard-1-001/cores/collection1
   [junit4]   2> 1619981 INFO  (TEST-SolrCloudExampleTest.testLoadDocsIntoGettingStartedCollection-seed#[CCAF670AC0F667D4]) [    ] o.a.s.c.AbstractFullDistribZkTestBase create jetty 1 in directory /x1/jenkins/jenkins-slave/workspace/Lucene-Solr-Tests-trunk-Java8/solr/build/solr-core/test/J2/temp/solr.cloud.SolrCloudExampleTest_CCAF670AC0F667D4-001/shard-1-001
   [junit4]   2> 1619982 INFO  (TEST-SolrCloudExampleTest.testLoadDocsIntoGettingStartedCollection-seed#[CCAF670AC0F667D4]) [    ] o.e.j.s.Server jetty-9.2.13.v20150730
   [junit4]   2> 1619984 INFO  (TEST-SolrCloudExampleTest.testLoadDocsIntoGettingStartedCollection-seed#[CCAF670AC0F667D4]) [    ] o.e.j.s.h.ContextHandler Started o.e.j.s.ServletContextHandler@364f7e5{/,null,AVAILABLE}
   [junit4]   2> 1619984 INFO  (TEST-SolrCloudExampleTest.testLoadDocsIntoGettingStartedCollection-seed#[CCAF670AC0F667D4]) [    ] o.e.j.s.ServerConnector Started ServerConnector@4fd6e91d{HTTP/1.1}{127.0.0.1:44622}
   [junit4]   2> 1619984 INFO  (TEST-SolrCloudExampleTest.testLoadDocsIntoGettingStartedCollection-seed#[CCAF670AC0F667D4]) [    ] o.e.j.s.Server Started @1623379ms
   [junit4]   2> 1619984 INFO  (TEST-SolrCloudExampleTest.testLoadDocsIntoGettingStartedCollection-seed#[CCAF670AC0F667D4]) [    ] o.a.s.c.s.e.JettySolrRunner Jetty properties: {solr.data.dir=/x1/jenkins/jenkins-slave/workspace/Lucene-Solr-Tests-trunk-Java8/solr/build/solr-core/test/J2/temp/solr.cloud.SolrCloudExampleTest_CCAF670AC0F667D4-001/tempDir-001/jetty1, solrconfig=solrconfig.xml, hostContext=/, hostPort=44622, coreRootDirectory=/x1/jenkins/jenkins-slave/workspace/Lucene-Solr-Tests-trunk-Java8/solr/build/solr-core/test/J2/temp/solr.cloud.SolrCloudExampleTest_CCAF670AC0F667D4-001/shard-1-001/cores}
   [junit4]   2> 1619984 INFO  (TEST-SolrCloudExampleTest.testLoadDocsIntoGettingStartedCollection-seed#[CCAF670AC0F667D4]) [    ] o.a.s.s.SolrDispatchFilter SolrDispatchFilter.init(): sun.misc.Launcher$AppClassLoader@4e0e2f2a
   [junit4]   2> 1619984 INFO  (TEST-SolrCloudExampleTest.testLoadDocsIntoGettingStartedCollection-seed#[CCAF670AC0F667D4]) [    ] o.a.s.c.SolrResourceLoader new SolrResourceLoader for directory: '/x1/jenkins/jenkins-slave/workspace/Lucene-Solr-Tests-trunk-Java8/solr/build/solr-core/test/J2/temp/solr.cloud.SolrCloudExampleTest_CCAF670AC0F667D4-001/shard-1-001/'
   [junit4]   2> 1619985 INFO  (TEST-SolrCloudExampleTest.testLoadDocsIntoGettingStartedCollection-seed#[CCAF670AC0F667D4]) [    ] o.a.s.c.SolrResourceLoader JNDI not configured for solr (NoInitialContextEx)
   [junit4]   2> 1619985 INFO  (TEST-SolrCloudExampleTest.testLoadDocsIntoGettingStartedCollection-seed#[CCAF670AC0F667D4]) [    ] o.a.s.c.SolrResourceLoader solr home defaulted to 'solr/' (could not find system property or JNDI)
   [junit4]   2> 1620016 INFO  (TEST-SolrCloudExampleTest.testLoadDocsIntoGettingStartedCollection-seed#[CCAF670AC0F667D4]) [    ] o.a.s.c.c.SolrZkClient Using default ZkCredentialsProvider
   [junit4]   2> 1620017 INFO  (TEST-SolrCloudExampleTest.testLoadDocsIntoGettingStartedCollection-seed#[CCAF670AC0F667D4]) [    ] o.a.s.c.c.ConnectionManager Waiting for client to connect to ZooKeeper
   [junit4]   2> 1620018 INFO  (zkCallback-1388-thread-1) [    ] o.a.s.c.c.ConnectionManager Watcher org.apache.solr.common.cloud.ConnectionManager@7afb60bf name:ZooKeeperConnection Watcher:127.0.0.1:58780/solr got event WatchedEvent state:SyncConnected type:None path:null path:null type:None
   [junit4]   2> 1620018 INFO  (TEST-SolrCloudExampleTest.testLoadDocsIntoGettingStartedCollection-seed#[CCAF670AC0F667D4]) [    ] o.a.s.c.c.ConnectionManager Client is connected to ZooKeeper
   [junit4]   2> 1620018 INFO  (TEST-SolrCloudExampleTest.testLoadDocsIntoGettingStartedCollection-seed#[CCAF670AC0F667D4]) [    ] o.a.s.c.c.SolrZkClient Using default ZkACLProvider
   [junit4]   2> 1620019 INFO  (TEST-SolrCloudExampleTest.testLoadDocsIntoGettingStartedCollection-seed#[CCAF670AC0F667D4]) [    ] o.a.s.s.SolrDispatchFilter Loading solr.xml from SolrHome (not found in ZooKeeper)
   [junit4]   2> 1620019 INFO  (TEST-SolrCloudExampleTest.testLoadDocsIntoGettingStartedCollection-seed#[CCAF670AC0F667D4]) [    ] o.a.s.c.SolrXmlConfig Loading container configuration from /x1/jenkins/jenkins-slave/workspace/Lucene-Solr-Tests-trunk-Java8/solr/build/solr-core/test/J2/temp/solr.cloud.SolrCloudExampleTest_CCAF670AC0F667D4-001/shard-1-001/solr.xml
   [junit4]   2> 1620025 INFO  (TEST-SolrCloudExampleTest.testLoadDocsIntoGettingStartedCollection-seed#[CCAF670AC0F667D4]) [    ] o.a.s.c.CoresLocator Config-defined core root directory: /x1/jenkins/jenkins-slave/workspace/Lucene-Solr-Tests-trunk-Java8/solr/build/solr-core/test/J2/temp/solr.cloud.SolrCloudExampleTest_CCAF670AC0F667D4-001/shard-1-001/cores
   [junit4]   2> 1620025 INFO  (TEST-SolrCloudExampleTest.testLoadDocsIntoGettingStartedCollection-seed#[CCAF670AC0F667D4]) [    ] o.a.s.c.CoreContainer New CoreContainer 1359183702
   [junit4]   2> 1620025 INFO  (TEST-SolrCloudExampleTest.testLoadDocsIntoGettingStartedCollection-seed#[CCAF670AC0F667D4]) [    ] o.a.s.c.CoreContainer Loading cores into CoreContainer [instanceDir=/x1/jenkins/jenkins-slave/workspace/Lucene-Solr-Tests-trunk-Java8/solr/build/solr-core/test/J2/temp/solr.cloud.SolrCloudExampleTest_CCAF670AC0F667D4-001/shard-1-001/]
   [junit4]   2> 1620025 INFO  (TEST-SolrCloudExampleTest.testLoadDocsIntoGettingStartedCollection-seed#[CCAF670AC0F667D4]) [    ] o.a.s.c.CoreContainer loading shared library: /x1/jenkins/jenkins-slave/workspace/Lucene-Solr-Tests-trunk-Java8/solr/build/solr-core/test/J2/temp/solr.cloud.SolrCloudExampleTest_CCAF670AC0F667D4-001/shard-1-001/lib
   [junit4]   2> 1620025 WARN  (TEST-SolrCloudExampleTest.testLoadDocsIntoGettingStartedCollection-seed#[CCAF670AC0F667D4]) [    ] o.a.s.c.SolrResourceLoader Can't find (or read) directory to add to classloader: lib (resolved as: /x1/jenkins/jenkins-slave/workspace/Lucene-Solr-Tests-trunk-Java8/solr/build/solr-core/test/J2/temp/solr.cloud.SolrCloudExampleTest_CCAF670AC0F667D4-001/shard-1-001/lib).
   [junit4]   2> 1620034 INFO  (TEST-SolrCloudExampleTest.testLoadDocsIntoGettingStartedCollection-seed#[CCAF670AC0F667D4]) [    ] o.a.s.h.c.HttpShardHandlerFactory created with socketTimeout : 90000,urlScheme : ,connTimeout : 15000,maxConnectionsPerHost : 20,maxConnections : 10000,corePoolSize : 0,maximumPoolSize : 2147483647,maxThreadIdleTime : 5,sizeOfQueue : -1,fairnessPolicy : false,useRetries : false,
   [junit4]   2> 1620035 INFO  (TEST-SolrCloudExampleTest.testLoadDocsIntoGettingStartedCollection-seed#[CCAF670AC0F667D4]) [    ] o.a.s.u.UpdateShardHandler Creating UpdateShardHandler HTTP client with params: socketTimeout=340000&connTimeout=45000&retry=true
   [junit4]   2> 1620035 INFO  (TEST-SolrCloudExampleTest.testLoadDocsIntoGettingStartedCollection-seed#[CCAF670AC0F667D4]) [    ] o.a.s.l.LogWatcher SLF4J impl is org.slf4j.impl.Log4jLoggerFactory
   [junit4]   2> 1620035 INFO  (TEST-SolrCloudExampleTest.testLoadDocsIntoGettingStartedCollection-seed#[CCAF670AC0F667D4]) [    ] o.a.s.l.LogWatcher Registering Log Listener [Log4j (org.slf4j.impl.Log4jLoggerFactory)]
   [junit4]   2> 1620035 INFO  (TEST-SolrCloudExampleTest.testLoadDocsIntoGettingStartedCollection-seed#[CCAF670AC0F667D4]) [    ] o.a.s.c.ZkContainer Zookeeper client=127.0.0.1:58780/solr
   [junit4]   2> 1620036 INFO  (TEST-SolrCloudExampleTest.testLoadDocsIntoGettingStartedCollection-seed#[CCAF670AC0F667D4]) [    ] o.a.s.c.ZkController zkHost includes chroot
   [junit4]   2> 1620036 INFO  (TEST-SolrCloudExampleTest.testLoadDocsIntoGettingStartedCollection-seed#[CCAF670AC0F667D4]) [    ] o.a.s.c.c.SolrZkClient Using default ZkCredentialsProvider
   [junit4]   2> 1620037 INFO  (TEST-SolrCloudExampleTest.testLoadDocsIntoGettingStartedCollection-seed#[CCAF670AC0F667D4]) [    ] o.a.s.c.c.ConnectionManager Waiting for client to connect to ZooKeeper
   [junit4]   2> 1620037 INFO  (zkCallback-1390-thread-1) [    ] o.a.s.c.c.ConnectionManager Watcher org.apache.solr.common.cloud.ConnectionManager@7a09cc4f name:ZooKeeperConnection Watcher:127.0.0.1:58780 got event WatchedEvent state:SyncConnected type:None path:null path:null type:None
   [junit4]   2> 1620037 INFO  (TEST-SolrCloudExampleTest.testLoadDocsIntoGettingStartedCollection-seed#[CCAF670AC0F667D4]) [    ] o.a.s.c.c.ConnectionManager Client is connected to ZooKeeper
   [junit4]   2> 1620038 INFO  (TEST-SolrCloudExampleTest.testLoadDocsIntoGettingStartedCollection-seed#[CCAF670AC0F667D4]) [    ] o.a.s.c.c.SolrZkClient Using default ZkACLProvider
   [junit4]   2> 1620039 INFO  (TEST-SolrCloudExampleTest.testLoadDocsIntoGettingStartedCollection-seed#[CCAF670AC0F667D4]) [n:127.0.0.1:44622_    ] o.a.s.c.c.ConnectionManager Waiting for client to connect to ZooKeeper
   [junit4]   2> 1620040 INFO  (zkCallback-1391-thread-1-processing-n:127.0.0.1:44622_) [n:127.0.0.1:44622_    ] o.a.s.c.c.ConnectionManager Watcher org.apache.solr.common.cloud.ConnectionManager@1a1d95e3 name:ZooKeeperConnection Watcher:127.0.0.1:58780/solr got event WatchedEvent state:SyncConnected type:None path:null path:null type:None
   [junit4]   2> 1620040 INFO  (TEST-SolrCloudExampleTest.testLoadDocsIntoGettingStartedCollection-seed#[CCAF670AC0F667D4]) [n:127.0.0.1:44622_    ] o.a.s.c.c.ConnectionManager Client is connected to ZooKeeper
   [junit4]   2> 1620045 INFO  (TEST-SolrCloudExampleTest.testLoadDocsIntoGettingStartedCollection-seed#[CCAF670AC0F667D4]) [n:127.0.0.1:44622_    ] o.a.s.c.c.ZkStateReader Updating cluster state from ZooKeeper... 
   [junit4]   2> 1621051 INFO  (TEST-SolrCloudExampleTest.testLoadDocsIntoGettingStartedCollection-seed#[CCAF670AC0F667D4]) [n:127.0.0.1:44622_    ] o.a.s.c.ZkController Register node as live in ZooKeeper:/live_nodes/127.0.0.1:44622_
   [junit4]   2> 1621051 INFO  (TEST-SolrCloudExampleTest.testLoadDocsIntoGettingStartedCollection-seed#[CCAF670AC0F667D4]) [n:127.0.0.1:44622_    ] o.a.s.c.c.SolrZkClient makePath: /live_nodes/127.0.0.1:44622_
   [junit4]   2> 1621052 INFO  (zkCallback-1387-thread-1) [    ] o.a.s.c.c.ZkStateReader A live node change: WatchedEvent state:SyncConnected type:NodeChildrenChanged path:/live_nodes, has occurred - updating... (live nodes size: 1)
   [junit4]   2> 1621052 INFO  (zkCallback-1385-thread-2-processing-n:127.0.0.1:33044_) [n:127.0.0.1:33044_    ] o.a.s.c.c.ZkStateReader A live node change: WatchedEvent state:SyncConnected type:NodeChildrenChanged path:/live_nodes, has occurred - updating... (live nodes size: 1)
   [junit4]   2> 1621052 INFO  (zkCallback-1391-thread-1-processing-n:127.0.0.1:44622_) [n:127.0.0.1:44622_    ] o.a.s.c.c.ZkStateReader A live node change: WatchedEvent state:SyncConnected type:NodeChildrenChanged path:/live_nodes, has occurred - updating... (live nodes size: 1)
   [junit4]   2> 1621053 INFO  (TEST-SolrCloudExampleTest.testLoadDocsIntoGettingStartedCollection-seed#[CCAF670AC0F667D4]) [n:127.0.0.1:44622_    ] o.a.s.c.Overseer Overseer (id=null) closing
   [junit4]   2> 1621054 INFO  (TEST-SolrCloudExampleTest.testLoadDocsIntoGettingStartedCollection-seed#[CCAF670AC0F667D4]) [n:127.0.0.1:44622_    ] o.a.s.c.LeaderElector Joined leadership election with path: /overseer_elect/election/94684035941400584-127.0.0.1:44622_-n_0000000001
   [junit4]   2> 1621054 INFO  (TEST-SolrCloudExampleTest.testLoadDocsIntoGettingStartedCollection-seed#[CCAF670AC0F667D4]) [n:127.0.0.1:44622_    ] o.a.s.c.LeaderElector Watching path /overseer_elect/election/94684035941400580-127.0.0.1:33044_-n_0000000000 to know if I could be the leader
   [junit4]   2> 1621063 INFO  (TEST-SolrCloudExampleTest.testLoadDocsIntoGettingStartedCollection-seed#[CCAF670AC0F667D4]) [n:127.0.0.1:44622_    ] o.a.s.c.CoreContainer Security conf doesn't exist. Skipping setup for authorization module.
   [junit4]   2> 1621063 INFO  (TEST-SolrCloudExampleTest.testLoadDocsIntoGettingStartedCollection-seed#[CCAF670AC0F667D4]) [n:127.0.0.1:44622_    ] o.a.s.c.CoreContainer No authentication plugin used.
   [junit4]   2> 1621064 INFO  (TEST-SolrCloudExampleTest.testLoadDocsIntoGettingStartedCollection-seed#[CCAF670AC0F667D4]) [n:127.0.0.1:44622_    ] o.a.s.c.CoresLocator Looking for core definitions underneath /x1/jenkins/jenkins-slave/workspace/Lucene-Solr-Tests-trunk-Java8/solr/build/solr-core/test/J2/temp/solr.cloud.SolrCloudExampleTest_CCAF670AC0F667D4-001/shard-1-001/cores
   [junit4]   2> 1621064 INFO  (TEST-SolrCloudExampleTest.testLoadDocsIntoGettingStartedCollection-seed#[CCAF670AC0F667D4]) [n:127.0.0.1:44622_    ] o.a.s.c.SolrCore Created CoreDescriptor: {name=collection1, config=solrconfig.xml, transient=false, schema=schema.xml, loadOnStartup=true, configSetProperties=configsetprops.json, instanceDir=/x1/jenkins/jenkins-slave/workspace/Lucene-Solr-Tests-trunk-Java8/solr/build/solr-core/test/J2/temp/solr.cloud.SolrCloudExampleTest_CCAF670AC0F667D4-001/shard-1-001/cores/collection1, collection=collection1, absoluteInstDir=/x1/jenkins/jenkins-slave/workspace/Lucene-Solr-Tests-trunk-Java8/solr/build/solr-core/test/J2/temp/solr.cloud.SolrCloudExampleTest_CCAF670AC0F667D4-001/shard-1-001/cores/collection1/, coreNodeName=, dataDir=data/, shard=}
   [junit4]   2> 1621064 INFO  (TEST-SolrCloudExampleTest.testLoadDocsIntoGettingStartedCollection-seed#[CCAF670AC0F667D4]) [n:127.0.0.1:44622_    ] o.a.s.c.CoresLocator Found core collection1 in /x1/jenkins/jenkins-slave/workspace/Lucene-Solr-Tests-trunk-Java8/solr/build/solr-core/test/J2/temp/solr.cloud.SolrCloudExampleTest_CCAF670AC0F667D4-001/shard-1-001/cores/collection1/
   [junit4]   2> 1621064 INFO  (TEST-SolrCloudExampleTest.testLoadDocsIntoGettingStartedCollection-seed#[CCAF670AC0F667D4]) [n:127.0.0.1:44622_    ] o.a.s.c.CoresLocator Found 1 core definitions
   [junit4]   2> 1621065 INFO  (TEST-SolrCloudExampleTest.testLoadDocsIntoGettingStartedCollection-seed#[CCAF670AC0F667D4]) [n:127.0.0.1:44622_    ] o.a.s.s.SolrDispatchFilter user.dir=/x1/jenkins/jenkins-slave/workspace/Lucene-Solr-Tests-trunk-Java8/solr/build/solr-core/test/J2
   [junit4]   2> 1621066 INFO  (TEST-SolrCloudExampleTest.testLoadDocsIntoGettingStartedCollection-seed#[CCAF670AC0F667D4]) [n:127.0.0.1:44622_    ] o.a.s.s.SolrDispatchFilter SolrDispatchFilter.init() done
   [junit4]   2> 1621066 INFO  (coreLoadExecutor-4529-thread-1-processing-n:127.0.0.1:44622_) [n:127.0.0.1:44622_ c:collection1   x:collection1] o.a.s.c.ZkController publishing state=down
   [junit4]   2> 1621066 INFO  (coreLoadExecutor-4529-thread-1-processing-n:127.0.0.1:44622_) [n:127.0.0.1:44622_ c:collection1   x:collection1] o.a.s.c.ZkController numShards not found on descriptor - reading it from system property
   [junit4]   2> 1621067 INFO  (OverseerStateUpdate-94684035941400580-127.0.0.1:33044_-n_0000000000) [n:127.0.0.1:33044_    ] o.a.s.c.Overseer processMessage: queueSize: 1, message = {
   [junit4]   2>   "core":"collection1",
   [junit4]   2>   "roles":null,
   [junit4]   2>   "base_url":"http://127.0.0.1:44622",
   [junit4]   2>   "node_name":"127.0.0.1:44622_",
   [junit4]   2>   "numShards":"2",
   [junit4]   2>   "state":"down",
   [junit4]   2>   "shard":null,
   [junit4]   2>   "collection":"collection1",
   [junit4]   2>   "operation":"state"} current state version: 3
   [junit4]   2> 1621068 INFO  (coreLoadExecutor-4529-thread-1-processing-n:127.0.0.1:44622_) [n:127.0.0.1:44622_ c:collection1   x:collection1] o.a.s.c.ZkController look for our core node name
   [junit4]   2> 1621068 INFO  (OverseerStateUpdate-94684035941400580-127.0.0.1:33044_-n_0000000000) [n:127.0.0.1:33044_    ] o.a.s.c.o.ReplicaMutator Update state numShards=2 message={
   [junit4]   2>   "core":"collection1",
   [junit4]   2>   "roles":null,
   [junit4]   2>   "base_url":"http://127.0.0.1:44622",
   [junit4]   2>   "node_name":"127.0.0.1:44622_",
   [junit4]   2>   "numShards":"2",
   [junit4]   2>   "state":"down",
   [junit4]   2>   "shard":null,
   [junit4]   2>   "collection":"collection1",
   [junit4]   2>   "operation":"state"}
   [junit4]   2> 1621068 INFO  (OverseerStateUpdate-94684035941400580-127.0.0.1:33044_-n_0000000000) [n:127.0.0.1:33044_    ] o.a.s.c.o.ClusterStateMutator building a new cName: collection1
   [junit4]   2> 1621068 INFO  (OverseerStateUpdate-94684035941400580-127.0.0.1:33044_-n_0000000000) [n:127.0.0.1:33044_    ] o.a.s.c.o.ReplicaMutator Assigning new node to shard shard=shard2
   [junit4]   2> 1621171 INFO  (zkCallback-1387-thread-1) [    ] o.a.s.c.c.ZkStateReader A cluster state change: WatchedEvent state:SyncConnected type:NodeDataChanged path:/clusterstate.json, has occurred - updating... (live nodes size: 2)
   [junit4]   2> 1621171 INFO  (zkCallback-1391-thread-1-processing-n:127.0.0.1:44622_) [n:127.0.0.1:44622_    ] o.a.s.c.c.ZkStateReader A cluster state change: WatchedEvent state:SyncConnected type:NodeDataChanged path:/clusterstate.json, has occurred - updating... (live nodes size: 2)
   [junit4]   2> 1621171 INFO  (zkCallback-1385-thread-2-processing-n:127.0.0.1:33044_) [n:127.0.0.1:33044_    ] o.a.s.c.c.ZkStateReader A cluster state change: WatchedEvent state:SyncConnected type:NodeDataChanged path:/clusterstate.json, has occurred - updating... (live nodes size: 2)
   [junit4]   2> 1622068 INFO  (coreLoadExecutor-4529-thread-1-processing-n:127.0.0.1:44622_) [n:127.0.0.1:44622_ c:collection1   x:collection1] o.a.s.c.ZkController waiting to find shard id in clusterstate for collection1
   [junit4]   2> 1622068 INFO  (coreLoadExecutor-4529-thread-1-processing-n:127.0.0.1:44622_) [n:127.0.0.1:44622_ c:collection1   x:collection1] o.a.s.c.ZkController Check for collection zkNode:collection1
   [junit4]   2> 1622069 INFO  (coreLoadExecutor-4529-thread-1-processing-n:127.0.0.1:44622_) [n:127.0.0.1:44622_ c:collection1   x:collection1] o.a.s.c.ZkController Collection zkNode exists
   [junit4]   2> 1622069 INFO  (coreLoadExecutor-4529-thread-1-processing-n:127.0.0.1:44622_) [n:127.0.0.1:44622_ c:collection1   x:collection1] o.a.s.c.c.ZkStateReader Load collection config from:/collections/collection1
   [junit4]   2> 1622070 INFO  (coreLoadExecutor-4529-thread-1-processing-n:127.0.0.1:44622_) [n:127.0.0.1:44622_ c:collection1   x:collection1] o.a.s.c.c.ZkStateReader path=/collections/collection1 configName=conf1 specified config exists in ZooKeeper
   [junit4]   2> 1622070 INFO  (coreLoadExecutor-4529-thread-1-processing-n:127.0.0.1:44622_) [n:127.0.0.1:44622_ c:collection1   x:collection1] o.a.s.c.SolrResourceLoader new SolrResourceLoader for directory: '/x1/jenkins/jenkins-slave/workspace/Lucene-Solr-Tests-trunk-Java8/solr/build/solr-core/test/J2/temp/solr.cloud.SolrCloudExampleTest_CCAF670AC0F667D4-001/shard-1-001/cores/collection1/'
   [junit4]   2> 1622070 INFO  (coreLoadExecutor-4529-thread-1-processing-n:127.0.0.1:44622_) [n:127.0.0.1:44622_ c:collection1   x:collection1] o.a.s.c.SolrResourceLoader JNDI not configured for solr (NoInitialContextEx)
   [junit4]   2> 1622070 INFO  (coreLoadExecutor-4529-thread-1-processing-n:127.0.0.1:44622_) [n:127.0.0.1:44622_ c:collection1   x:collection1] o.a.s.c.SolrResourceLoader solr home defaulted to 'solr/' (could not find system property or JNDI)
   [junit4]   2> 1622085 INFO  (coreLoadExecutor-4529-thread-1-processing-n:127.0.0.1:44622_) [n:127.0.0.1:44622_ c:collection1   x:collection1] o.a.s.c.Config loaded config solrconfig.xml with version 0 
   [junit4]   2> 1622090 INFO  (coreLoadExecutor-4529-thread-1-processing-n:127.0.0.1:44622_) [n:127.0.0.1:44622_ c:collection1   x:collection1] o.a.s.c.SolrConfig current version of requestparams : -1
   [junit4]   2> 1622093 INFO  (coreLoadExecutor-4529-thread-1-processing-n:127.0.0.1:44622_) [n:127.0.0.1:44622_ c:collection1   x:collection1] o.a.s.c.SolrConfig Using Lucene MatchVersion: 6.0.0
   [junit4]   2> 1622101 INFO  (coreLoadExecutor-4529-thread-1-processing-n:127.0.0.1:44622_) [n:127.0.0.1:44622_ c:collection1   x:collection1] o.a.s.c.Config Loaded SolrConfig: solrconfig.xml
   [junit4]   2> 1622102 INFO  (coreLoadExecutor-4529-thread-1-processing-n:127.0.0.1:44622_) [n:127.0.0.1:44622_ c:collection1   x:collection1] o.a.s.s.IndexSchema Reading Solr Schema from /configs/conf1/schema.xml
   [junit4]   2> 1622107 INFO  (coreLoadExecutor-4529-thread-1-processing-n:127.0.0.1:44622_) [n:127.0.0.1:44622_ c:collection1   x:collection1] o.a.s.s.IndexSchema [collection1] Schema name=test
   [junit4]   2> 1622203 INFO  (coreLoadExecutor-4529-thread-1-processing-n:127.0.0.1:44622_) [n:127.0.0.1:44622_ c:collection1   x:collection1] o.a.s.s.OpenExchangeRatesOrgProvider Initialized with rates=open-exchange-rates.json, refreshInterval=1440.
   [junit4]   2> 1622208 INFO  (coreLoadExecutor-4529-thread-1-processing-n:127.0.0.1:44622_) [n:127.0.0.1:44622_ c:collection1   x:collection1] o.a.s.s.IndexSchema default search field in schema is text
   [junit4]   2> 1622209 INFO  (coreLoadExecutor-4529-thread-1-processing-n:127.0.0.1:44622_) [n:127.0.0.1:44622_ c:collection1   x:collection1] o.a.s.s.IndexSchema unique key field: id
   [junit4]   2> 1622219 INFO  (coreLoadExecutor-4529-thread-1-processing-n:127.0.0.1:44622_) [n:127.0.0.1:44622_ c:collection1   x:collection1] o.a.s.s.FileExchangeRateProvider Reloading exchange rates from file currency.xml
   [junit4]   2> 1622221 INFO  (coreLoadExecutor-4529-thread-1-processing-n:127.0.0.1:44622_) [n:127.0.0.1:44622_ c:collection1   x:collection1] o.a.s.s.FileExchangeRateProvider Reloading exchange rates from file currency.xml
   [junit4]   2> 1622223 INFO  (coreLoadExecutor-4529-thread-1-processing-n:127.0.0.1:44622_) [n:127.0.0.1:44622_ c:collection1   x:collection1] o.a.s.s.OpenExchangeRatesOrgProvider Reloading exchange rates from open-exchange-rates.json
   [junit4]   2> 1622224 WARN  (coreLoadExecutor-4529-thread-1-processing-n:127.0.0.1:44622_) [n:127.0.0.1:44622_ c:collection1   x:collection1] o.a.s.s.OpenExchangeRatesOrgProvider Unknown key IMPORTANT NOTE
   [junit4]   2> 1622225 WARN  (coreLoadExecutor-4529-thread-1-processing-n:127.0.0.1:44622_) [n:127.0.0.1:44622_ c:collection1   x:collection1] o.a.s.s.OpenExchangeRatesOrgProvider Expected key, got STRING
   [junit4]   2> 1622225 INFO  (coreLoadExecutor-4529-thread-1-processing-n:127.0.0.1:44622_) [n:127.0.0.1:44622_ c:collection1   x:collection1] o.a.s.s.OpenExchangeRatesOrgProvider Reloading exchange rates from open-exchange-rates.json
   [junit4]   2> 1622225 WARN  (coreLoadExecutor-4529-thread-1-processing-n:127.0.0.1:44622_) [n:127.0.0.1:44622_ c:collection1   x:collection1] o.a.s.s.OpenExchangeRatesOrgProvider Unknown key IMPORTANT NOTE
   [junit4]   2> 1622225 WARN  (coreLoadExecutor-4529-thread-1-processing-n:127.0.0.1:44622_) [n:127.0.0.1:44622_ c:collection1   x:collection1] o.a.s.s.OpenExchangeRatesOrgProvider Expected key, got STRING
   [junit4]   2> 1622226 INFO  (coreLoadExecutor-4529-thread-1-processing-n:127.0.0.1:44622_) [n:127.0.0.1:44622_ c:collection1   x:collection1] o.a.s.c.ConfigSetProperties Did not find ConfigSet properties, assuming default properties: Can't find resource 'configsetprops.json' in classpath or '/configs/conf1', cwd=/x1/jenkins/jenkins-slave/workspace/Lucene-Solr-Tests-trunk-Java8/solr/build/solr-core/test/J2
   [junit4]   2> 1622226 INFO  (coreLoadExecutor-4529-thread-1-processing-n:127.0.0.1:44622_) [n:127.0.0.1:44622_ c:collection1   x:collection1] o.a.s.c.CoreContainer Creating SolrCore 'collection1' using configuration from collection colle

[...truncated too long message...]

ectionContext.java:85)
   [junit4]   2> 	at org.apache.solr.cloud.ShardLeaderElectionContextBase.cancelElection(ElectionContext.java:166)
   [junit4]   2> 	at org.apache.solr.cloud.ShardLeaderElectionContext.cancelElection(ElectionContext.java:267)
   [junit4]   2> 	at org.apache.solr.cloud.ShardLeaderElectionContext.runLeaderProcess(ElectionContext.java:449)
   [junit4]   2> 	at org.apache.solr.cloud.LeaderElector.runIamLeaderProcess(LeaderElector.java:197)
   [junit4]   2> 	at org.apache.solr.cloud.LeaderElector.checkIfIamLeader(LeaderElector.java:157)
   [junit4]   2> 	at org.apache.solr.cloud.LeaderElector.access$200(LeaderElector.java:58)
   [junit4]   2> 	at org.apache.solr.cloud.LeaderElector$ElectionWatcher.process(LeaderElector.java:388)
   [junit4]   2> 	at org.apache.solr.common.cloud.SolrZkClient$3$1.run(SolrZkClient.java:269)
   [junit4]   2> 	at java.util.concurrent.Executors$RunnableAdapter.call(Executors.java:511)
   [junit4]   2> 	at java.util.concurrent.FutureTask.run(FutureTask.java:266)
   [junit4]   2> 	at org.apache.solr.common.util.ExecutorUtil$MDCAwareThreadPoolExecutor$1.run(ExecutorUtil.java:231)
   [junit4]   2> 	at java.util.concurrent.ThreadPoolExecutor.runWorker(ThreadPoolExecutor.java:1142)
   [junit4]   2> 	at java.util.concurrent.ThreadPoolExecutor$Worker.run(ThreadPoolExecutor.java:617)
   [junit4]   2> 	at java.lang.Thread.run(Thread.java:745)
   [junit4]   2> 1663163 INFO  (TEST-SolrCloudExampleTest.testLoadDocsIntoGettingStartedCollection-seed#[CCAF670AC0F667D4]) [    ] o.e.j.s.ServerConnector Stopped ServerConnector@3ca56c51{HTTP/1.1}{127.0.0.1:0}
   [junit4]   2> 1663164 INFO  (TEST-SolrCloudExampleTest.testLoadDocsIntoGettingStartedCollection-seed#[CCAF670AC0F667D4]) [    ] o.e.j.s.h.ContextHandler Stopped o.e.j.s.ServletContextHandler@189f6b44{/,null,UNAVAILABLE}
   [junit4]   2> 1663166 INFO  (TEST-SolrCloudExampleTest.testLoadDocsIntoGettingStartedCollection-seed#[CCAF670AC0F667D4]) [n:127.0.0.1:48499_ c:collection1 s:shard1 r:core_node4 x:collection1] o.a.s.c.ZkTestServer connecting to 127.0.0.1:58780 58780
   [junit4]   2> 1663345 INFO  (Thread-4316) [    ] o.a.s.c.ZkTestServer connecting to 127.0.0.1:58780 58780
   [junit4]   2> 1663347 WARN  (Thread-4316) [    ] o.a.s.c.ZkTestServer Watch limit violations: 
   [junit4]   2> Maximum concurrent create/delete watches above limit:
   [junit4]   2> 
   [junit4]   2> 	11	/solr/configs/gettingstarted/managed-schema
   [junit4]   2> 	10	/solr/configs/gettingstarted
   [junit4]   2> 	9	/solr/aliases.json
   [junit4]   2> 	5	/solr/security.json
   [junit4]   2> 	5	/solr/configs/conf1
   [junit4]   2> 
   [junit4]   2> Maximum concurrent data watches above limit:
   [junit4]   2> 
   [junit4]   2> 	9	/solr/clusterstate.json
   [junit4]   2> 	4	/solr/collections/gettingstarted/state.json
   [junit4]   2> 
   [junit4]   2> Maximum concurrent children watches above limit:
   [junit4]   2> 
   [junit4]   2> 	9	/solr/live_nodes
   [junit4]   2> 	9	/solr/collections
   [junit4]   2> 	5	/solr/overseer/collection-queue-work
   [junit4]   2> 	4	/solr/overseer/queue
   [junit4]   2> 
   [junit4]   2> NOTE: reproduce with: ant test  -Dtestcase=SolrCloudExampleTest -Dtests.method=testLoadDocsIntoGettingStartedCollection -Dtests.seed=CCAF670AC0F667D4 -Dtests.multiplier=2 -Dtests.slow=true -Dtests.locale=zh_HK -Dtests.timezone=Pacific/Auckland -Dtests.asserts=true -Dtests.file.encoding=UTF-8
   [junit4] FAILURE 45.8s J2 | SolrCloudExampleTest.testLoadDocsIntoGettingStartedCollection <<<
   [junit4]    > Throwable #1: java.lang.AssertionError: Delete action failed!
   [junit4]    > 	at __randomizedtesting.SeedInfo.seed([CCAF670AC0F667D4:DFCC5565F199DE72]:0)
   [junit4]    > 	at org.apache.solr.cloud.SolrCloudExampleTest.doTestDeleteAction(SolrCloudExampleTest.java:169)
   [junit4]    > 	at org.apache.solr.cloud.SolrCloudExampleTest.testLoadDocsIntoGettingStartedCollection(SolrCloudExampleTest.java:145)
   [junit4]    > 	at org.apache.solr.BaseDistributedSearchTestCase$ShardsRepeatRule$ShardsFixedStatement.callStatement(BaseDistributedSearchTestCase.java:963)
   [junit4]    > 	at org.apache.solr.BaseDistributedSearchTestCase$ShardsRepeatRule$ShardsStatement.evaluate(BaseDistributedSearchTestCase.java:938)
   [junit4]    > 	at java.lang.Thread.run(Thread.java:745)
   [junit4]   2> 1663352 INFO  (SUITE-SolrCloudExampleTest-seed#[CCAF670AC0F667D4]-worker) [n:127.0.0.1:48499_ c:collection1 s:shard1 r:core_node4 x:collection1] o.a.s.SolrTestCaseJ4 ###deleteCore
   [junit4]   2> NOTE: leaving temporary files on disk at: /x1/jenkins/jenkins-slave/workspace/Lucene-Solr-Tests-trunk-Java8/solr/build/solr-core/test/J2/temp/solr.cloud.SolrCloudExampleTest_CCAF670AC0F667D4-001
   [junit4]   2> Oct 13, 2015 3:16:17 PM com.carrotsearch.randomizedtesting.ThreadLeakControl checkThreadLeaks
   [junit4]   2> WARNING: Will linger awaiting termination of 1 leaked thread(s).
   [junit4]   2> NOTE: test params are: codec=Asserting(Lucene53): {}, docValues:{}, sim=RandomSimilarityProvider(queryNorm=true,coord=crazy): {}, locale=zh_HK, timezone=Pacific/Auckland
   [junit4]   2> NOTE: Linux 3.13.0-52-generic amd64/Oracle Corporation 1.8.0_45 (64-bit)/cpus=4,threads=1,free=138981448,total=524288000
   [junit4]   2> NOTE: All tests run in this JVM: [UnloadDistributedZkTest, TestWriterPerf, TestSolrQueryParser, RAMDirectoryFactoryTest, AddSchemaFieldsUpdateProcessorFactoryTest, CloudExitableDirectoryReaderTest, TestJsonFacets, TestReversedWildcardFilterFactory, BasicAuthIntegrationTest, AnalyticsMergeStrategyTest, SolrXmlInZkTest, UUIDFieldTest, FieldMutatingUpdateProcessorTest, TestCloudManagedSchema, XmlUpdateRequestHandlerTest, TestIndexSearcher, StressHdfsTest, PKIAuthenticationIntegrationTest, TestManagedStopFilterFactory, TestCollectionAPI, OverseerTest, RecoveryZkTest, CursorMarkTest, DistributedDebugComponentTest, TestReplicationHandlerBackup, DateRangeFieldTest, TestShortCircuitedRequests, SearchHandlerTest, TestAuthenticationFramework, TriLevelCompositeIdRoutingTest, SystemInfoHandlerTest, TestMinMaxOnMultiValuedField, TermVectorComponentDistributedTest, TestMaxScoreQueryParser, ResponseHeaderTest, AnalyticsQueryTest, TestManagedResourceStorage, TestFieldSortValues, TestPerFieldSimilarity, TestManagedSchemaDynamicFieldResource, TestSolrDeletionPolicy1, TestFieldTypeCollectionResource, AnalysisErrorHandlingTest, CloudMLTQParserTest, StatelessScriptUpdateProcessorFactoryTest, TestExtendedDismaxParser, CoreAdminHandlerTest, TestRandomRequestDistribution, TestSort, TestScoreJoinQPNoScore, DocValuesMultiTest, SimpleFacetsTest, TestCSVResponseWriter, HdfsSyncSliceTest, TestTrieFacet, DistributedFacetPivotSmallAdvancedTest, SuggesterTest, TestLRUStatsCache, HdfsChaosMonkeySafeLeaderTest, TestScoreJoinQPScore, QueryResultKeyTest, TestSolrCLIRunExample, TestRecovery, RegexBoostProcessorTest, TestSolrCloudWithKerberosAlt, TestRequestStatusCollectionAPI, TestShardHandlerFactory, TestSearchPerf, SuggesterWFSTTest, TestReqParamsAPI, TestSmileRequest, CdcrVersionReplicationTest, TestSolrIndexConfig, TestCollationField, TestLRUCache, ZkNodePropsTest, TestIndexingPerformance, DocValuesMissingTest, TestCustomSort, TestAddFieldRealTimeGet, ScriptEngineTest, DebugComponentTest, FieldAnalysisRequestHandlerTest, TestStressReorder, TestOverriddenPrefixQueryForCustomFieldType, BadComponentTest, SuggesterTSTTest, ShowFileRequestHandlerTest, ChaosMonkeySafeLeaderTest, CollectionsAPIDistributedZkTest, SpellCheckComponentTest, TestGroupingSearch, BadIndexSchemaTest, BasicFunctionalityTest, TestLazyCores, DirectUpdateHandlerTest, HighlighterTest, SoftAutoCommitTest, NoCacheHeaderTest, TestPseudoReturnFields, TestWordDelimiterFilterFactory, SortByFunctionTest, TestSurroundQueryParser, StandardRequestHandlerTest, DocumentAnalysisRequestHandlerTest, PrimitiveFieldTypeTest, TermsComponentTest, PathHierarchyTokenizerFactoryTest, TestArbitraryIndexDir, SolrPluginUtilsTest, UpdateRequestProcessorFactoryTest, UniqFieldsUpdateProcessorFactoryTest, BinaryUpdateRequestHandlerTest, HighlighterConfigTest, UpdateParamsTest, TestStressRecovery, TestTolerantSearch, AliasIntegrationTest, CollectionsAPIAsyncDistributedZkTest, DeleteReplicaTest, DeleteShardTest, DistribDocExpirationUpdateProcessorTest, LeaderInitiatedRecoveryOnShardRestartTest, MigrateRouteKeyTest, OverriddenZkACLAndCredentialsProvidersTest, OverseerCollectionConfigSetProcessorTest, OverseerTaskQueueTest, RemoteQueryErrorTest, ReplicationFactorTest, RollingRestartTest, SharedFSAutoReplicaFailoverTest, SharedFSAutoReplicaFailoverUtilsTest, SolrCloudExampleTest]
   [junit4] Completed [437/552] on J2 in 46.07s, 1 test, 1 failure <<< FAILURES!

[...truncated 372 lines...]
BUILD FAILED
/x1/jenkins/jenkins-slave/workspace/Lucene-Solr-Tests-trunk-Java8/build.xml:775: The following error occurred while executing this line:
/x1/jenkins/jenkins-slave/workspace/Lucene-Solr-Tests-trunk-Java8/build.xml:719: The following error occurred while executing this line:
/x1/jenkins/jenkins-slave/workspace/Lucene-Solr-Tests-trunk-Java8/build.xml:59: The following error occurred while executing this line:
/x1/jenkins/jenkins-slave/workspace/Lucene-Solr-Tests-trunk-Java8/solr/build.xml:233: The following error occurred while executing this line:
/x1/jenkins/jenkins-slave/workspace/Lucene-Solr-Tests-trunk-Java8/solr/common-build.xml:516: The following error occurred while executing this line:
/x1/jenkins/jenkins-slave/workspace/Lucene-Solr-Tests-trunk-Java8/lucene/common-build.xml:1432: The following error occurred while executing this line:
/x1/jenkins/jenkins-slave/workspace/Lucene-Solr-Tests-trunk-Java8/lucene/common-build.xml:987: There were test failures: 552 suites (8 ignored), 2170 tests, 1 failure, 50 ignored (37 assumptions) [seed: CCAF670AC0F667D4]

Total time: 58 minutes 31 seconds
Build step 'Invoke Ant' marked build as failure
Archiving artifacts
Recording test results
Email was triggered for: Failure - Any
Sending email for trigger: Failure - Any



[JENKINS] Lucene-Solr-Tests-trunk-Java8 - Build # 483 - Still Failing

Posted by Apache Jenkins Server <je...@builds.apache.org>.
Build: https://builds.apache.org/job/Lucene-Solr-Tests-trunk-Java8/483/

1 tests failed.
FAILED:  org.apache.solr.cloud.SolrCloudExampleTest.testLoadDocsIntoGettingStartedCollection

Error Message:
Delete action failed!

Stack Trace:
java.lang.AssertionError: Delete action failed!
	at __randomizedtesting.SeedInfo.seed([24E7A66E8B44A37:112D4809D9DBF391]:0)
	at org.junit.Assert.fail(Assert.java:93)
	at org.junit.Assert.assertTrue(Assert.java:43)
	at org.apache.solr.cloud.SolrCloudExampleTest.doTestDeleteAction(SolrCloudExampleTest.java:169)
	at org.apache.solr.cloud.SolrCloudExampleTest.testLoadDocsIntoGettingStartedCollection(SolrCloudExampleTest.java:145)
	at sun.reflect.NativeMethodAccessorImpl.invoke0(Native Method)
	at sun.reflect.NativeMethodAccessorImpl.invoke(NativeMethodAccessorImpl.java:62)
	at sun.reflect.DelegatingMethodAccessorImpl.invoke(DelegatingMethodAccessorImpl.java:43)
	at java.lang.reflect.Method.invoke(Method.java:497)
	at com.carrotsearch.randomizedtesting.RandomizedRunner.invoke(RandomizedRunner.java:1665)
	at com.carrotsearch.randomizedtesting.RandomizedRunner$8.evaluate(RandomizedRunner.java:864)
	at com.carrotsearch.randomizedtesting.RandomizedRunner$9.evaluate(RandomizedRunner.java:900)
	at com.carrotsearch.randomizedtesting.RandomizedRunner$10.evaluate(RandomizedRunner.java:914)
	at org.apache.solr.BaseDistributedSearchTestCase$ShardsRepeatRule$ShardsFixedStatement.callStatement(BaseDistributedSearchTestCase.java:963)
	at org.apache.solr.BaseDistributedSearchTestCase$ShardsRepeatRule$ShardsStatement.evaluate(BaseDistributedSearchTestCase.java:938)
	at com.carrotsearch.randomizedtesting.rules.SystemPropertiesRestoreRule$1.evaluate(SystemPropertiesRestoreRule.java:57)
	at org.apache.lucene.util.TestRuleSetupTeardownChained$1.evaluate(TestRuleSetupTeardownChained.java:50)
	at org.apache.lucene.util.AbstractBeforeAfterRule$1.evaluate(AbstractBeforeAfterRule.java:46)
	at org.apache.lucene.util.TestRuleThreadAndTestName$1.evaluate(TestRuleThreadAndTestName.java:49)
	at org.apache.lucene.util.TestRuleIgnoreAfterMaxFailures$1.evaluate(TestRuleIgnoreAfterMaxFailures.java:65)
	at org.apache.lucene.util.TestRuleMarkFailure$1.evaluate(TestRuleMarkFailure.java:48)
	at com.carrotsearch.randomizedtesting.rules.StatementAdapter.evaluate(StatementAdapter.java:36)
	at com.carrotsearch.randomizedtesting.ThreadLeakControl$StatementRunner.run(ThreadLeakControl.java:367)
	at com.carrotsearch.randomizedtesting.ThreadLeakControl.forkTimeoutingTask(ThreadLeakControl.java:809)
	at com.carrotsearch.randomizedtesting.ThreadLeakControl$3.evaluate(ThreadLeakControl.java:460)
	at com.carrotsearch.randomizedtesting.RandomizedRunner.runSingleTest(RandomizedRunner.java:873)
	at com.carrotsearch.randomizedtesting.RandomizedRunner$5.evaluate(RandomizedRunner.java:775)
	at com.carrotsearch.randomizedtesting.RandomizedRunner$6.evaluate(RandomizedRunner.java:809)
	at com.carrotsearch.randomizedtesting.RandomizedRunner$7.evaluate(RandomizedRunner.java:820)
	at com.carrotsearch.randomizedtesting.rules.StatementAdapter.evaluate(StatementAdapter.java:36)
	at com.carrotsearch.randomizedtesting.rules.SystemPropertiesRestoreRule$1.evaluate(SystemPropertiesRestoreRule.java:57)
	at org.apache.lucene.util.AbstractBeforeAfterRule$1.evaluate(AbstractBeforeAfterRule.java:46)
	at com.carrotsearch.randomizedtesting.rules.StatementAdapter.evaluate(StatementAdapter.java:36)
	at org.apache.lucene.util.TestRuleStoreClassName$1.evaluate(TestRuleStoreClassName.java:42)
	at com.carrotsearch.randomizedtesting.rules.NoShadowingOrOverridesOnMethodsRule$1.evaluate(NoShadowingOrOverridesOnMethodsRule.java:39)
	at com.carrotsearch.randomizedtesting.rules.NoShadowingOrOverridesOnMethodsRule$1.evaluate(NoShadowingOrOverridesOnMethodsRule.java:39)
	at com.carrotsearch.randomizedtesting.rules.StatementAdapter.evaluate(StatementAdapter.java:36)
	at com.carrotsearch.randomizedtesting.rules.StatementAdapter.evaluate(StatementAdapter.java:36)
	at com.carrotsearch.randomizedtesting.rules.StatementAdapter.evaluate(StatementAdapter.java:36)
	at org.apache.lucene.util.TestRuleAssertionsRequired$1.evaluate(TestRuleAssertionsRequired.java:54)
	at org.apache.lucene.util.TestRuleMarkFailure$1.evaluate(TestRuleMarkFailure.java:48)
	at org.apache.lucene.util.TestRuleIgnoreAfterMaxFailures$1.evaluate(TestRuleIgnoreAfterMaxFailures.java:65)
	at org.apache.lucene.util.TestRuleIgnoreTestSuites$1.evaluate(TestRuleIgnoreTestSuites.java:55)
	at com.carrotsearch.randomizedtesting.rules.StatementAdapter.evaluate(StatementAdapter.java:36)
	at com.carrotsearch.randomizedtesting.ThreadLeakControl$StatementRunner.run(ThreadLeakControl.java:367)
	at java.lang.Thread.run(Thread.java:745)




Build Log:
[...truncated 9532 lines...]
   [junit4] Suite: org.apache.solr.cloud.SolrCloudExampleTest
   [junit4]   2> Creating dataDir: /x1/jenkins/jenkins-slave/workspace/Lucene-Solr-Tests-trunk-Java8/solr/build/solr-core/test/J1/temp/solr.cloud.SolrCloudExampleTest_24E7A66E8B44A37-001/init-core-data-001
   [junit4]   2> 372511 INFO  (SUITE-SolrCloudExampleTest-seed#[24E7A66E8B44A37]-worker) [    ] o.a.s.SolrTestCaseJ4 Randomized ssl (false) and clientAuth (false)
   [junit4]   2> 372511 INFO  (SUITE-SolrCloudExampleTest-seed#[24E7A66E8B44A37]-worker) [    ] o.a.s.BaseDistributedSearchTestCase Setting hostContext system property: /
   [junit4]   2> 372516 INFO  (TEST-SolrCloudExampleTest.testLoadDocsIntoGettingStartedCollection-seed#[24E7A66E8B44A37]) [    ] o.a.s.c.ZkTestServer STARTING ZK TEST SERVER
   [junit4]   2> 372517 INFO  (Thread-1169) [    ] o.a.s.c.ZkTestServer client port:0.0.0.0/0.0.0.0:0
   [junit4]   2> 372517 INFO  (Thread-1169) [    ] o.a.s.c.ZkTestServer Starting server
   [junit4]   2> 372617 INFO  (TEST-SolrCloudExampleTest.testLoadDocsIntoGettingStartedCollection-seed#[24E7A66E8B44A37]) [    ] o.a.s.c.ZkTestServer start zk server on port:44208
   [junit4]   2> 372617 INFO  (TEST-SolrCloudExampleTest.testLoadDocsIntoGettingStartedCollection-seed#[24E7A66E8B44A37]) [    ] o.a.s.c.c.SolrZkClient Using default ZkCredentialsProvider
   [junit4]   2> 372632 INFO  (TEST-SolrCloudExampleTest.testLoadDocsIntoGettingStartedCollection-seed#[24E7A66E8B44A37]) [    ] o.a.s.c.c.ConnectionManager Waiting for client to connect to ZooKeeper
   [junit4]   2> 372648 INFO  (zkCallback-431-thread-1) [    ] o.a.s.c.c.ConnectionManager Watcher org.apache.solr.common.cloud.ConnectionManager@265759da name:ZooKeeperConnection Watcher:127.0.0.1:44208 got event WatchedEvent state:SyncConnected type:None path:null path:null type:None
   [junit4]   2> 372648 INFO  (TEST-SolrCloudExampleTest.testLoadDocsIntoGettingStartedCollection-seed#[24E7A66E8B44A37]) [    ] o.a.s.c.c.ConnectionManager Client is connected to ZooKeeper
   [junit4]   2> 372648 INFO  (TEST-SolrCloudExampleTest.testLoadDocsIntoGettingStartedCollection-seed#[24E7A66E8B44A37]) [    ] o.a.s.c.c.SolrZkClient Using default ZkACLProvider
   [junit4]   2> 372648 INFO  (TEST-SolrCloudExampleTest.testLoadDocsIntoGettingStartedCollection-seed#[24E7A66E8B44A37]) [    ] o.a.s.c.c.SolrZkClient makePath: /solr
   [junit4]   2> 372651 INFO  (TEST-SolrCloudExampleTest.testLoadDocsIntoGettingStartedCollection-seed#[24E7A66E8B44A37]) [    ] o.a.s.c.c.SolrZkClient Using default ZkCredentialsProvider
   [junit4]   2> 372656 INFO  (TEST-SolrCloudExampleTest.testLoadDocsIntoGettingStartedCollection-seed#[24E7A66E8B44A37]) [    ] o.a.s.c.c.ConnectionManager Waiting for client to connect to ZooKeeper
   [junit4]   2> 372674 INFO  (zkCallback-432-thread-1) [    ] o.a.s.c.c.ConnectionManager Watcher org.apache.solr.common.cloud.ConnectionManager@42477658 name:ZooKeeperConnection Watcher:127.0.0.1:44208/solr got event WatchedEvent state:SyncConnected type:None path:null path:null type:None
   [junit4]   2> 372674 INFO  (TEST-SolrCloudExampleTest.testLoadDocsIntoGettingStartedCollection-seed#[24E7A66E8B44A37]) [    ] o.a.s.c.c.ConnectionManager Client is connected to ZooKeeper
   [junit4]   2> 372674 INFO  (TEST-SolrCloudExampleTest.testLoadDocsIntoGettingStartedCollection-seed#[24E7A66E8B44A37]) [    ] o.a.s.c.c.SolrZkClient Using default ZkACLProvider
   [junit4]   2> 372674 INFO  (TEST-SolrCloudExampleTest.testLoadDocsIntoGettingStartedCollection-seed#[24E7A66E8B44A37]) [    ] o.a.s.c.c.SolrZkClient makePath: /collections/collection1
   [junit4]   2> 372676 INFO  (TEST-SolrCloudExampleTest.testLoadDocsIntoGettingStartedCollection-seed#[24E7A66E8B44A37]) [    ] o.a.s.c.c.SolrZkClient makePath: /collections/collection1/shards
   [junit4]   2> 372677 INFO  (TEST-SolrCloudExampleTest.testLoadDocsIntoGettingStartedCollection-seed#[24E7A66E8B44A37]) [    ] o.a.s.c.c.SolrZkClient makePath: /collections/control_collection
   [junit4]   2> 372678 INFO  (TEST-SolrCloudExampleTest.testLoadDocsIntoGettingStartedCollection-seed#[24E7A66E8B44A37]) [    ] o.a.s.c.c.SolrZkClient makePath: /collections/control_collection/shards
   [junit4]   2> 372679 INFO  (TEST-SolrCloudExampleTest.testLoadDocsIntoGettingStartedCollection-seed#[24E7A66E8B44A37]) [    ] o.a.s.c.AbstractZkTestCase put /x1/jenkins/jenkins-slave/workspace/Lucene-Solr-Tests-trunk-Java8/solr/core/src/test-files/solr/collection1/conf/solrconfig-tlog.xml to /configs/conf1/solrconfig.xml
   [junit4]   2> 372680 INFO  (TEST-SolrCloudExampleTest.testLoadDocsIntoGettingStartedCollection-seed#[24E7A66E8B44A37]) [    ] o.a.s.c.c.SolrZkClient makePath: /configs/conf1/solrconfig.xml
   [junit4]   2> 372681 INFO  (TEST-SolrCloudExampleTest.testLoadDocsIntoGettingStartedCollection-seed#[24E7A66E8B44A37]) [    ] o.a.s.c.AbstractZkTestCase put /x1/jenkins/jenkins-slave/workspace/Lucene-Solr-Tests-trunk-Java8/solr/core/src/test-files/solr/collection1/conf/schema.xml to /configs/conf1/schema.xml
   [junit4]   2> 372682 INFO  (TEST-SolrCloudExampleTest.testLoadDocsIntoGettingStartedCollection-seed#[24E7A66E8B44A37]) [    ] o.a.s.c.c.SolrZkClient makePath: /configs/conf1/schema.xml
   [junit4]   2> 372684 INFO  (TEST-SolrCloudExampleTest.testLoadDocsIntoGettingStartedCollection-seed#[24E7A66E8B44A37]) [    ] o.a.s.c.AbstractZkTestCase put /x1/jenkins/jenkins-slave/workspace/Lucene-Solr-Tests-trunk-Java8/solr/core/src/test-files/solr/collection1/conf/solrconfig.snippet.randomindexconfig.xml to /configs/conf1/solrconfig.snippet.randomindexconfig.xml
   [junit4]   2> 372684 INFO  (TEST-SolrCloudExampleTest.testLoadDocsIntoGettingStartedCollection-seed#[24E7A66E8B44A37]) [    ] o.a.s.c.c.SolrZkClient makePath: /configs/conf1/solrconfig.snippet.randomindexconfig.xml
   [junit4]   2> 372685 INFO  (TEST-SolrCloudExampleTest.testLoadDocsIntoGettingStartedCollection-seed#[24E7A66E8B44A37]) [    ] o.a.s.c.AbstractZkTestCase put /x1/jenkins/jenkins-slave/workspace/Lucene-Solr-Tests-trunk-Java8/solr/core/src/test-files/solr/collection1/conf/stopwords.txt to /configs/conf1/stopwords.txt
   [junit4]   2> 372685 INFO  (TEST-SolrCloudExampleTest.testLoadDocsIntoGettingStartedCollection-seed#[24E7A66E8B44A37]) [    ] o.a.s.c.c.SolrZkClient makePath: /configs/conf1/stopwords.txt
   [junit4]   2> 372687 INFO  (TEST-SolrCloudExampleTest.testLoadDocsIntoGettingStartedCollection-seed#[24E7A66E8B44A37]) [    ] o.a.s.c.AbstractZkTestCase put /x1/jenkins/jenkins-slave/workspace/Lucene-Solr-Tests-trunk-Java8/solr/core/src/test-files/solr/collection1/conf/protwords.txt to /configs/conf1/protwords.txt
   [junit4]   2> 372687 INFO  (TEST-SolrCloudExampleTest.testLoadDocsIntoGettingStartedCollection-seed#[24E7A66E8B44A37]) [    ] o.a.s.c.c.SolrZkClient makePath: /configs/conf1/protwords.txt
   [junit4]   2> 372688 INFO  (TEST-SolrCloudExampleTest.testLoadDocsIntoGettingStartedCollection-seed#[24E7A66E8B44A37]) [    ] o.a.s.c.AbstractZkTestCase put /x1/jenkins/jenkins-slave/workspace/Lucene-Solr-Tests-trunk-Java8/solr/core/src/test-files/solr/collection1/conf/currency.xml to /configs/conf1/currency.xml
   [junit4]   2> 372688 INFO  (TEST-SolrCloudExampleTest.testLoadDocsIntoGettingStartedCollection-seed#[24E7A66E8B44A37]) [    ] o.a.s.c.c.SolrZkClient makePath: /configs/conf1/currency.xml
   [junit4]   2> 372689 INFO  (TEST-SolrCloudExampleTest.testLoadDocsIntoGettingStartedCollection-seed#[24E7A66E8B44A37]) [    ] o.a.s.c.AbstractZkTestCase put /x1/jenkins/jenkins-slave/workspace/Lucene-Solr-Tests-trunk-Java8/solr/core/src/test-files/solr/collection1/conf/enumsConfig.xml to /configs/conf1/enumsConfig.xml
   [junit4]   2> 372689 INFO  (TEST-SolrCloudExampleTest.testLoadDocsIntoGettingStartedCollection-seed#[24E7A66E8B44A37]) [    ] o.a.s.c.c.SolrZkClient makePath: /configs/conf1/enumsConfig.xml
   [junit4]   2> 372691 INFO  (TEST-SolrCloudExampleTest.testLoadDocsIntoGettingStartedCollection-seed#[24E7A66E8B44A37]) [    ] o.a.s.c.AbstractZkTestCase put /x1/jenkins/jenkins-slave/workspace/Lucene-Solr-Tests-trunk-Java8/solr/core/src/test-files/solr/collection1/conf/open-exchange-rates.json to /configs/conf1/open-exchange-rates.json
   [junit4]   2> 372691 INFO  (TEST-SolrCloudExampleTest.testLoadDocsIntoGettingStartedCollection-seed#[24E7A66E8B44A37]) [    ] o.a.s.c.c.SolrZkClient makePath: /configs/conf1/open-exchange-rates.json
   [junit4]   2> 372692 INFO  (TEST-SolrCloudExampleTest.testLoadDocsIntoGettingStartedCollection-seed#[24E7A66E8B44A37]) [    ] o.a.s.c.AbstractZkTestCase put /x1/jenkins/jenkins-slave/workspace/Lucene-Solr-Tests-trunk-Java8/solr/core/src/test-files/solr/collection1/conf/mapping-ISOLatin1Accent.txt to /configs/conf1/mapping-ISOLatin1Accent.txt
   [junit4]   2> 372692 INFO  (TEST-SolrCloudExampleTest.testLoadDocsIntoGettingStartedCollection-seed#[24E7A66E8B44A37]) [    ] o.a.s.c.c.SolrZkClient makePath: /configs/conf1/mapping-ISOLatin1Accent.txt
   [junit4]   2> 372693 INFO  (TEST-SolrCloudExampleTest.testLoadDocsIntoGettingStartedCollection-seed#[24E7A66E8B44A37]) [    ] o.a.s.c.AbstractZkTestCase put /x1/jenkins/jenkins-slave/workspace/Lucene-Solr-Tests-trunk-Java8/solr/core/src/test-files/solr/collection1/conf/old_synonyms.txt to /configs/conf1/old_synonyms.txt
   [junit4]   2> 372694 INFO  (TEST-SolrCloudExampleTest.testLoadDocsIntoGettingStartedCollection-seed#[24E7A66E8B44A37]) [    ] o.a.s.c.c.SolrZkClient makePath: /configs/conf1/old_synonyms.txt
   [junit4]   2> 372695 INFO  (TEST-SolrCloudExampleTest.testLoadDocsIntoGettingStartedCollection-seed#[24E7A66E8B44A37]) [    ] o.a.s.c.AbstractZkTestCase put /x1/jenkins/jenkins-slave/workspace/Lucene-Solr-Tests-trunk-Java8/solr/core/src/test-files/solr/collection1/conf/synonyms.txt to /configs/conf1/synonyms.txt
   [junit4]   2> 372695 INFO  (TEST-SolrCloudExampleTest.testLoadDocsIntoGettingStartedCollection-seed#[24E7A66E8B44A37]) [    ] o.a.s.c.c.SolrZkClient makePath: /configs/conf1/synonyms.txt
   [junit4]   2> 373089 INFO  (TEST-SolrCloudExampleTest.testLoadDocsIntoGettingStartedCollection-seed#[24E7A66E8B44A37]) [    ] o.a.s.SolrTestCaseJ4 Writing core.properties file to /x1/jenkins/jenkins-slave/workspace/Lucene-Solr-Tests-trunk-Java8/solr/build/solr-core/test/J1/temp/solr.cloud.SolrCloudExampleTest_24E7A66E8B44A37-001/control-001/cores/collection1
   [junit4]   2> 373091 INFO  (TEST-SolrCloudExampleTest.testLoadDocsIntoGettingStartedCollection-seed#[24E7A66E8B44A37]) [    ] o.e.j.s.Server jetty-9.2.13.v20150730
   [junit4]   2> 373134 INFO  (TEST-SolrCloudExampleTest.testLoadDocsIntoGettingStartedCollection-seed#[24E7A66E8B44A37]) [    ] o.e.j.s.h.ContextHandler Started o.e.j.s.ServletContextHandler@7abba246{/,null,AVAILABLE}
   [junit4]   2> 373136 INFO  (TEST-SolrCloudExampleTest.testLoadDocsIntoGettingStartedCollection-seed#[24E7A66E8B44A37]) [    ] o.e.j.s.ServerConnector Started ServerConnector@3468ea3d{HTTP/1.1}{127.0.0.1:51062}
   [junit4]   2> 373136 INFO  (TEST-SolrCloudExampleTest.testLoadDocsIntoGettingStartedCollection-seed#[24E7A66E8B44A37]) [    ] o.e.j.s.Server Started @375969ms
   [junit4]   2> 373136 INFO  (TEST-SolrCloudExampleTest.testLoadDocsIntoGettingStartedCollection-seed#[24E7A66E8B44A37]) [    ] o.a.s.c.s.e.JettySolrRunner Jetty properties: {solr.data.dir=/x1/jenkins/jenkins-slave/workspace/Lucene-Solr-Tests-trunk-Java8/solr/build/solr-core/test/J1/temp/solr.cloud.SolrCloudExampleTest_24E7A66E8B44A37-001/tempDir-001/control/data, hostContext=/, hostPort=51062, coreRootDirectory=/x1/jenkins/jenkins-slave/workspace/Lucene-Solr-Tests-trunk-Java8/solr/build/solr-core/test/J1/../../../../../../../../../../x1/jenkins/jenkins-slave/workspace/Lucene-Solr-Tests-trunk-Java8/solr/build/solr-core/test/J1/temp/solr.cloud.SolrCloudExampleTest_24E7A66E8B44A37-001/control-001/cores}
   [junit4]   2> 373136 INFO  (TEST-SolrCloudExampleTest.testLoadDocsIntoGettingStartedCollection-seed#[24E7A66E8B44A37]) [    ] o.a.s.s.SolrDispatchFilter SolrDispatchFilter.init(): sun.misc.Launcher$AppClassLoader@4e0e2f2a
   [junit4]   2> 373136 INFO  (TEST-SolrCloudExampleTest.testLoadDocsIntoGettingStartedCollection-seed#[24E7A66E8B44A37]) [    ] o.a.s.c.SolrResourceLoader new SolrResourceLoader for directory: '/x1/jenkins/jenkins-slave/workspace/Lucene-Solr-Tests-trunk-Java8/solr/build/solr-core/test/J1/../../../../../../../../../../x1/jenkins/jenkins-slave/workspace/Lucene-Solr-Tests-trunk-Java8/solr/build/solr-core/test/J1/temp/solr.cloud.SolrCloudExampleTest_24E7A66E8B44A37-001/control-001/'
   [junit4]   2> 373136 INFO  (TEST-SolrCloudExampleTest.testLoadDocsIntoGettingStartedCollection-seed#[24E7A66E8B44A37]) [    ] o.a.s.c.SolrResourceLoader JNDI not configured for solr (NoInitialContextEx)
   [junit4]   2> 373137 INFO  (TEST-SolrCloudExampleTest.testLoadDocsIntoGettingStartedCollection-seed#[24E7A66E8B44A37]) [    ] o.a.s.c.SolrResourceLoader solr home defaulted to 'solr/' (could not find system property or JNDI)
   [junit4]   2> 373174 INFO  (TEST-SolrCloudExampleTest.testLoadDocsIntoGettingStartedCollection-seed#[24E7A66E8B44A37]) [    ] o.a.s.c.c.SolrZkClient Using default ZkCredentialsProvider
   [junit4]   2> 373185 INFO  (TEST-SolrCloudExampleTest.testLoadDocsIntoGettingStartedCollection-seed#[24E7A66E8B44A37]) [    ] o.a.s.c.c.ConnectionManager Waiting for client to connect to ZooKeeper
   [junit4]   2> 373195 INFO  (zkCallback-433-thread-1) [    ] o.a.s.c.c.ConnectionManager Watcher org.apache.solr.common.cloud.ConnectionManager@66dce093 name:ZooKeeperConnection Watcher:127.0.0.1:44208/solr got event WatchedEvent state:SyncConnected type:None path:null path:null type:None
   [junit4]   2> 373195 INFO  (TEST-SolrCloudExampleTest.testLoadDocsIntoGettingStartedCollection-seed#[24E7A66E8B44A37]) [    ] o.a.s.c.c.ConnectionManager Client is connected to ZooKeeper
   [junit4]   2> 373195 INFO  (TEST-SolrCloudExampleTest.testLoadDocsIntoGettingStartedCollection-seed#[24E7A66E8B44A37]) [    ] o.a.s.c.c.SolrZkClient Using default ZkACLProvider
   [junit4]   2> 373196 INFO  (TEST-SolrCloudExampleTest.testLoadDocsIntoGettingStartedCollection-seed#[24E7A66E8B44A37]) [    ] o.a.s.s.SolrDispatchFilter Loading solr.xml from SolrHome (not found in ZooKeeper)
   [junit4]   2> 373196 INFO  (TEST-SolrCloudExampleTest.testLoadDocsIntoGettingStartedCollection-seed#[24E7A66E8B44A37]) [    ] o.a.s.c.SolrXmlConfig Loading container configuration from /x1/jenkins/jenkins-slave/workspace/Lucene-Solr-Tests-trunk-Java8/solr/build/solr-core/test/J1/../../../../../../../../../../x1/jenkins/jenkins-slave/workspace/Lucene-Solr-Tests-trunk-Java8/solr/build/solr-core/test/J1/temp/solr.cloud.SolrCloudExampleTest_24E7A66E8B44A37-001/control-001/solr.xml
   [junit4]   2> 373201 INFO  (TEST-SolrCloudExampleTest.testLoadDocsIntoGettingStartedCollection-seed#[24E7A66E8B44A37]) [    ] o.a.s.c.CoresLocator Config-defined core root directory: /x1/jenkins/jenkins-slave/workspace/Lucene-Solr-Tests-trunk-Java8/solr/build/solr-core/test/J1/../../../../../../../../../../x1/jenkins/jenkins-slave/workspace/Lucene-Solr-Tests-trunk-Java8/solr/build/solr-core/test/J1/temp/solr.cloud.SolrCloudExampleTest_24E7A66E8B44A37-001/control-001/cores
   [junit4]   2> 373202 INFO  (TEST-SolrCloudExampleTest.testLoadDocsIntoGettingStartedCollection-seed#[24E7A66E8B44A37]) [    ] o.a.s.c.CoreContainer New CoreContainer 907906676
   [junit4]   2> 373202 INFO  (TEST-SolrCloudExampleTest.testLoadDocsIntoGettingStartedCollection-seed#[24E7A66E8B44A37]) [    ] o.a.s.c.CoreContainer Loading cores into CoreContainer [instanceDir=/x1/jenkins/jenkins-slave/workspace/Lucene-Solr-Tests-trunk-Java8/solr/build/solr-core/test/J1/../../../../../../../../../../x1/jenkins/jenkins-slave/workspace/Lucene-Solr-Tests-trunk-Java8/solr/build/solr-core/test/J1/temp/solr.cloud.SolrCloudExampleTest_24E7A66E8B44A37-001/control-001/]
   [junit4]   2> 373202 INFO  (TEST-SolrCloudExampleTest.testLoadDocsIntoGettingStartedCollection-seed#[24E7A66E8B44A37]) [    ] o.a.s.c.CoreContainer loading shared library: /x1/jenkins/jenkins-slave/workspace/Lucene-Solr-Tests-trunk-Java8/solr/build/solr-core/test/J1/../../../../../../../../../../x1/jenkins/jenkins-slave/workspace/Lucene-Solr-Tests-trunk-Java8/solr/build/solr-core/test/J1/temp/solr.cloud.SolrCloudExampleTest_24E7A66E8B44A37-001/control-001/lib
   [junit4]   2> 373202 WARN  (TEST-SolrCloudExampleTest.testLoadDocsIntoGettingStartedCollection-seed#[24E7A66E8B44A37]) [    ] o.a.s.c.SolrResourceLoader Can't find (or read) directory to add to classloader: lib (resolved as: /x1/jenkins/jenkins-slave/workspace/Lucene-Solr-Tests-trunk-Java8/solr/build/solr-core/test/J1/../../../../../../../../../../x1/jenkins/jenkins-slave/workspace/Lucene-Solr-Tests-trunk-Java8/solr/build/solr-core/test/J1/temp/solr.cloud.SolrCloudExampleTest_24E7A66E8B44A37-001/control-001/lib).
   [junit4]   2> 373210 INFO  (TEST-SolrCloudExampleTest.testLoadDocsIntoGettingStartedCollection-seed#[24E7A66E8B44A37]) [    ] o.a.s.h.c.HttpShardHandlerFactory created with socketTimeout : 90000,urlScheme : ,connTimeout : 15000,maxConnectionsPerHost : 20,maxConnections : 10000,corePoolSize : 0,maximumPoolSize : 2147483647,maxThreadIdleTime : 5,sizeOfQueue : -1,fairnessPolicy : false,useRetries : false,
   [junit4]   2> 373211 INFO  (TEST-SolrCloudExampleTest.testLoadDocsIntoGettingStartedCollection-seed#[24E7A66E8B44A37]) [    ] o.a.s.u.UpdateShardHandler Creating UpdateShardHandler HTTP client with params: socketTimeout=340000&connTimeout=45000&retry=true
   [junit4]   2> 373212 INFO  (TEST-SolrCloudExampleTest.testLoadDocsIntoGettingStartedCollection-seed#[24E7A66E8B44A37]) [    ] o.a.s.l.LogWatcher SLF4J impl is org.slf4j.impl.Log4jLoggerFactory
   [junit4]   2> 373212 INFO  (TEST-SolrCloudExampleTest.testLoadDocsIntoGettingStartedCollection-seed#[24E7A66E8B44A37]) [    ] o.a.s.l.LogWatcher Registering Log Listener [Log4j (org.slf4j.impl.Log4jLoggerFactory)]
   [junit4]   2> 373212 INFO  (TEST-SolrCloudExampleTest.testLoadDocsIntoGettingStartedCollection-seed#[24E7A66E8B44A37]) [    ] o.a.s.c.ZkContainer Zookeeper client=127.0.0.1:44208/solr
   [junit4]   2> 373212 INFO  (TEST-SolrCloudExampleTest.testLoadDocsIntoGettingStartedCollection-seed#[24E7A66E8B44A37]) [    ] o.a.s.c.ZkController zkHost includes chroot
   [junit4]   2> 373212 INFO  (TEST-SolrCloudExampleTest.testLoadDocsIntoGettingStartedCollection-seed#[24E7A66E8B44A37]) [    ] o.a.s.c.c.SolrZkClient Using default ZkCredentialsProvider
   [junit4]   2> 373224 INFO  (TEST-SolrCloudExampleTest.testLoadDocsIntoGettingStartedCollection-seed#[24E7A66E8B44A37]) [    ] o.a.s.c.c.ConnectionManager Waiting for client to connect to ZooKeeper
   [junit4]   2> 373235 INFO  (zkCallback-435-thread-1) [    ] o.a.s.c.c.ConnectionManager Watcher org.apache.solr.common.cloud.ConnectionManager@331b3bf8 name:ZooKeeperConnection Watcher:127.0.0.1:44208 got event WatchedEvent state:SyncConnected type:None path:null path:null type:None
   [junit4]   2> 373235 INFO  (TEST-SolrCloudExampleTest.testLoadDocsIntoGettingStartedCollection-seed#[24E7A66E8B44A37]) [    ] o.a.s.c.c.ConnectionManager Client is connected to ZooKeeper
   [junit4]   2> 373236 INFO  (TEST-SolrCloudExampleTest.testLoadDocsIntoGettingStartedCollection-seed#[24E7A66E8B44A37]) [    ] o.a.s.c.c.SolrZkClient Using default ZkACLProvider
   [junit4]   2> 373255 INFO  (TEST-SolrCloudExampleTest.testLoadDocsIntoGettingStartedCollection-seed#[24E7A66E8B44A37]) [n:127.0.0.1:51062_    ] o.a.s.c.c.ConnectionManager Waiting for client to connect to ZooKeeper
   [junit4]   2> 373264 INFO  (zkCallback-436-thread-1-processing-n:127.0.0.1:51062_) [n:127.0.0.1:51062_    ] o.a.s.c.c.ConnectionManager Watcher org.apache.solr.common.cloud.ConnectionManager@54692c40 name:ZooKeeperConnection Watcher:127.0.0.1:44208/solr got event WatchedEvent state:SyncConnected type:None path:null path:null type:None
   [junit4]   2> 373264 INFO  (TEST-SolrCloudExampleTest.testLoadDocsIntoGettingStartedCollection-seed#[24E7A66E8B44A37]) [n:127.0.0.1:51062_    ] o.a.s.c.c.ConnectionManager Client is connected to ZooKeeper
   [junit4]   2> 373265 INFO  (TEST-SolrCloudExampleTest.testLoadDocsIntoGettingStartedCollection-seed#[24E7A66E8B44A37]) [n:127.0.0.1:51062_    ] o.a.s.c.c.SolrZkClient makePath: /overseer/queue
   [junit4]   2> 373267 INFO  (TEST-SolrCloudExampleTest.testLoadDocsIntoGettingStartedCollection-seed#[24E7A66E8B44A37]) [n:127.0.0.1:51062_    ] o.a.s.c.c.SolrZkClient makePath: /overseer/collection-queue-work
   [junit4]   2> 373269 INFO  (TEST-SolrCloudExampleTest.testLoadDocsIntoGettingStartedCollection-seed#[24E7A66E8B44A37]) [n:127.0.0.1:51062_    ] o.a.s.c.c.SolrZkClient makePath: /overseer/collection-map-running
   [junit4]   2> 373270 INFO  (TEST-SolrCloudExampleTest.testLoadDocsIntoGettingStartedCollection-seed#[24E7A66E8B44A37]) [n:127.0.0.1:51062_    ] o.a.s.c.c.SolrZkClient makePath: /overseer/collection-map-completed
   [junit4]   2> 373272 INFO  (TEST-SolrCloudExampleTest.testLoadDocsIntoGettingStartedCollection-seed#[24E7A66E8B44A37]) [n:127.0.0.1:51062_    ] o.a.s.c.c.SolrZkClient makePath: /overseer/collection-map-failure
   [junit4]   2> 373273 INFO  (TEST-SolrCloudExampleTest.testLoadDocsIntoGettingStartedCollection-seed#[24E7A66E8B44A37]) [n:127.0.0.1:51062_    ] o.a.s.c.c.SolrZkClient makePath: /live_nodes
   [junit4]   2> 373274 INFO  (TEST-SolrCloudExampleTest.testLoadDocsIntoGettingStartedCollection-seed#[24E7A66E8B44A37]) [n:127.0.0.1:51062_    ] o.a.s.c.c.SolrZkClient makePath: /aliases.json
   [junit4]   2> 373275 INFO  (TEST-SolrCloudExampleTest.testLoadDocsIntoGettingStartedCollection-seed#[24E7A66E8B44A37]) [n:127.0.0.1:51062_    ] o.a.s.c.c.SolrZkClient makePath: /clusterstate.json
   [junit4]   2> 373276 INFO  (TEST-SolrCloudExampleTest.testLoadDocsIntoGettingStartedCollection-seed#[24E7A66E8B44A37]) [n:127.0.0.1:51062_    ] o.a.s.c.c.SolrZkClient makePath: /security.json
   [junit4]   2> 373277 INFO  (TEST-SolrCloudExampleTest.testLoadDocsIntoGettingStartedCollection-seed#[24E7A66E8B44A37]) [n:127.0.0.1:51062_    ] o.a.s.c.ZkController Register node as live in ZooKeeper:/live_nodes/127.0.0.1:51062_
   [junit4]   2> 373277 INFO  (TEST-SolrCloudExampleTest.testLoadDocsIntoGettingStartedCollection-seed#[24E7A66E8B44A37]) [n:127.0.0.1:51062_    ] o.a.s.c.c.SolrZkClient makePath: /live_nodes/127.0.0.1:51062_
   [junit4]   2> 373279 INFO  (TEST-SolrCloudExampleTest.testLoadDocsIntoGettingStartedCollection-seed#[24E7A66E8B44A37]) [n:127.0.0.1:51062_    ] o.a.s.c.c.SolrZkClient makePath: /overseer_elect
   [junit4]   2> 373280 INFO  (TEST-SolrCloudExampleTest.testLoadDocsIntoGettingStartedCollection-seed#[24E7A66E8B44A37]) [n:127.0.0.1:51062_    ] o.a.s.c.c.SolrZkClient makePath: /overseer_elect/election
   [junit4]   2> 373280 INFO  (TEST-SolrCloudExampleTest.testLoadDocsIntoGettingStartedCollection-seed#[24E7A66E8B44A37]) [n:127.0.0.1:51062_    ] o.a.s.c.Overseer Overseer (id=null) closing
   [junit4]   2> 373281 INFO  (TEST-SolrCloudExampleTest.testLoadDocsIntoGettingStartedCollection-seed#[24E7A66E8B44A37]) [n:127.0.0.1:51062_    ] o.a.s.c.LeaderElector Joined leadership election with path: /overseer_elect/election/94685371574648836-127.0.0.1:51062_-n_0000000000
   [junit4]   2> 373281 INFO  (TEST-SolrCloudExampleTest.testLoadDocsIntoGettingStartedCollection-seed#[24E7A66E8B44A37]) [n:127.0.0.1:51062_    ] o.a.s.c.OverseerElectionContext I am going to be the leader 127.0.0.1:51062_
   [junit4]   2> 373281 INFO  (TEST-SolrCloudExampleTest.testLoadDocsIntoGettingStartedCollection-seed#[24E7A66E8B44A37]) [n:127.0.0.1:51062_    ] o.a.s.c.c.SolrZkClient makePath: /overseer_elect/leader
   [junit4]   2> 373282 INFO  (TEST-SolrCloudExampleTest.testLoadDocsIntoGettingStartedCollection-seed#[24E7A66E8B44A37]) [n:127.0.0.1:51062_    ] o.a.s.c.Overseer Overseer (id=94685371574648836-127.0.0.1:51062_-n_0000000000) starting
   [junit4]   2> 373284 INFO  (TEST-SolrCloudExampleTest.testLoadDocsIntoGettingStartedCollection-seed#[24E7A66E8B44A37]) [n:127.0.0.1:51062_    ] o.a.s.c.c.SolrZkClient makePath: /overseer/queue-work
   [junit4]   2> 373288 INFO  (TEST-SolrCloudExampleTest.testLoadDocsIntoGettingStartedCollection-seed#[24E7A66E8B44A37]) [n:127.0.0.1:51062_    ] o.a.s.c.OverseerAutoReplicaFailoverThread Starting OverseerAutoReplicaFailoverThread autoReplicaFailoverWorkLoopDelay=10000 autoReplicaFailoverWaitAfterExpiration=30000 autoReplicaFailoverBadNodeExpiration=60000
   [junit4]   2> 373297 INFO  (OverseerStateUpdate-94685371574648836-127.0.0.1:51062_-n_0000000000) [n:127.0.0.1:51062_    ] o.a.s.c.Overseer Starting to work on the main queue
   [junit4]   2> 373298 INFO  (OverseerStateUpdate-94685371574648836-127.0.0.1:51062_-n_0000000000) [n:127.0.0.1:51062_    ] o.a.s.c.c.ZkStateReader Updating cluster state from ZooKeeper... 
   [junit4]   2> 373303 INFO  (OverseerCollectionConfigSetProcessor-94685371574648836-127.0.0.1:51062_-n_0000000000) [n:127.0.0.1:51062_    ] o.a.s.c.OverseerTaskProcessor Process current queue of overseer operations
   [junit4]   2> 373316 INFO  (TEST-SolrCloudExampleTest.testLoadDocsIntoGettingStartedCollection-seed#[24E7A66E8B44A37]) [n:127.0.0.1:51062_    ] o.a.s.c.c.ZkStateReader Updating cluster state from ZooKeeper... 
   [junit4]   2> 373350 INFO  (TEST-SolrCloudExampleTest.testLoadDocsIntoGettingStartedCollection-seed#[24E7A66E8B44A37]) [n:127.0.0.1:51062_    ] o.a.s.c.CoreContainer Security conf doesn't exist. Skipping setup for authorization module.
   [junit4]   2> 373350 INFO  (TEST-SolrCloudExampleTest.testLoadDocsIntoGettingStartedCollection-seed#[24E7A66E8B44A37]) [n:127.0.0.1:51062_    ] o.a.s.c.CoreContainer No authentication plugin used.
   [junit4]   2> 373357 INFO  (TEST-SolrCloudExampleTest.testLoadDocsIntoGettingStartedCollection-seed#[24E7A66E8B44A37]) [n:127.0.0.1:51062_    ] o.a.s.c.CoresLocator Looking for core definitions underneath /x1/jenkins/jenkins-slave/workspace/Lucene-Solr-Tests-trunk-Java8/solr/build/solr-core/test/J1/../../../../../../../../../../x1/jenkins/jenkins-slave/workspace/Lucene-Solr-Tests-trunk-Java8/solr/build/solr-core/test/J1/temp/solr.cloud.SolrCloudExampleTest_24E7A66E8B44A37-001/control-001/cores
   [junit4]   2> 373358 INFO  (TEST-SolrCloudExampleTest.testLoadDocsIntoGettingStartedCollection-seed#[24E7A66E8B44A37]) [n:127.0.0.1:51062_    ] o.a.s.c.SolrCore Created CoreDescriptor: {name=collection1, config=solrconfig.xml, transient=false, schema=schema.xml, loadOnStartup=true, configSetProperties=configsetprops.json, instanceDir=/x1/jenkins/jenkins-slave/workspace/Lucene-Solr-Tests-trunk-Java8/solr/build/solr-core/test/J1/../../../../../../../../../../x1/jenkins/jenkins-slave/workspace/Lucene-Solr-Tests-trunk-Java8/solr/build/solr-core/test/J1/temp/solr.cloud.SolrCloudExampleTest_24E7A66E8B44A37-001/control-001/cores/collection1, collection=control_collection, absoluteInstDir=/x1/jenkins/jenkins-slave/workspace/Lucene-Solr-Tests-trunk-Java8/solr/build/solr-core/test/J1/../../../../../../../../../../x1/jenkins/jenkins-slave/workspace/Lucene-Solr-Tests-trunk-Java8/solr/build/solr-core/test/J1/temp/solr.cloud.SolrCloudExampleTest_24E7A66E8B44A37-001/control-001/cores/collection1/, coreNodeName=, dataDir=data/, shard=}
   [junit4]   2> 373358 INFO  (TEST-SolrCloudExampleTest.testLoadDocsIntoGettingStartedCollection-seed#[24E7A66E8B44A37]) [n:127.0.0.1:51062_    ] o.a.s.c.CoresLocator Found core collection1 in /x1/jenkins/jenkins-slave/workspace/Lucene-Solr-Tests-trunk-Java8/solr/build/solr-core/test/J1/../../../../../../../../../../x1/jenkins/jenkins-slave/workspace/Lucene-Solr-Tests-trunk-Java8/solr/build/solr-core/test/J1/temp/solr.cloud.SolrCloudExampleTest_24E7A66E8B44A37-001/control-001/cores/collection1/
   [junit4]   2> 373358 INFO  (TEST-SolrCloudExampleTest.testLoadDocsIntoGettingStartedCollection-seed#[24E7A66E8B44A37]) [n:127.0.0.1:51062_    ] o.a.s.c.CoresLocator Found 1 core definitions
   [junit4]   2> 373377 INFO  (coreLoadExecutor-1323-thread-1-processing-n:127.0.0.1:51062_) [n:127.0.0.1:51062_ c:control_collection   x:collection1] o.a.s.c.ZkController publishing state=down
   [junit4]   2> 373377 INFO  (coreLoadExecutor-1323-thread-1-processing-n:127.0.0.1:51062_) [n:127.0.0.1:51062_ c:control_collection   x:collection1] o.a.s.c.ZkController numShards not found on descriptor - reading it from system property
   [junit4]   2> 373378 INFO  (coreLoadExecutor-1323-thread-1-processing-n:127.0.0.1:51062_) [n:127.0.0.1:51062_ c:control_collection   x:collection1] o.a.s.c.ZkController look for our core node name
   [junit4]   2> 373383 INFO  (TEST-SolrCloudExampleTest.testLoadDocsIntoGettingStartedCollection-seed#[24E7A66E8B44A37]) [n:127.0.0.1:51062_    ] o.a.s.s.SolrDispatchFilter user.dir=/x1/jenkins/jenkins-slave/workspace/Lucene-Solr-Tests-trunk-Java8/solr/build/solr-core/test/J1
   [junit4]   2> 373383 INFO  (TEST-SolrCloudExampleTest.testLoadDocsIntoGettingStartedCollection-seed#[24E7A66E8B44A37]) [n:127.0.0.1:51062_    ] o.a.s.s.SolrDispatchFilter SolrDispatchFilter.init() done
   [junit4]   2> 373385 INFO  (OverseerStateUpdate-94685371574648836-127.0.0.1:51062_-n_0000000000) [n:127.0.0.1:51062_    ] o.a.s.c.Overseer processMessage: queueSize: 1, message = {
   [junit4]   2>   "core":"collection1",
   [junit4]   2>   "roles":null,
   [junit4]   2>   "base_url":"http://127.0.0.1:51062",
   [junit4]   2>   "node_name":"127.0.0.1:51062_",
   [junit4]   2>   "numShards":"1",
   [junit4]   2>   "state":"down",
   [junit4]   2>   "shard":null,
   [junit4]   2>   "collection":"control_collection",
   [junit4]   2>   "operation":"state"} current state version: 0
   [junit4]   2> 373385 INFO  (OverseerStateUpdate-94685371574648836-127.0.0.1:51062_-n_0000000000) [n:127.0.0.1:51062_    ] o.a.s.c.o.ReplicaMutator Update state numShards=1 message={
   [junit4]   2>   "core":"collection1",
   [junit4]   2>   "roles":null,
   [junit4]   2>   "base_url":"http://127.0.0.1:51062",
   [junit4]   2>   "node_name":"127.0.0.1:51062_",
   [junit4]   2>   "numShards":"1",
   [junit4]   2>   "state":"down",
   [junit4]   2>   "shard":null,
   [junit4]   2>   "collection":"control_collection",
   [junit4]   2>   "operation":"state"}
   [junit4]   2> 373386 INFO  (OverseerStateUpdate-94685371574648836-127.0.0.1:51062_-n_0000000000) [n:127.0.0.1:51062_    ] o.a.s.c.o.ClusterStateMutator building a new cName: control_collection
   [junit4]   2> 373386 INFO  (OverseerStateUpdate-94685371574648836-127.0.0.1:51062_-n_0000000000) [n:127.0.0.1:51062_    ] o.a.s.c.o.ReplicaMutator Assigning new node to shard shard=shard1
   [junit4]   2> 373387 INFO  (zkCallback-436-thread-1-processing-n:127.0.0.1:51062_) [n:127.0.0.1:51062_    ] o.a.s.c.c.ZkStateReader A cluster state change: WatchedEvent state:SyncConnected type:NodeDataChanged path:/clusterstate.json, has occurred - updating... (live nodes size: 1)
   [junit4]   2> 373395 INFO  (zkCallback-436-thread-2-processing-n:127.0.0.1:51062_) [n:127.0.0.1:51062_    ] o.a.s.c.c.ZkStateReader A cluster state change: WatchedEvent state:SyncConnected type:NodeDataChanged path:/clusterstate.json, has occurred - updating... (live nodes size: 1)
   [junit4]   2> 374379 INFO  (coreLoadExecutor-1323-thread-1-processing-n:127.0.0.1:51062_) [n:127.0.0.1:51062_ c:control_collection   x:collection1] o.a.s.c.ZkController waiting to find shard id in clusterstate for collection1
   [junit4]   2> 374379 INFO  (coreLoadExecutor-1323-thread-1-processing-n:127.0.0.1:51062_) [n:127.0.0.1:51062_ c:control_collection   x:collection1] o.a.s.c.ZkController Check for collection zkNode:control_collection
   [junit4]   2> 374379 INFO  (coreLoadExecutor-1323-thread-1-processing-n:127.0.0.1:51062_) [n:127.0.0.1:51062_ c:control_collection   x:collection1] o.a.s.c.ZkController Collection zkNode exists
   [junit4]   2> 374379 INFO  (coreLoadExecutor-1323-thread-1-processing-n:127.0.0.1:51062_) [n:127.0.0.1:51062_ c:control_collection   x:collection1] o.a.s.c.c.ZkStateReader Load collection config from:/collections/control_collection
   [junit4]   2> 374380 INFO  (coreLoadExecutor-1323-thread-1-processing-n:127.0.0.1:51062_) [n:127.0.0.1:51062_ c:control_collection   x:collection1] o.a.s.c.c.ZkStateReader path=/collections/control_collection configName=conf1 specified config exists in ZooKeeper
   [junit4]   2> 374380 INFO  (coreLoadExecutor-1323-thread-1-processing-n:127.0.0.1:51062_) [n:127.0.0.1:51062_ c:control_collection   x:collection1] o.a.s.c.SolrResourceLoader new SolrResourceLoader for directory: '/x1/jenkins/jenkins-slave/workspace/Lucene-Solr-Tests-trunk-Java8/solr/build/solr-core/test/J1/../../../../../../../../../../x1/jenkins/jenkins-slave/workspace/Lucene-Solr-Tests-trunk-Java8/solr/build/solr-core/test/J1/temp/solr.cloud.SolrCloudExampleTest_24E7A66E8B44A37-001/control-001/cores/collection1/'
   [junit4]   2> 374380 INFO  (coreLoadExecutor-1323-thread-1-processing-n:127.0.0.1:51062_) [n:127.0.0.1:51062_ c:control_collection   x:collection1] o.a.s.c.SolrResourceLoader JNDI not configured for solr (NoInitialContextEx)
   [junit4]   2> 374380 INFO  (coreLoadExecutor-1323-thread-1-processing-n:127.0.0.1:51062_) [n:127.0.0.1:51062_ c:control_collection   x:collection1] o.a.s.c.SolrResourceLoader solr home defaulted to 'solr/' (could not find system property or JNDI)
   [junit4]   2> 374395 INFO  (coreLoadExecutor-1323-thread-1-processing-n:127.0.0.1:51062_) [n:127.0.0.1:51062_ c:control_collection   x:collection1] o.a.s.c.Config loaded config solrconfig.xml with version 0 
   [junit4]   2> 374400 INFO  (coreLoadExecutor-1323-thread-1-processing-n:127.0.0.1:51062_) [n:127.0.0.1:51062_ c:control_collection   x:collection1] o.a.s.c.SolrConfig current version of requestparams : -1
   [junit4]   2> 374404 INFO  (coreLoadExecutor-1323-thread-1-processing-n:127.0.0.1:51062_) [n:127.0.0.1:51062_ c:control_collection   x:collection1] o.a.s.c.SolrConfig Using Lucene MatchVersion: 6.0.0
   [junit4]   2> 374412 INFO  (coreLoadExecutor-1323-thread-1-processing-n:127.0.0.1:51062_) [n:127.0.0.1:51062_ c:control_collection   x:collection1] o.a.s.c.Config Loaded SolrConfig: solrconfig.xml
   [junit4]   2> 374413 INFO  (coreLoadExecutor-1323-thread-1-processing-n:127.0.0.1:51062_) [n:127.0.0.1:51062_ c:control_collection   x:collection1] o.a.s.s.IndexSchema Reading Solr Schema from /configs/conf1/schema.xml
   [junit4]   2> 374417 INFO  (coreLoadExecutor-1323-thread-1-processing-n:127.0.0.1:51062_) [n:127.0.0.1:51062_ c:control_collection   x:collection1] o.a.s.s.IndexSchema [collection1] Schema name=test
   [junit4]   2> 374504 INFO  (coreLoadExecutor-1323-thread-1-processing-n:127.0.0.1:51062_) [n:127.0.0.1:51062_ c:control_collection   x:collection1] o.a.s.s.OpenExchangeRatesOrgProvider Initialized with rates=open-exchange-rates.json, refreshInterval=1440.
   [junit4]   2> 374511 INFO  (coreLoadExecutor-1323-thread-1-processing-n:127.0.0.1:51062_) [n:127.0.0.1:51062_ c:control_collection   x:collection1] o.a.s.s.IndexSchema default search field in schema is text
   [junit4]   2> 374512 INFO  (coreLoadExecutor-1323-thread-1-processing-n:127.0.0.1:51062_) [n:127.0.0.1:51062_ c:control_collection   x:collection1] o.a.s.s.IndexSchema unique key field: id
   [junit4]   2> 374520 INFO  (coreLoadExecutor-1323-thread-1-processing-n:127.0.0.1:51062_) [n:127.0.0.1:51062_ c:control_collection   x:collection1] o.a.s.s.FileExchangeRateProvider Reloading exchange rates from file currency.xml
   [junit4]   2> 374522 INFO  (coreLoadExecutor-1323-thread-1-processing-n:127.0.0.1:51062_) [n:127.0.0.1:51062_ c:control_collection   x:collection1] o.a.s.s.FileExchangeRateProvider Reloading exchange rates from file currency.xml
   [junit4]   2> 374524 INFO  (coreLoadExecutor-1323-thread-1-processing-n:127.0.0.1:51062_) [n:127.0.0.1:51062_ c:control_collection   x:collection1] o.a.s.s.OpenExchangeRatesOrgProvider Reloading exchange rates from open-exchange-rates.json
   [junit4]   2> 374525 WARN  (coreLoadExecutor-1323-thread-1-processing-n:127.0.0.1:51062_) [n:127.0.0.1:51062_ c:control_collection   x:collection1] o.a.s.s.OpenExchangeRatesOrgProvider Unknown key IMPORTANT NOTE
   [junit4]   2> 374525 WARN  (coreLoadExecutor-1323-thread-1-processing-n:127.0.0.1:51062_) [n:127.0.0.1:51062_ c:control_collection   x:collection1] o.a.s.s.OpenExchangeRatesOrgProvider Expected key, got STRING
   [junit4]   2> 374525 INFO  (coreLoadExecutor-1323-thread-1-processing-n:127.0.0.1:51062_) [n:127.0.0.1:51062_ c:control_collection   x:collection1] o.a.s.s.OpenExchangeRatesOrgProvider Reloading exchange rates from open-exchange-rates.json
   [junit4]   2> 374526 WARN  (coreLoadExecutor-1323-thread-1-processing-n:127.0.0.1:51062_) [n:127.0.0.1:51062_ c:control_collection   x:collection1] o.a.s.s.OpenExchangeRatesOrgProvider Unknown key IMPORTANT NOTE
   [junit4]   2> 374526 WARN  (coreLoadExecutor-1323-thread-1-processing-n:127.0.0.1:51062_) [n:127.0.0.1:51062_ c:control_collection   x:collection1] o.a.s.s.OpenExchangeRatesOrgProvider Expected key, got STRING
   [junit4]   2> 374528 INFO  (coreLoadExecutor-1323-thread-1-processing-n:127.0.0.1:51062_) [n:127.0.0.1:51062_ c:control_collection   x:collection1] o.a.s.c.ConfigSetProperties Did not find ConfigSet properties, assuming default properties: Can't find resource 'configsetprops.json' in classpath or '/configs/conf1', cwd=/x1/jenkins/jenkins-slave/workspace/Lucene-Solr-Tests-trunk-Java8/solr/build/solr-core/test/J1
   [junit4]   2> 374528 INFO  (coreLoadExecutor-1323-thread-1-processing-n:127.0.0.1:51062_) [n:127.0.0.1:51062_ c:control_collection   x:collection1] o.a.s.c.CoreContainer Creating SolrCore 'collection1' using configuration from collection control_collection
   [junit4]   2> 374528 INFO  (coreLoadExecutor-1323-thread-1-processing-n:127.0.0.1:51062_) [n:127.0.0.1:51062_ c:control_collection s:shard1 r:core_node1 x:collection1] o.a.s.c.SolrCore org.apache.solr.core.MockDirectoryFactory
   [junit4]   2> 374528 INFO  (coreLoadExecutor-1323-thread-1-processing-n:127.0.0.1:51062_) [n:127.0.0.1:51062_ c:control_collection s:shard1 r:core_node1 x:collection1] o.a.s.c.SolrCore [[collection1] ] Opening new SolrCore at [/x1/jenkins/jenkins-slave/workspace/Lucene-Solr-Tests-trunk-Java8/solr/build/solr-core/test/J1/../../../../../../../../../../x1/jenkins/jenkins-slave/workspace/Lucene-Solr-Tests-trunk-Java8/solr/build/solr-core/test/J1/temp/solr.cloud.SolrCloudExampleTest_24E7A66E8B44A37-001/control-001/cores/collection1/], dataDir=[null]
   [junit4]   2> 374528 INFO  (coreLoadExecutor-1323-thread-1-processing-n:127.0.0.1:51062_) [n:127.0.0.1:51062_ c:control_collection s:shard1 r:core_node1 x:collection1] o.a.s.c.JmxMonitoredMap JMX monitoring is enabled. Adding Solr mbeans to JMX Server: com.sun.jmx.mbeanserver.JmxMBeanServer@9daefea
   [junit4]   2> 374529 INFO  (coreLoadExecutor-1323-thread-1-processing-n:127.0.0.1:51062_) [n:127.0.0.1:51062_ c:control_collection s:shard1 r:core_node1 x:collection1] o.a.s.c.CachingDirectoryFactory return new directory for /x1/jenkins/jenkins-slave/workspace/Lucene-Solr-Tests-trunk-Java8/solr/build/solr-core/test/J1/../../../../../../../../../../x1/jenkins/jenkins-slave/workspace/Lucene-Solr-Tests-trunk-Java8/solr/build/solr-core/test/J1/temp/solr.cloud.SolrCloudExampleTest_24E7A66E8B44A37-001/control-001/cores/collection1/data
   [junit4]   2> 374529 INFO  (coreLoadExecutor-1323-thread-1-processing-n:127.0.0.1:51062_) [n:127.0.0.1:51062_ c:control_collection s:shard1 r:core_node1 x:collection1] o.a.s.c.SolrCore New index directory detected: old=null new=/x1/jenkins/jenkins-slave/workspace/Lucene-Solr-Tests-trunk-Java8/solr/build/solr-core/test/J1/../../../../../../../../../../x1/jenkins/jenkins-slave/workspace/Lucene-Solr-Tests-trunk-Java8/solr/build/solr-core/test/J1/temp/solr.cloud.SolrCloudExampleTest_24E7A66E8B44A37-001/control-001/cores/collection1/data/index/
   [junit4]   2> 374529 WARN  (coreLoadExecutor-1323-thread-1-processing-n:127.0.0.1:51062_) [n:127.0.0.1:51062_ c:control_collection s:shard1 r:core_node1 x:collection1] o.a.s.c.SolrCore [collection1] Solr index directory '/x1/jenkins/jenkins-slave/workspace/Lucene-Solr-Tests-trunk-Java8/solr/build/solr-core/test/J1/../../../../../../../../../../x1/jenkins/jenkins-slave/workspace/Lucene-Solr-Tests-trunk-Java8/solr/build/solr-core/test/J1/temp/solr.cloud.SolrCloudExampleTest_24E7A66E8B44A37-001/control-001/cores/collection1/data/index' doesn't exist. Creating new index...
   [junit4]   2> 374529 INFO  (coreLoadExecutor-1323-thread-1-processing-n:127.0.0.1:51062_) [n:127.0.0.1:51062_ c:control_collection s:shard1 r:core_node1 x:collection1] o.a.s.c.CachingDirectoryFactory return new directory for /x1/jenkins/jenkins-slave/workspace/Lucene-Solr-Tests-trunk-Java8/solr/build/solr-core/test/J1/../../../../../../../../../../x1/jenkins/jenkins-slave/workspace/Lucene-Solr-Tests-trunk-Java8/solr/build/solr-core/test/J1/temp/solr.cloud.SolrCloudExampleTest_24E7A66E8B44A37-001/control-001/cores/collection1/data/index
   [junit4]   2> 374529 INFO  (coreLoadExecutor-1323-thread-1-processing-n:127.0.0.1:51062_) [n:127.0.0.1:51062_ c:control_collection s:shard1 r:core_node1 x:collection1] o.a.s.u.RandomMergePolicy RandomMergePolicy wrapping class org.apache.lucene.index.TieredMergePolicy: [TieredMergePolicy: maxMergeAtOnce=50, maxMergeAtOnceExplicit=29, maxMergedSegmentMB=33.82421875, floorSegmentMB=0.3583984375, forceMergeDeletesPctAllowed=18.89115112050836, segmentsPerTier=13.0, maxCFSSegmentSizeMB=8.796093022207999E12, noCFSRatio=0.6275052310273674
   [junit4]   2> 374530 INFO  (coreLoadExecutor-1323-thread-1-processing-n:127.0.0.1:51062_) [n:127.0.0.1:51062_ c:control_collection s:shard1 r:core_node1 x:collection1] o.a.s.c.SolrCore SolrDeletionPolicy.onCommit: commits: num=1
   [junit4]   2> 	commit{dir=MockDirectoryWrapper(RAMDirectory@7774046 lockFactory=org.apache.lucene.store.SingleInstanceLockFactory@59c1924a),segFN=segments_1,generation=1}
   [junit4]   2> 374530 INFO  (coreLoadExecutor-1323-thread-1-processing-n:127.0.0.1:51062_) [n:127.0.0.1:51062_ c:control_collection s:shard1 r:core_node1 x:collection1] o.a.s.c.SolrCore newest commit generation = 1
   [junit4]   2> 374534 INFO  (coreLoadExecutor-1323-thread-1-processing-n:127.0.0.1:51062_) [n:127.0.0.1:51062_ c:control_collection s:shard1 r:core_node1 x:collection1] o.a.s.u.p.UpdateRequestProcessorChain creating updateRequestProcessorChain "nodistrib"
   [junit4]   2> 374534 INFO  (coreLoadExecutor-1323-thread-1-processing-n:127.0.0.1:51062_) [n:127.0.0.1:51062_ c:control_collection s:shard1 r:core_node1 x:collection1] o.a.s.u.p.UpdateRequestProcessorChain creating updateRequestProcessorChain "dedupe"
   [junit4]   2> 374534 INFO  (coreLoadExecutor-1323-thread-1-processing-n:127.0.0.1:51062_) [n:127.0.0.1:51062_ c:control_collection s:shard1 r:core_node1 x:collection1] o.a.s.u.p.UpdateRequestProcessorChain inserting DistributedUpdateProcessorFactory into updateRequestProcessorChain "dedupe"
   [junit4]   2> 374534 INFO  (coreLoadExecutor-1323-thread-1-processing-n:127.0.0.1:51062_) [n:127.0.0.1:51062_ c:control_collection s:shard1 r:core_node1 x:collection1] o.a.s.u.p.UpdateRequestProcessorChain creating updateRequestProcessorChain "stored_sig"
   [junit4]   2> 374535 INFO  (coreLoadExecutor-1323-thread-1-processing-n:127.0.0.1:51062_) [n:127.0.0.1:51062_ c:control_collection s:shard1 r:core_node1 x:collection1] o.a.s.u.p.UpdateRequestProcessorChain inserting DistributedUpdateProcessorFactory into updateRequestProcessorChain "stored_sig"
   [junit4]   2> 374535 INFO  (coreLoadExecutor-1323-thread-1-processing-n:127.0.0.1:51062_) [n:127.0.0.1:51062_ c:control_collection s:shard1 r:core_node1 x:collection1] o.a.s.u.p.UpdateRequestProcessorChain creating updateRequestProcessorChain "distrib-dup-test-chain-explicit"
   [junit4]   2> 374535 INFO  (coreLoadExecutor-1323-thread-1-processing-n:127.0.0.1:51062_) [n:127.0.0.1:51062_ c:control_collection s:shard1 r:core_node1 x:collection1] o.a.s.u.p.UpdateRequestProcessorChain creating updateRequestProcessorChain "distrib-dup-test-chain-implicit"
   [junit4]   2> 374535 INFO  (coreLoadExecutor-1323-thread-1-processing-n:127.0.0.1:51062_) [n:127.0.0.1:51062_ c:control_collection s:shard1 r:core_node1 x:collection1] o.a.s.u.p.UpdateRequestProcessorChain inserting DistributedUpdateProcessorFactory into updateRequestProcessorChain "distrib-dup-test-chain-implicit"
   [junit4]   2> 374535 INFO  (coreLoadExecutor-1323-thread-1-processing-n:127.0.0.1:51062_) [n:127.0.0.1:51062_ c:control_collection s:shard1 r:core_node1 x:collection1] o.a.s.c.SolrCore no updateRequestProcessorChain defined as default, creating implicit default
   [junit4]   2> 374537 INFO  (coreLoadExecutor-1323-thread-1-processing-n:127.0.0.1:51062_) [n:127.0.0.1:51062_ c:control_collection s:shard1 r:core_node1 x:collection1] o.a.s.h.l.XMLLoader xsltCacheLifetimeSeconds=60
   [junit4]   2> 374538 INFO  (OldIndexDirectoryCleanupThreadForCore-collection1) [n:127.0.0.1:51062_ c:control_collection s:shard1 r:core_node1 x:collection1] o.a.s.c.SolrCore Looking for old index directories to cleanup for core collection1 in /x1/jenkins/jenkins-slave/workspace/Lucene-Solr-Tests-trunk-Java8/solr/build/solr-core/test/J1/../../../../../../../../../../x1/jenkins/jenkins-slave/workspace/Lucene-Solr-Tests-trunk-Java8/solr/build/solr-core/test/J1/temp/solr.cloud.SolrCloudExampleTest_24E7A66E8B44A37-001/control-001/cores/collection1/data/
   [junit4]   2> 374538 WARN  (OldIndexDirectoryCleanupThreadForCore-collection1) [n:127.0.0.1:51062_ c:control_collection s:shard1 r:core_node1 x:collection1] o.a.s.c.DirectoryFactory /x1/jenkins/jenkins-slave/workspace/Lucene-Solr-Tests-trunk-Java8/solr/build/solr-core/test/J1/../../../../../../../../../../x1/jenkins/jenkins-slave/workspace/Lucene-Solr-Tests-trunk-Java8/solr/build/solr-core/test/J1/temp/solr.cloud.SolrCloudExampleTest_24E7A66E8B44A37-001/control-001/cores/collection1/data/ does not point to a valid data directory; skipping clean-up of old index directories.
   [junit4]   2> 374541 INFO  (coreLoadExecutor-1323-thread-1-processing-n:127.0.0.1:51062_) [n:127.0.0.1:51062_ c:control_collection s:shard1 r:core_node1 x:collection1] o.a.s.h.l.XMLLoader xsltCacheLifetimeSeconds=60
   [junit4]   2> 374542 INFO  (coreLoadExecutor-1323-thread-1-processing-n:127.0.0.1:51062_) [n:127.0.0.1:51062_ c:control_collection s:shard1 r:core_node1 x:collection1] o.a.s.h.l.XMLLoader xsltCacheLifetimeSeconds=60
   [junit4]   2> 374543 INFO  (coreLoadExecutor-1323-thread-1-processing-n:127.0.0.1:51062_) [n:127.0.0.1:51062_ c:control_collection s:shard1 r:core_node1 x:collection1] o.a.s.h.l.XMLLoader xsltCacheLifetimeSeconds=60
   [junit4]   2> 374549 INFO  (coreLoadExecutor-1323-thread-1-processing-n:127.0.0.1:51062_) [n:127.0.0.1:51062_ c:control_collection s:shard1 r:core_node1 x:collection1] o.a.s.c.RequestHandlers Registered paths: /admin/mbeans,standard,/update/csv,/update/json/docs,/admin/luke,/admin/segments,/get,/admin/system,/replication,/admin/properties,/config,/schema,/admin/plugins,/admin/logging,/update/json,/admin/threads,/admin/ping,/update,/admin/file
   [junit4]   2> 374550 INFO  (coreLoadExecutor-1323-thread-1-processing-n:127.0.0.1:51062_) [n:127.0.0.1:51062_ c:control_collection s:shard1 r:core_node1 x:collection1] o.a.s.c.SolrCore Using default statsCache cache: org.apache.solr.search.stats.LocalStatsCache
   [junit4]   2> 374550 INFO  (coreLoadExecutor-1323-thread-1-processing-n:127.0.0.1:51062_) [n:127.0.0.1:51062_ c:control_collection s:shard1 r:core_node1 x:collection1] o.a.s.u.UpdateHandler Using UpdateLog implementation: org.apache.solr.update.UpdateLog
   [junit4]   2> 374550 INFO  (coreLoadExecutor-1323-thread-1-processing-n:127.0.0.1:51062_) [n:127.0.0.1:51062_ c:control_collection s:shard1 r:core_node1 x:collection1] o.a.s.u.UpdateLog Initializing UpdateLog: dataDir= defaultSyncLevel=FLUSH numRecordsToKeep=100 maxNumLogsToKeep=10 numVersionBuckets=65536
   [junit4]   2> 374551 INFO  (coreLoadExecutor-1323-thread-1-processing-n:127.0.0.1:51062_) [n:127.0.0.1:51062_ c:control_collection s:shard1 r:core_node1 x:collection1] o.a.s.c.SolrCore Hard AutoCommit: disabled
   [junit4]   2> 374551 INFO  (coreLoadExecutor-1323-thread-1-processing-n:127.0.0.1:51062_) [n:127.0.0.1:51062_ c:control_collection s:shard1 r:core_node1 x:collection1] o.a.s.c.SolrCore Soft AutoCommit: disabled
   [junit4]   2> 374552 INFO  (coreLoadExecutor-1323-thread-1-processing-n:127.0.0.1:51062_) [n:127.0.0.1:51062_ c:control_collection s:shard1 r:core_node1 x:collection1] o.a.s.u.RandomMergePolicy RandomMergePolicy wrapping class org.apache.lucene.index.LogDocMergePolicy: [LogDocMergePolicy: minMergeSize=1000, mergeFactor=36, maxMergeSize=9223372036854775807, maxMergeSizeForForcedMerge=9223372036854775807, calibrateSizeByDeletes=true, maxMergeDocs=2147483647, maxCFSSegmentSizeMB=8.796093022207999E12, noCFSRatio=1.0]
   [junit4]   2> 374552 INFO  (coreLoadExecutor-1323-thread-1-processing-n:127.0.0.1:51062_) [n:127.0.0.1:51062_ c:control_collection s:shard1 r:core_node1 x:collection1] o.a.s.c.SolrCore SolrDeletionPolicy.onInit: commits: num=1
   [junit4]   2> 	commit{dir=MockDirectoryWrapper(RAMDirectory@7774046 lockFactory=org.apache.lucene.store.SingleInstanceLockFactory@59c1924a),segFN=segments_1,generation=1}
   [junit4]   2> 374552 INFO  (coreLoadExecutor-1323-thread-1-processing-n:127.0.0.1:51062_) [n:127.0.0.1:51062_ c:control_collection s:shard1 r:core_node1 x:collection1] o.a.s.c.SolrCore newest commit generation = 1
   [junit4]   2> 374552 INFO  (coreLoadExecutor-1323-thread-1-processing-n:127.0.0.1:51062_) [n:127.0.0.1:51062_ c:control_collection s:shard1 r:core_node1 x:collection1] o.a.s.s.SolrIndexSearcher Opening Searcher@7d04f6cf[collection1] main
   [junit4]   2> 374552 INFO  (coreLoadExecutor-1323-thread-1-processing-n:127.0.0.1:51062_) [n:127.0.0.1:51062_ c:control_collection s:shard1 r:core_node1 x:collection1] o.a.s.c.c.ZkStateReader Load collection config from:/collections/control_collection
   [junit4]   2> 374553 INFO  (coreLoadExecutor-1323-thread-1-processing-n:127.0.0.1:51062_) [n:127.0.0.1:51062_ c:control_collection s:shard1 r:core_node1 x:collection1] o.a.s.c.c.ZkStateReader path=/collections/control_collection configName=conf1 specified config exists in ZooKeeper
   [junit4]   2> 374553 INFO  (coreLoadExecutor-1323-thread-1-processing-n:127.0.0.1:51062_) [n:127.0.0.1:51062_ c:control_collection s:shard1 r:core_node1 x:collection1] o.a.s.r.ManagedResourceStorage Setting up ZooKeeper-based storage for the RestManager with znodeBase: /configs/conf1
   [junit4]   2> 374553 INFO  (coreLoadExecutor-1323-thread-1-processing-n:127.0.0.1:51062_) [n:127.0.0.1:51062_ c:control_collection s:shard1 r:core_node1 x:collection1] o.a.s.r.ManagedResourceStorage Configured ZooKeeperStorageIO with znodeBase: /configs/conf1
   [junit4]   2> 374553 INFO  (coreLoadExecutor-1323-thread-1-processing-n:127.0.0.1:51062_) [n:127.0.0.1:51062_ c:control_collection s:shard1 r:core_node1 x:collection1] o.a.s.r.RestManager Initializing RestManager with initArgs: {}
   [junit4]   2> 374554 INFO  (coreLoadExecutor-1323-thread-1-processing-n:127.0.0.1:51062_) [n:127.0.0.1:51062_ c:control_collection s:shard1 r:core_node1 x:collection1] o.a.s.r.ManagedResourceStorage Reading _rest_managed.json using ZooKeeperStorageIO:path=/configs/conf1
   [junit4]   2> 374554 INFO  (coreLoadExecutor-1323-thread-1-processing-n:127.0.0.1:51062_) [n:127.0.0.1:51062_ c:control_collection s:shard1 r:core_node1 x:collection1] o.a.s.r.ManagedResourceStorage No data found for znode /configs/conf1/_rest_managed.json
   [junit4]   2> 374554 INFO  (coreLoadExecutor-1323-thread-1-processing-n:127.0.0.1:51062_) [n:127.0.0.1:51062_ c:control_collection s:shard1 r:core_node1 x:collection1] o.a.s.r.ManagedResourceStorage Loaded null at path _rest_managed.json using ZooKeeperStorageIO:path=/configs/conf1
   [junit4]   2> 374554 INFO  (coreLoadExecutor-1323-thread-1-processing-n:127.0.0.1:51062_) [n:127.0.0.1:51062_ c:control_collection s:shard1 r:core_node1 x:collection1] o.a.s.r.RestManager Initializing 0 registered ManagedResources
   [junit4]   2> 374554 INFO  (coreLoadExecutor-1323-thread-1-processing-n:127.0.0.1:51062_) [n:127.0.0.1:51062_ c:control_collection s:shard1 r:core_node1 x:collection1] o.a.s.h.ReplicationHandler Commits will be reserved for  10000
   [junit4]   2> 374554 INFO  (coreLoadExecutor-1323-thread-1-processing-n:127.0.0.1:51062_) [n:127.0.0.1:51062_ c:control_collection s:shard1 r:core_node1 x:collection1] o.a.s.u.UpdateLog Looking up max value of version field to seed version buckets
   [junit4]   2> 374555 INFO  (coreLoadExecutor-1323-thread-1-processing-n:127.0.0.1:51062_) [n:127.0.0.1:51062_ c:control_collection s:shard1 r:core_node1 x:collection1] o.a.s.u.VersionInfo Refreshing highest value of _version_ for 65536 version buckets from index
   [junit4]   2> 374555 INFO  (coreLoadExecutor-1323-thread-1-processing-n:127.0.0.1:51062_) [n:127.0.0.1:51062_ c:control_collection s:shard1 r:core_node1 x:collection1] o.a.s.u.VersionInfo No terms found for _version_, cannot seed version bucket highest value from index
   [junit4]   2> 374555 INFO  (coreLoadExecutor-1323-thread-1-processing-n:127.0.0.1:51062_) [n:127.0.0.1:51062_ c:control_collection s:shard1 r:core_node1 x:collection1] o.a.s.u.UpdateLog Could not find max version in index or recent updates, using new clock 1514965947330330624
   [junit4]   2> 374557 INFO  (coreLoadExecutor-1323-thread-1-processing-n:127.0.0.1:51062_) [n:127.0.0.1:51062_ c:control_collection s:shard1 r:core_node1 x:collection1] o.a.s.u.UpdateLog Took 2.0ms to seed version buckets with highest version 1514965947330330624
   [junit4]   2> 374557 INFO  (coreLoadExecutor-1323-thread-1-processing-n:127.0.0.1:51062_) [n:127.0.0.1:51062_ c:control_collection s:shard1 r:core_node1 x:collection1] o.a.s.c.ZkController watch zkdir /configs/conf1
   [junit4]   2> 374557 INFO  (coreLoadExecutor-1323-thread-1-processing-n:127.0.0.1:51062_) [n:127.0.0.1:51062_ c:control_collection s:shard1 r:core_node1 x:collection1] o.a.s.c.CoreContainer registering core: collection1
   [junit4]   2> 374558 INFO  (searcherExecutor-1324-thread-1-processing-n:127.0.0.1:51062_ x:collection1 s:shard1 c:control_collection r:core_node1) [n:127.0.0.1:51062_ c:control_collection s:shard1 r:core_node1 x:collection1] o.a.s.c.SolrCore [collection1] Registered new searcher Searcher@7d04f6cf[collection1] main{ExitableDirectoryReader(UninvertingDirectoryReader())}
   [junit4]   2> 374560 INFO  (coreZkRegister-1317-thread-1-processing-n:127.0.0.1:51062_ x:collection1 s:shard1 c:control_collection r:core_node1) [n:127.0.0.1:51062_ c:control_collection s:shard1 r:core_node1 x:collection1] o.a.s.c.ZkController Register replica - core:collection1 address:http://127.0.0.1:51062 collection:control_collection shard:shard1
   [junit4]   2> 374562 INFO  (coreZkRegister-1317-thread-1-processing-n:127.0.0.1:51062_ x:collection1 s:shard1 c:control_collection r:core_node1) [n:127.0.0.1:51062_ c:control_collection s:shard1 r:core_node1 x:collection1] o.a.s.c.c.SolrZkClient makePath: /collections/control_collection/leader_elect/shard1/election
   [junit4]   2> 374566 INFO  (coreZkRegister-1317-thread-1-processing-n:127.0.0.1:51062_ x:collection1 s:shard1 c:control_collection r:core_node1) [n:127.0.0.1:51062_ c:control_collection s:shard1 r:core_node1 x:collection1] o.a.s.c.LeaderElector Joined leadership election with path: /collections/control_collection/leader_elect/shard1/election/94685371574648836-core_node1-n_0000000000
   [junit4]   2> 374567 INFO  (coreZkRegister-1317-thread-1-processing-n:127.0.0.1:51062_ x:collection1 s:shard1 c:control_collection r:core_node1) [n:127.0.0.1:51062_ c:control_collection s:shard1 r:core_node1 x:collection1] o.a.s.c.ShardLeaderElectionContext Running the leader process for shard shard1
   [junit4]   2> 374568 INFO  (coreZkRegister-1317-thread-1-processing-n:127.0.0.1:51062_ x:collection1 s:shard1 c:control_collection r:core_node1) [n:127.0.0.1:51062_ c:control_collection s:shard1 r:core_node1 x:collection1] o.a.s.c.ShardLeaderElectionContext Enough replicas found to continue.
   [junit4]   2> 374569 INFO  (OverseerStateUpdate-94685371574648836-127.0.0.1:51062_-n_0000000000) [n:127.0.0.1:51062_    ] o.a.s.c.Overseer processMessage: queueSize: 1, message = {
   [junit4]   2>   "operation":"leader",
   [junit4]   2>   "shard":"shard1",
   [junit4]   2>   "collection":"control_collection"} current state version: 1
   [junit4]   2> 374569 INFO  (coreZkRegister-1317-thread-1-processing-n:127.0.0.1:51062_ x:collection1 s:shard1 c:control_collection r:core_node1) [n:127.0.0.1:51062_ c:control_collection s:shard1 r:core_node1 x:collection1] o.a.s.c.ShardLeaderElectionContext I may be the new leader - try and sync
   [junit4]   2> 374569 INFO  (coreZkRegister-1317-thread-1-processing-n:127.0.0.1:51062_ x:collection1 s:shard1 c:control_collection r:core_node1) [n:127.0.0.1:51062_ c:control_collection s:shard1 r:core_node1 x:collection1] o.a.s.c.SyncStrategy Sync replicas to http://127.0.0.1:51062/collection1/
   [junit4]   2> 374570 INFO  (coreZkRegister-1317-thread-1-processing-n:127.0.0.1:51062_ x:collection1 s:shard1 c:control_collection r:core_node1) [n:127.0.0.1:51062_ c:control_collection s:shard1 r:core_node1 x:collection1] o.a.s.c.SyncStrategy Sync Success - now sync replicas to me
   [junit4]   2> 374570 INFO  (coreZkRegister-1317-thread-1-processing-n:127.0.0.1:51062_ x:collection1 s:shard1 c:control_collection r:core_node1) [n:127.0.0.1:51062_ c:control_collection s:shard1 r:core_node1 x:collection1] o.a.s.c.SyncStrategy http://127.0.0.1:51062/collection1/ has no replicas
   [junit4]   2> 374570 INFO  (coreZkRegister-1317-thread-1-processing-n:127.0.0.1:51062_ x:collection1 s:shard1 c:control_collection r:core_node1) [n:127.0.0.1:51062_ c:control_collection s:shard1 r:core_node1 x:collection1] o.a.s.c.ShardLeaderElectionContext I am the new leader: http://127.0.0.1:51062/collection1/ shard1
   [junit4]   2> 374572 INFO  (coreZkRegister-1317-thread-1-processing-n:127.0.0.1:51062_ x:collection1 s:shard1 c:control_collection r:core_node1) [n:127.0.0.1:51062_ c:control_collection s:shard1 r:core_node1 x:collection1] o.a.s.c.c.SolrZkClient makePath: /collections/control_collection/leaders/shard1
   [junit4]   2> 374574 INFO  (coreZkRegister-1317-thread-1-processing-n:127.0.0.1:51062_ x:collection1 s:shard1 c:control_collection r:core_node1) [n:127.0.0.1:51062_ c:control_collection s:shard1 r:core_node1 x:collection1] o.a.s.c.ShardLeaderElectionContextBase Creating leader registration node
   [junit4]   2> 374576 INFO  (OverseerStateUpdate-94685371574648836-127.0.0.1:51062_-n_0000000000) [n:127.0.0.1:51062_    ] o.a.s.c.Overseer processMessage: queueSize: 1, message = {
   [junit4]   2>   "operation":"leader",
   [junit4]   2>   "shard":"shard1",
   [junit4]   2>   "collection":"control_collection",
   [junit4]   2>   "base_url":"http://127.0.0.1:51062",
   [junit4]   2>   "core":"collection1",
   [junit4]   2>   "state":"active"} current state version: 1
   [junit4]   2> 374681 INFO  (zkCallback-436-thread-3-processing-n:127.0.0.1:51062_) [n:127.0.0.1:51062_    ] o.a.s.c.c.ZkStateReader A cluster state change: WatchedEvent state:SyncConnected type:NodeDataChanged path:/clusterstate.json, has occurred - updating... (live nodes size: 1)
   [junit4]   2> 374681 INFO  (zkCallback-436-thread-2-processing-n:127.0.0.1:51062_) [n:127.0.0.1:51062_    ] o.a.s.c.c.ZkStateReader A cluster state change: WatchedEvent state:SyncConnected type:NodeDataChanged path:/clusterstate.json, has occurred - updating... (live nodes size: 1)
   [junit4]   2> 374697 INFO  (coreZkRegister-1317-thread-1-processing-n:127.0.0.1:51062_ x:collection1 s:shard1 c:control_collection r:core_node1) [n:127.0.0.1:51062_ c:control_collection s:shard1 r:core_node1 x:collection1] o.a.s.c.ZkController We are http://127.0.0.1:51062/collection1/ and leader is http://127.0.0.1:51062/collection1/
   [junit4]   2> 374697 INFO  (coreZkRegister-1317-thread-1-processing-n:127.0.0.1:51062_ x:collection1 s:shard1 c:control_collection r:core_node1) [n:127.0.0.1:51062_ c:control_collection s:shard1 r:core_node1 x:collection1] o.a.s.c.ZkController No LogReplay needed for core=collection1 baseURL=http://127.0.0.1:51062
   [junit4]   2> 374697 INFO  (coreZkRegister-1317-thread-1-processing-n:127.0.0.1:51062_ x:collection1 s:shard1 c:control_collection r:core_node1) [n:127.0.0.1:51062_ c:control_collection s:shard1 r:core_node1 x:collection1] o.a.s.c.ZkController I am the leader, no recovery necessary
   [junit4]   2> 374697 INFO  (coreZkRegister-1317-thread-1-processing-n:127.0.0.1:51062_ x:collection1 s:shard1 c:control_collection r:core_node1) [n:127.0.0.1:51062_ c:control_collection s:shard1 r:core_node1 x:collection1] o.a.s.c.ZkController publishing state=active
   [junit4]   2> 374697 INFO  (coreZkRegister-1317-thread-1-processing-n:127.0.0.1:51062_ x:collection1 s:shard1 c:control_collection r:core_node1) [n:127.0.0.1:51062_ c:control_collection s:shard1 r:core_node1 x:collection1] o.a.s.c.ZkController numShards not found on descriptor - reading it from system property
   [junit4]   2> 374699 INFO  (OverseerStateUpdate-94685371574648836-127.0.0.1:51062_-n_0000000000) [n:127.0.0.1:51062_    ] o.a.s.c.Overseer processMessage: queueSize: 1, message = {
   [junit4]   2>   "core":"collection1",
   [junit4]   2>   "core_node_name":"core_node1",
   [junit4]   2>   "roles":null,
   [junit4]   2>   "base_url":"http://127.0.0.1:51062",
   [junit4]   2>   "node_name":"127.0.0.1:51062_",
   [junit4]   2>   "numShards":"1",
   [junit4]   2>   "state":"active",
   [junit4]   2>   "shard":"shard1",
   [junit4]   2>   "collection":"control_collection",
   [junit4]   2>   "operation":"state"} current state version: 2
   [junit4]   2> 374699 INFO  (OverseerStateUpdate-94685371574648836-127.0.0.1:51062_-n_0000000000) [n:127.0.0.1:51062_    ] o.a.s.c.o.ReplicaMutator Update state numShards=1 message={
   [junit4]   2>   "core":"collection1",
   [junit4]   2>   "core_node_name":"core_node1",
   [junit4]   2>   "roles":null,
   [junit4]   2>   "base_url":"http://127.0.0.1:51062",
   [junit4]   2>   "node_name":"127.0.0.1:51062_",
   [junit4]   2>   "numShards":"1",
   [junit4]   2>   "state":"active",
   [junit4]   2>   "shard":"shard1",
   [junit4]   2>   "collection":"control_collection",
   [junit4]   2>   "operation":"state"}
   [junit4]   2> 374801 INFO  (zkCallback-436-thread-3-processing-n:127.0.0.1:51062_) [n:127.0.0.1:51062_    ] o.a.s.c.c.ZkStateReader A cluster state change: WatchedEvent state:SyncConnected type:NodeDataChanged path:/clusterstate.json, has occurred - updating... (live nodes size: 1)
   [junit4]   2> 374801 INFO  (zkCallback-436-thread-2-processing-n:127.0.0.1:51062_) [n:127.0.0.1:51062_    ] o.a.s.c.c.ZkStateReader A cluster state change: WatchedEvent state:SyncConnected type:NodeDataChanged path:/clusterstate.json, has occurred - updating... (live nodes size: 1)
   [junit4]   2> 374885 INFO  (TEST-SolrCloudExampleTest.testLoadDocsIntoGettingStartedCollection-seed#[24E7A66E8B44A37]) [    ] o.a.s.c.c.SolrZkClient Using default ZkCredentialsProvider
   [junit4]   2> 374887 INFO  (TEST-SolrCloudExampleTest.testLoadDocsIntoGettingStartedCollection-seed#[24E7A66E8B44A37]) [    ] o.a.s.c.c.ConnectionManager Waiting for client to connect to ZooKeeper
   [junit4]   2> 374888 INFO  (zkCallback-438-thread-1) [    ] o.a.s.c.c.ConnectionManager Watcher org.apache.solr.common.cloud.ConnectionManager@2397d3c0 name:ZooKeeperConnection Watcher:127.0.0.1:44208/solr got event WatchedEvent state:SyncConnected type:None path:null path:null type:None
   [junit4]   2> 374888 INFO  (TEST-SolrCloudExampleTest.testLoadDocsIntoGettingStartedCollection-seed#[24E7A66E8B44A37]) [    ] o.a.s.c.c.ConnectionManager Client is connected to ZooKeeper
   [junit4]   2> 374888 INFO  (TEST-SolrCloudExampleTest.testLoadDocsIntoGettingStartedCollection-seed#[24E7A66E8B44A37]) [    ] o.a.s.c.c.SolrZkClient Using default ZkACLProvider
   [junit4]   2> 374888 INFO  (TEST-SolrCloudExampleTest.testLoadDocsIntoGettingStartedCollection-seed#[24E7A66E8B44A37]) [    ] o.a.s.c.c.ZkStateReader Updating cluster state from ZooKeeper... 
   [junit4]   2> 374890 INFO  (TEST-SolrCloudExampleTest.testLoadDocsIntoGettingStartedCollection-seed#[24E7A66E8B44A37]) [    ] o.a.s.c.ChaosMonkey monkey: init - expire sessions:false cause connection loss:false
   [junit4]   2> 375223 INFO  (TEST-SolrCloudExampleTest.testLoadDocsIntoGettingStartedCollection-seed#[24E7A66E8B44A37]) [    ] o.a.s.SolrTestCaseJ4 Writing core.properties file to /x1/jenkins/jenkins-slave/workspace/Lucene-Solr-Tests-trunk-Java8/solr/build/solr-core/test/J1/temp/solr.cloud.SolrCloudExampleTest_24E7A66E8B44A37-001/shard-1-001/cores/collection1
   [junit4]   2> 375224 INFO  (TEST-SolrCloudExampleTest.testLoadDocsIntoGettingStartedCollection-seed#[24E7A66E8B44A37]) [    ] o.a.s.c.AbstractFullDistribZkTestBase create jetty 1 in directory /x1/jenkins/jenkins-slave/workspace/Lucene-Solr-Tests-trunk-Java8/solr/build/solr-core/test/J1/temp/solr.cloud.SolrCloudExampleTest_24E7A66E8B44A37-001/shard-1-001
   [junit4]   2> 375224 INFO  (TEST-SolrCloudExampleTest.testLoadDocsIntoGettingStartedCollection-seed#[24E7A66E8B44A37]) [    ] o.e.j.s.Server jetty-9.2.13.v20150730
   [junit4]   2> 375227 INFO  (TEST-SolrCloudExampleTest.testLoadDocsIntoGettingStartedCollection-seed#[24E7A66E8B44A37]) [    ] o.e.j.s.h.ContextHandler Started o.e.j.s.ServletContextHandler@3680ba87{/,null,AVAILABLE}
   [junit4]   2> 375227 INFO  (TEST-SolrCloudExampleTest.testLoadDocsIntoGettingStartedCollection-seed#[24E7A66E8B44A37]) [    ] o.e.j.s.ServerConnector Started ServerConnector@65f33722{HTTP/1.1}{127.0.0.1:36460}
   [junit4]   2> 375227 INFO  (TEST-SolrCloudExampleTest.testLoadDocsIntoGettingStartedCollection-seed#[24E7A66E8B44A37]) [    ] o.e.j.s.Server Started @378061ms
   [junit4]   2> 375227 INFO  (TEST-SolrCloudExampleTest.testLoadDocsIntoGettingStartedCollection-seed#[24E7A66E8B44A37]) [    ] o.a.s.c.s.e.JettySolrRunner Jetty properties: {solr.data.dir=/x1/jenkins/jenkins-slave/workspace/Lucene-Solr-Tests-trunk-Java8/solr/build/solr-core/test/J1/temp/solr.cloud.SolrCloudExampleTest_24E7A66E8B44A37-001/tempDir-001/jetty1, solrconfig=solrconfig.xml, hostContext=/, hostPort=36460, coreRootDirectory=/x1/jenkins/jenkins-slave/workspace/Lucene-Solr-Tests-trunk-Java8/solr/build/solr-core/test/J1/temp/solr.cloud.SolrCloudExampleTest_24E7A66E8B44A37-001/shard-1-001/cores}
   [junit4]   2> 375228 INFO  (TEST-SolrCloudExampleTest.testLoadDocsIntoGettingStartedCollection-seed#[24E7A66E8B44A37]) [    ] o.a.s.s.SolrDispatchFilter SolrDispatchFilter.init(): sun.misc.Launcher$AppClassLoader@4e0e2f2a
   [junit4]   2> 375228 INFO  (TEST-SolrCloudExampleTest.testLoadDocsIntoGettingStartedCollection-seed#[24E7A66E8B44A37]) [    ] o.a.s.c.SolrResourceLoader new SolrResourceLoader for directory: '/x1/jenkins/jenkins-slave/workspace/Lucene-Solr-Tests-trunk-Java8/solr/build/solr-core/test/J1/temp/solr.cloud.SolrCloudExampleTest_24E7A66E8B44A37-001/shard-1-001/'
   [junit4]   2> 375232 INFO  (TEST-SolrCloudExampleTest.testLoadDocsIntoGettingStartedCollection-seed#[24E7A66E8B44A37]) [    ] o.a.s.c.SolrResourceLoader JNDI not configured for solr (NoInitialContextEx)
   [junit4]   2> 375232 INFO  (TEST-SolrCloudExampleTest.testLoadDocsIntoGettingStartedCollection-seed#[24E7A66E8B44A37]) [    ] o.a.s.c.SolrResourceLoader solr home defaulted to 'solr/' (could not find system property or JNDI)
   [junit4]   2> 375250 INFO  (TEST-SolrCloudExampleTest.testLoadDocsIntoGettingStartedCollection-seed#[24E7A66E8B44A37]) [    ] o.a.s.c.c.SolrZkClient Using default ZkCredentialsProvider
   [junit4]   2> 375252 INFO  (TEST-SolrCloudExampleTest.testLoadDocsIntoGettingStartedCollection-seed#[24E7A66E8B44A37]) [    ] o.a.s.c.c.ConnectionManager Waiting for client to connect to ZooKeeper
   [junit4]   2> 375252 INFO  (zkCallback-439-thread-1) [    ] o.a.s.c.c.ConnectionManager Watcher org.apache.solr.common.cloud.ConnectionManager@224216e3 name:ZooKeeperConnection Watcher:127.0.0.1:44208/solr got event WatchedEvent state:SyncConnected type:None path:null path:null type:None
   [junit4]   2> 375252 INFO  (TEST-SolrCloudExampleTest.testLoadDocsIntoGettingStartedCollection-seed#[24E7A66E8B44A37]) [    ] o.a.s.c.c.ConnectionManager Client is connected to ZooKeeper
   [junit4]   2> 375253 INFO  (TEST-SolrCloudExampleTest.testLoadDocsIntoGettingStartedCollection-seed#[24E7A66E8B44A37]) [    ] o.a.s.c.c.SolrZkClient Using default ZkACLProvider
   [junit4]   2> 375254 INFO  (TEST-SolrCloudExampleTest.testLoadDocsIntoGettingStartedCollection-seed#[24E7A66E8B44A37]) [    ] o.a.s.s.SolrDispatchFilter Loading solr.xml from SolrHome (not found in ZooKeeper)
   [junit4]   2> 375254 INFO  (TEST-SolrCloudExampleTest.testLoadDocsIntoGettingStartedCollection-seed#[24E7A66E8B44A37]) [    ] o.a.s.c.SolrXmlConfig Loading container configuration from /x1/jenkins/jenkins-slave/workspace/Lucene-Solr-Tests-trunk-Java8/solr/build/solr-core/test/J1/temp/solr.cloud.SolrCloudExampleTest_24E7A66E8B44A37-001/shard-1-001/solr.xml
   [junit4]   2> 375258 INFO  (TEST-SolrCloudExampleTest.testLoadDocsIntoGettingStartedCollection-seed#[24E7A66E8B44A37]) [    ] o.a.s.c.CoresLocator Config-defined core root directory: /x1/jenkins/jenkins-slave/workspace/Lucene-Solr-Tests-trunk-Java8/solr/build/solr-core/test/J1/temp/solr.cloud.SolrCloudExampleTest_24E7A66E8B44A37-001/shard-1-001/cores
   [junit4]   2> 375259 INFO  (TEST-SolrCloudExampleTest.testLoadDocsIntoGettingStartedCollection-seed#[24E7A66E8B44A37]) [    ] o.a.s.c.CoreContainer New CoreContainer 1053418876
   [junit4]   2> 375259 INFO  (TEST-SolrCloudExampleTest.testLoadDocsIntoGettingStartedCollection-seed#[24E7A66E8B44A37]) [    ] o.a.s.c.CoreContainer Loading cores into CoreContainer [instanceDir=/x1/jenkins/jenkins-slave/workspace/Lucene-Solr-Tests-trunk-Java8/solr/build/solr-core/test/J1/temp/solr.cloud.SolrCloudExampleTest_24E7A66E8B44A37-001/shard-1-001/]
   [junit4]   2> 375259 INFO  (TEST-SolrCloudExampleTest.testLoadDocsIntoGettingStartedCollection-seed#[24E7A66E8B44A37]) [    ] o.a.s.c.CoreContainer loading shared library: /x1/jenkins/jenkins-slave/workspace/Lucene-Solr-Tests-trunk-Java8/solr/build/solr-core/test/J1/temp/solr.cloud.SolrCloudExampleTest_24E7A66E8B44A37-001/shard-1-001/lib
   [junit4]   2> 375259 WARN  (TEST-SolrCloudExampleTest.testLoadDocsIntoGettingStartedCollection-seed#[24E7A66E8B44A37]) [    ] o.a.s.c.SolrResourceLoader Can't find (or read) directory to add to classloader: lib (resolved as: /x1/jenkins/jenkins-slave/workspace/Lucene-Solr-Tests-trunk-Java8/solr/build/solr-core/test/J1/temp/solr.cloud.SolrCloudExampleTest_24E7A66E8B44A37-001/shard-1-001/lib).
   [junit4]   2> 375266 INFO  (TEST-SolrCloudExampleTest.testLoadDocsIntoGettingStartedCollection-seed#[24E7A66E8B44A37]) [    ] o.a.s.h.c.HttpShardHandlerFactory created with socketTimeout : 90000,urlScheme : ,connTimeout : 15000,maxConnectionsPerHost : 20,maxConnections : 10000,corePoolSize : 0,maximumPoolSize : 2147483647,maxThreadIdleTime : 5,sizeOfQueue : -1,fairnessPolicy : false,useRetries : false,
   [junit4]   2> 375268 INFO  (TEST-SolrCloudExampleTest.testLoadDocsIntoGettingStartedCollection-seed#[24E7A66E8B44A37]) [    ] o.a.s.u.UpdateShardHandler Creating UpdateShardHandler HTTP client with params: socketTimeout=340000&connTimeout=45000&retry=true
   [junit4]   2> 375268 INFO  (TEST-SolrCloudExampleTest.testLoadDocsIntoGettingStartedCollection-seed#[24E7A66E8B44A37]) [    ] o.a.s.l.LogWatcher SLF4J impl is org.slf4j.impl.Log4jLoggerFactory
   [junit4]   2> 375268 INFO  (TEST-SolrCloudExampleTest.testLoadDocsIntoGettingStartedCollection-seed#[24E7A66E8B44A37]) [    ] o.a.s.l.LogWatcher Registering Log Listener [Log4j (org.slf4j.impl.Log4jLoggerFactory)]
   [junit4]   2> 375268 INFO  (TEST-SolrCloudExampleTest.testLoadDocsIntoGettingStartedCollection-seed#[24E7A66E8B44A37]) [    ] o.a.s.c.ZkContainer Zookeeper client=127.0.0.1:44208/solr
   [junit4]   2> 375268 INFO  (TEST-SolrCloudExampleTest.testLoadDocsIntoGettingStartedCollection-seed#[24E7A66E8B44A37]) [    ] o.a.s.c.ZkController zkHost includes chroot
   [junit4]   2> 375268 INFO  (TEST-SolrCloudExampleTest.testLoadDocsIntoGettingStartedCollection-seed#[24E7A66E8B44A37]) [    ] o.a.s.c.c.SolrZkClient Using default ZkCredentialsProvider
   [junit4]   2> 375270 INFO  (TEST-SolrCloudExampleTest.testLoadDocsIntoGettingStartedCollection-seed#[24E7A66E8B44A37]) [    ] o.a.s.c.c.ConnectionManager Waiting for client to connect to ZooKeeper
   [junit4]   2> 375270 INFO  (zkCallback-441-thread-1) [    ] o.a.s.c.c.ConnectionManager Watcher org.apache.solr.common.cloud.ConnectionManager@2855c678 name:ZooKeeperConnection Watcher:127.0.0.1:44208 got event WatchedEvent state:SyncConnected type:None path:null path:null type:None
   [junit4]   2> 375271 INFO  (TEST-SolrCloudExampleTest.testLoadDocsIntoGettingStartedCollection-seed#[24E7A66E8B44A37]) [    ] o.a.s.c.c.ConnectionManager Client is connected to ZooKeeper
   [junit4]   2> 375271 INFO  (TEST-SolrCloudExampleTest.testLoadDocsIntoGettingStartedCollection-seed#[24E7A66E8B44A37]) [    ] o.a.s.c.c.SolrZkClient Using default ZkACLProvider
   [junit4]   2> 375277 INFO  (TEST-SolrCloudExampleTest.testLoadDocsIntoGettingStartedCollection-seed#[24E7A66E8B44A37]) [n:127.0.0.1:36460_    ] o.a.s.c.c.ConnectionManager Waiting for client to connect to ZooKeeper
   [junit4]   2> 375277 INFO  (zkCallback-442-thread-1-processing-n:127.0.0.1:36460_) [n:127.0.0.1:36460_    ] o.a.s.c.c.ConnectionManager Watcher org.apache.solr.common.cloud.ConnectionManager@77df6a53 name:ZooKeeperConnection Watcher:127.0.0.1:44208/solr got event WatchedEvent state:SyncConnected type:None path:null path:null type:None
   [junit4]   2> 375277 INFO  (TEST-SolrCloudExampleTest.testLoadDocsIntoGettingStartedCollection-seed#[24E7A66E8B44A37]) [n:127.0.0.1:36460_    ] o.a.s.c.c.ConnectionManager Client is connected to ZooKeeper
   [junit4]   2> 375282 INFO  (TEST-SolrCloudExampleTest.testLoadDocsIntoGettingStartedCollection-seed#[24E7A66E8B44A37]) [n:127.0.0.1:36460_    ] o.a.s.c.c.ZkStateReader Updating cluster state from ZooKeeper... 
   [junit4]   2> 376286 INFO  (TEST-SolrCloudExampleTest.testLoadDocsIntoGettingStartedCollection-seed#[24E7A66E8B44A37]) [n:127.0.0.1:36460_    ] o.a.s.c.ZkController Register node as live in ZooKeeper:/live_nodes/127.0.0.1:36460_
   [junit4]   2> 376286 INFO  (TEST-SolrCloudExampleTest.testLoadDocsIntoGettingStartedCollection-seed#[24E7A66E8B44A37]) [n:127.0.0.1:36460_    ] o.a.s.c.c.SolrZkClient makePath: /live_nodes/127.0.0.1:36460_
   [junit4]   2> 376287 INFO  (zkCallback-438-thread-1) [    ] o.a.s.c.c.ZkStateReader A live node change: WatchedEvent state:SyncConnected type:NodeChildrenChanged path:/live_nodes, has occurred - updating... (live nodes size: 1)
   [junit4]   2> 376287 INFO  (zkCallback-436-thread-3-processing-n:127.0.0.1:51062_) [n:127.0.0.1:51062_    ] o.a.s.c.c.ZkStateReader A live node change: WatchedEvent state:SyncConnected type:NodeChildrenChanged path:/live_nodes, has occurred - updating... (live nodes size: 1)
   [junit4]   2> 376287 INFO  (zkCallback-436-thread-2-processing-n:127.0.0.1:51062_) [n:127.0.0.1:51062_    ] o.a.s.c.c.ZkStateReader A live node change: WatchedEvent state:SyncConnected type:NodeChildrenChanged path:/live_nodes, has occurred - updating... (live nodes size: 1)
   [junit4]   2> 376288 INFO  (zkCallback-442-thread-1-processing-n:127.0.0.1:36460_) [n:127.0.0.1:36460_    ] o.a.s.c.c.ZkStateReader A live node change: WatchedEvent state:SyncConnected type:NodeChildrenChanged path:/live_nodes, has occurred - updating... (live nodes size: 1)
   [junit4]   2> 376289 INFO  (TEST-SolrCloudExampleTest.testLoadDocsIntoGettingStartedCollection-seed#[24E7A66E8B44A37]) [n:127.0.0.1:36460_    ] o.a.s.c.Overseer Overseer (id=null) closing
   [junit4]   2> 376289 INFO  (TEST-SolrCloudExampleTest.testLoadDocsIntoGettingStartedCollection-seed#[24E7A66E8B44A37]) [n:127.0.0.1:36460_    ] o.a.s.c.LeaderElector Joined leadership election with path: /overseer_elect/election/94685371574648840-127.0.0.1:36460_-n_0000000001
   [junit4]   2> 376290 INFO  (TEST-SolrCloudExampleTest.testLoadDocsIntoGettingStartedCollection-seed#[24E7A66E8B44A37]) [n:127.0.0.1:36460_    ] o.a.s.c.LeaderElector Watching path /overseer_elect/election/94685371574648836-127.0.0.1:51062_-n_0000000000 to know if I could be the leader
   [junit4]   2> 376300 INFO  (TEST-SolrCloudExampleTest.testLoadDocsIntoGettingStartedCollection-seed#[24E7A66E8B44A37]) [n:127.0.0.1:36460_    ] o.a.s.c.CoreContainer Security conf doesn't exist. Skipping setup for authorization module.
   [junit4]   2> 376300 INFO  (TEST-SolrCloudExampleTest.testLoadDocsIntoGettingStartedCollection-seed#[24E7A66E8B44A37]) [n:127.0.0.1:36460_    ] o.a.s.c.CoreContainer No authentication plugin used.
   [junit4]   2> 376301 INFO  (TEST-SolrCloudExampleTest.testLoadDocsIntoGettingStartedCollection-seed#[24E7A66E8B44A37]) [n:127.0.0.1:36460_    ] o.a.s.c.CoresLocator Looking for core definitions underneath /x1/jenkins/jenkins-slave/workspace/Lucene-Solr-Tests-trunk-Java8/solr/build/solr-core/test/J1/temp/solr.cloud.SolrCloudExampleTest_24E7A66E8B44A37-001/shard-1-001/cores
   [junit4]   2> 376302 INFO  (TEST-SolrCloudExampleTest.testLoadDocsIntoGettingStartedCollection-seed#[24E7A66E8B44A37]) [n:127.0.0.1:36460_    ] o.a.s.c.SolrCore Created CoreDescriptor: {name=collection1, config=solrconfig.xml, transient=false, schema=schema.xml, loadOnStartup=true, configSetProperties=configsetprops.json, instanceDir=/x1/jenkins/jenkins-slave/workspace/Lucene-Solr-Tests-trunk-Java8/solr/build/solr-core/test/J1/temp/solr.cloud.SolrCloudExampleTest_24E7A66E8B44A37-001/shard-1-001/cores/collection1, collection=collection1, absoluteInstDir=/x1/jenkins/jenkins-slave/workspace/Lucene-Solr-Tests-trunk-Java8/solr/build/solr-core/test/J1/temp/solr.cloud.SolrCloudExampleTest_24E7A66E8B44A37-001/shard-1-001/cores/collection1/, coreNodeName=, dataDir=data/, shard=}
   [junit4]   2> 376302 INFO  (TEST-SolrCloudExampleTest.testLoadDocsIntoGettingStartedCollection-seed#[24E7A66E8B44A37]) [n:127.0.0.1:36460_    ] o.a.s.c.CoresLocator Found core collection1 in /x1/jenkins/jenkins-slave/workspace/Lucene-Solr-Tests-trunk-Java8/solr/build/solr-core/test/J1/temp/solr.cloud.SolrCloudExampleTest_24E7A66E8B44A37-001/shard-1-001/cores/collection1/
   [junit4]   2> 376302 INFO  (TEST-SolrCloudExampleTest.testLoadDocsIntoGettingStartedCollection-seed#[24E7A66E8B44A37]) [n:127.0.0.1:36460_    ] o.a.s.c.CoresLocator Found 1 core definitions
   [junit4]   2> 376303 INFO  (coreLoadExecutor-1334-thread-1-processing-n:127.0.0.1:36460_) [n:127.0.0.1:36460_ c:collection1   x:collection1] o.a.s.c.ZkController publishing state=down
   [junit4]   2> 376303 INFO  (coreLoadExecutor-1334-thread-1-processing-n:127.0.0.1:36460_) [n:127.0.0.1:36460_ c:collection1   x:collection1] o.a.s.c.ZkController numShards not found on descriptor - reading it from system property
   [junit4]   2> 376305 INFO  (OverseerStateUpdate-94685371574648836-127.0.0.1:51062_-n_0000000000) [n:127.0.0.1:51062_    ] o.a.s.c.Overseer processMessage: queueSize: 1, message = {
   [junit4]   2>   "core":"collection1",
   [junit4]   2>   "roles":null,
   [junit4]   2>   "base_url":"http://127.0.0.1:36460",
   [junit4]   2>   "node_name":"127.0.0.1:36460_",
   [junit4]   2>   "numShards":"2",
   [junit4]   2>   "state":"down",
   [junit4]   2>   "shard":null,
   [junit4]   2>   "collection":"collection1",
   [junit4]   2>   "operation":"state"} current state version: 3
   [junit4]   2> 376305 INFO  (coreLoadExecutor-1334-thread-1-processing-n:127.0.0.1:36460_) [n:127.0.0.1:36460_ c:collection1   x:collection1] o.a.s.c.ZkController look for our core node name
   [junit4]   2> 376306 INFO  (OverseerStateUpdate-94685371574648836-127.0.0.1:51062_-n_0000000000) [n:127.0.0.1:51062_    ] o.a.s.c.o.ReplicaMutator Update state numShards=2 message={
   [junit4]   2>   "core":"collection1",
   [junit4]   2>   "roles":null,
   [junit4]   2>   "base_url":"http://127.0.0.1:36460",
   [junit4]   2>   "node_name":"127.0.0.1:36460_",
   [junit4]   2>   "numShards":"2",
   [junit4]   2>   "state":"down",
   [junit4]   2>   "shard":null,
   [junit4]   2>   "collection":"collection1",
   [junit4]   2>   "operation":"state"}
   [junit4]   2> 376306 INFO  (OverseerStateUpdate-94685371574648836-127.0.0.1:51062_-n_0000000000) [n:127.0.0.1:51062_    ] o.a.s.c.o.ClusterStateMutator building a new cName: collection1
   [junit4]   2> 376306 INFO  (OverseerStateUpdate-94685371574648836-127.0.0.1:51062_-n_0000000000) [n:127.0.0.1:51062_    ] o.a.s.c.o.ReplicaMutator Assigning new node to shard shard=shard2
   [junit4]   2> 376307 INFO  (zkCallback-438-thread-1) [    ] o.a.s.c.c.ZkStateReader A cluster state change: WatchedEvent state:SyncConnected type:NodeDataChanged path:/clusterstate.json, has occurred - updating... (live nodes size: 2)
   [junit4]   2> 376307 INFO  (zkCallback-442-thread-1-processing-n:127.0.0.1:36460_) [n:127.0.0.1:36460_    ] o.a.s.c.c.ZkStateReader A cluster state change: WatchedEvent state:SyncConnected type:NodeDataChanged path:/clusterstate.json, has occurred - updating... (live nodes size: 2)
   [junit4]   2> 376308 INFO  (zkCallback-436-thread-2-processing-n:127.0.0.1:51062_) [n:127.0.0.1:51062_    ] o.a.s.c.c.ZkStateReader A cluster state change: WatchedEvent state:SyncConnected type:NodeDataChanged path:/clusterstate.json, has occurred - updating... (live nodes size: 2)
   [junit4]   2> 376308 INFO  (zkCallback-436-thread-3-processing-n:127.0.0.1:51062_) [n:127.0.0.1:51062_    ] o.a.s.c.c.ZkStateReader A cluster state change: WatchedEvent state:SyncConnected type:NodeDataChanged path:/clusterstate.json, has occurred - updating... (live nodes size: 2)
   [junit4]   2> 376312 INFO  (TEST-SolrCloudExampleTest.testLoadDocsIntoGettingStartedCollection-seed#[24E7A66E8B44A37]) [n:127.0.0.1:36460_    ] o.a.s.s.SolrDispatchFilter user.dir=/x1/jenkins/jenkins-slave/workspace/Lucene-Solr-Tests-trunk-Java8/solr/build/solr-core/test/J1
   [junit4]   2> 376312 INFO  (TEST-SolrCloudExampleTest.testLoadDocsIntoGettingStartedCollection-seed#[24E7A66E8B44A37]) [n:127.0.0.1:36460_    ] o.a.s.s.SolrDispatchFilter SolrDispatchFilter.init() done
   [junit4]   2> 377306 INFO  (coreLoadExecutor-1334-thread-1-processing-n:127.0.0.1:36460_) [n:127.0.0.1:36460_ c:collection1   x:collection1] o.a.s.c.ZkController waiting to find shard id in clusterstate for collection1
   [junit4]   2> 377306 INFO  (coreLoadExecutor-1334-thread-1-processing-n:127.0.0.1:36460_) [n:127.0.0.1:36460_ c:collection1   x:collection1] o.a.s.c.ZkController Check for collection zkNode:collection1
   [junit4]   2> 377306 INFO  (coreLoadExecutor-1334-thread-1-processing-n:127.0.0.1:36460_) [n:127.0.0.1:36460_ c:collection1   x:collection1] o.a.s.c.ZkController Collection zkNode exists
   [junit4]   2> 377306 INFO  (coreLoadExecutor-1334-thread-1-processing-n:127.0.0.1:36460_) [n:127.0.0.1:36460_ c:collection1   x:collection1] o.a.s.c.c.ZkStateReader Load collection config from:/collections/collection1
   [junit4]   2> 377308 INFO  (coreLoadExecutor-1334-thread-1-processing-n:127.0.0.1:36460_) [n:127.0.0.1:36460_ c:collection1   x:collection1] o.a.s.c.c.ZkStateReader path=/collections/collection1 configName=conf1 specified config exists in ZooKeeper
   [junit4]   2> 377308 INFO  (coreLoadExecutor-1334-thread-1-processing-n:127.0.0.1:36460_) [n:127.0.0.1:36460_ c:collection1   x:collection1] o.a.s.c.SolrResourceLoader new SolrResourceLoader for directory: '/x1/jenkins/jenkins-slave/workspace/Lucene-Solr-Tests-trunk-Java8/solr/build/solr-core/test/J1/temp/solr.cloud.SolrCloudExampleTest_24E7A66E8B44A37-001/shard-1-001/cores/collection1/'
   [junit4]   2> 377308 INFO  (coreLoadExecutor-1334-thread-1-processing-n:127.0.0.1:36460_) [n:127.0.0.1:36460_ c:collection1   x:collection1] o.a.s.c.SolrResourceLoader JNDI not configured for solr (NoInitialContextEx)
   [junit4]   2> 377308 INFO  (coreLoadExecutor-1334-thread-1-processing-n:127.0.0.1:36460_) [n:127.0.0.1:36460_ c:collection1   x:collection1] o.a.s.c.SolrResourceLoader solr home defaulted to 'solr/' (could not find system property or JNDI)
   [junit4]   2> 377325 INFO  (coreLoadExecutor-1334-thread-1-processing-n:127.0.0.1:36460_) [n:127.0.0.1:36460_ c:collection1   x:collection1] o.a.s.c.Config loaded config solrconfig.xml with version 0 
   [junit4]   2> 377329 INFO  (coreLoadExecutor-1334-thread-1-processing-n:127.0.0.1:36460_) [n:127.0.0.1:36460_ c:collection1   x:collection1] o.a.s.c.SolrConfig current version of requestparams : -1
   [junit4]   2> 377333 INFO  (coreLoadExecutor-1334-thread-1-processing-n:127.0.0.1:36460_) [n:127.0.0.1:36460_ c:collection1   x:collection1] o.a.s.c.SolrConfig Using Lucene MatchVersion: 6.0.0
   [junit4]   2> 377345 INFO  (coreLoadExecutor-1334-thread-1-processing-n:127.0.0.1:36460_) [n:127.0.0.1:36460_ c:collection1   x:collection1] o.a.s.c.Config Loaded SolrConfig: solrconfi

[...truncated too long message...]

NFO  (zkCallback-455-thread-2-processing-n:127.0.0.1:52135_) [n:127.0.0.1:52135_ c:collection1 s:shard1 r:core_node4 x:collection1] o.a.s.c.CachingDirectoryFactory Closing directory: /x1/jenkins/jenkins-slave/workspace/Lucene-Solr-Tests-trunk-Java8/solr/build/solr-core/test/J1/../../../../../../../../../../x1/jenkins/jenkins-slave/workspace/Lucene-Solr-Tests-trunk-Java8/solr/build/solr-core/test/J1/temp/solr.cloud.SolrCloudExampleTest_24E7A66E8B44A37-001/shard-4-001/cores/collection1/data/index
   [junit4]   2> 417551 INFO  (zkCallback-455-thread-2-processing-n:127.0.0.1:52135_) [n:127.0.0.1:52135_ c:collection1 s:shard1 r:core_node4 x:collection1] o.a.s.c.ShardLeaderElectionContextBase No version found for ephemeral leader parent node, won't remove previous leader registration.
   [junit4]   2> 417551 INFO  (zkCallback-455-thread-2-processing-n:127.0.0.1:52135_) [n:127.0.0.1:52135_ c:collection1 s:shard1 r:core_node4 x:collection1] o.a.s.c.ElectionContext Canceling election /collections/collection1/leader_elect/shard1/election/94685371574648849-core_node4-n_0000000001
   [junit4]   2> 417551 WARN  (zkCallback-455-thread-2-processing-n:127.0.0.1:52135_) [n:127.0.0.1:52135_ c:collection1 s:shard1 r:core_node4 x:collection1] o.a.s.c.LeaderElector 
   [junit4]   2> org.apache.zookeeper.KeeperException$SessionExpiredException: KeeperErrorCode = Session expired for /collections/collection1/leader_elect/shard1/election/94685371574648849-core_node4-n_0000000001
   [junit4]   2> 	at org.apache.zookeeper.KeeperException.create(KeeperException.java:127)
   [junit4]   2> 	at org.apache.zookeeper.KeeperException.create(KeeperException.java:51)
   [junit4]   2> 	at org.apache.zookeeper.ZooKeeper.delete(ZooKeeper.java:873)
   [junit4]   2> 	at org.apache.solr.common.cloud.SolrZkClient$2.execute(SolrZkClient.java:244)
   [junit4]   2> 	at org.apache.solr.common.cloud.SolrZkClient$2.execute(SolrZkClient.java:241)
   [junit4]   2> 	at org.apache.solr.common.cloud.ZkCmdExecutor.retryOperation(ZkCmdExecutor.java:61)
   [junit4]   2> 	at org.apache.solr.common.cloud.SolrZkClient.delete(SolrZkClient.java:241)
   [junit4]   2> 	at org.apache.solr.cloud.ElectionContext.cancelElection(ElectionContext.java:85)
   [junit4]   2> 	at org.apache.solr.cloud.ShardLeaderElectionContextBase.cancelElection(ElectionContext.java:166)
   [junit4]   2> 	at org.apache.solr.cloud.ShardLeaderElectionContext.cancelElection(ElectionContext.java:267)
   [junit4]   2> 	at org.apache.solr.cloud.ShardLeaderElectionContext.runLeaderProcess(ElectionContext.java:449)
   [junit4]   2> 	at org.apache.solr.cloud.LeaderElector.runIamLeaderProcess(LeaderElector.java:197)
   [junit4]   2> 	at org.apache.solr.cloud.LeaderElector.checkIfIamLeader(LeaderElector.java:157)
   [junit4]   2> 	at org.apache.solr.cloud.LeaderElector.access$200(LeaderElector.java:58)
   [junit4]   2> 	at org.apache.solr.cloud.LeaderElector$ElectionWatcher.process(LeaderElector.java:388)
   [junit4]   2> 	at org.apache.solr.common.cloud.SolrZkClient$3$1.run(SolrZkClient.java:269)
   [junit4]   2> 	at java.util.concurrent.Executors$RunnableAdapter.call(Executors.java:511)
   [junit4]   2> 	at java.util.concurrent.FutureTask.run(FutureTask.java:266)
   [junit4]   2> 	at org.apache.solr.common.util.ExecutorUtil$MDCAwareThreadPoolExecutor$1.run(ExecutorUtil.java:231)
   [junit4]   2> 	at java.util.concurrent.ThreadPoolExecutor.runWorker(ThreadPoolExecutor.java:1142)
   [junit4]   2> 	at java.util.concurrent.ThreadPoolExecutor$Worker.run(ThreadPoolExecutor.java:617)
   [junit4]   2> 	at java.lang.Thread.run(Thread.java:745)
   [junit4]   2> 417556 INFO  (TEST-SolrCloudExampleTest.testLoadDocsIntoGettingStartedCollection-seed#[24E7A66E8B44A37]) [    ] o.e.j.s.ServerConnector Stopped ServerConnector@7dcb1e69{HTTP/1.1}{127.0.0.1:0}
   [junit4]   2> 417557 INFO  (TEST-SolrCloudExampleTest.testLoadDocsIntoGettingStartedCollection-seed#[24E7A66E8B44A37]) [    ] o.e.j.s.h.ContextHandler Stopped o.e.j.s.ServletContextHandler@198c84b{/,null,UNAVAILABLE}
   [junit4]   2> 417559 INFO  (TEST-SolrCloudExampleTest.testLoadDocsIntoGettingStartedCollection-seed#[24E7A66E8B44A37]) [n:127.0.0.1:52135_ c:collection1 s:shard1 r:core_node4 x:collection1] o.a.s.c.ZkTestServer connecting to 127.0.0.1:44208 44208
   [junit4]   2> 417734 INFO  (Thread-1169) [    ] o.a.s.c.ZkTestServer connecting to 127.0.0.1:44208 44208
   [junit4]   2> 417735 WARN  (Thread-1169) [    ] o.a.s.c.ZkTestServer Watch limit violations: 
   [junit4]   2> Maximum concurrent create/delete watches above limit:
   [junit4]   2> 
   [junit4]   2> 	11	/solr/configs/gettingstarted/managed-schema
   [junit4]   2> 	10	/solr/aliases.json
   [junit4]   2> 	9	/solr/configs/gettingstarted
   [junit4]   2> 	6	/solr/security.json
   [junit4]   2> 	5	/solr/configs/conf1
   [junit4]   2> 
   [junit4]   2> Maximum concurrent data watches above limit:
   [junit4]   2> 
   [junit4]   2> 	25	/solr/clusterstate.json
   [junit4]   2> 	4	/solr/collections/gettingstarted/state.json
   [junit4]   2> 
   [junit4]   2> Maximum concurrent children watches above limit:
   [junit4]   2> 
   [junit4]   2> 	14	/solr/live_nodes
   [junit4]   2> 	12	/solr/collections
   [junit4]   2> 	5	/solr/overseer/collection-queue-work
   [junit4]   2> 	4	/solr/overseer/queue
   [junit4]   2> 	3	/solr/overseer/queue-work
   [junit4]   2> 
   [junit4]   2> NOTE: reproduce with: ant test  -Dtestcase=SolrCloudExampleTest -Dtests.method=testLoadDocsIntoGettingStartedCollection -Dtests.seed=24E7A66E8B44A37 -Dtests.multiplier=2 -Dtests.slow=true -Dtests.locale=en_GB -Dtests.timezone=Africa/Mbabane -Dtests.asserts=true -Dtests.file.encoding=UTF-8
   [junit4] FAILURE 45.2s J1 | SolrCloudExampleTest.testLoadDocsIntoGettingStartedCollection <<<
   [junit4]    > Throwable #1: java.lang.AssertionError: Delete action failed!
   [junit4]    > 	at __randomizedtesting.SeedInfo.seed([24E7A66E8B44A37:112D4809D9DBF391]:0)
   [junit4]    > 	at org.apache.solr.cloud.SolrCloudExampleTest.doTestDeleteAction(SolrCloudExampleTest.java:169)
   [junit4]    > 	at org.apache.solr.cloud.SolrCloudExampleTest.testLoadDocsIntoGettingStartedCollection(SolrCloudExampleTest.java:145)
   [junit4]    > 	at org.apache.solr.BaseDistributedSearchTestCase$ShardsRepeatRule$ShardsFixedStatement.callStatement(BaseDistributedSearchTestCase.java:963)
   [junit4]    > 	at org.apache.solr.BaseDistributedSearchTestCase$ShardsRepeatRule$ShardsStatement.evaluate(BaseDistributedSearchTestCase.java:938)
   [junit4]    > 	at java.lang.Thread.run(Thread.java:745)
   [junit4]   2> 417745 INFO  (SUITE-SolrCloudExampleTest-seed#[24E7A66E8B44A37]-worker) [n:127.0.0.1:52135_ c:collection1 s:shard1 r:core_node4 x:collection1] o.a.s.SolrTestCaseJ4 ###deleteCore
   [junit4]   2> NOTE: leaving temporary files on disk at: /x1/jenkins/jenkins-slave/workspace/Lucene-Solr-Tests-trunk-Java8/solr/build/solr-core/test/J1/temp/solr.cloud.SolrCloudExampleTest_24E7A66E8B44A37-001
   [junit4]   2> Oct 13, 2015 8:55:57 PM com.carrotsearch.randomizedtesting.ThreadLeakControl checkThreadLeaks
   [junit4]   2> WARNING: Will linger awaiting termination of 1 leaked thread(s).
   [junit4]   2> NOTE: test params are: codec=Asserting(Lucene53): {}, docValues:{}, sim=RandomSimilarityProvider(queryNorm=false,coord=crazy): {}, locale=en_GB, timezone=Africa/Mbabane
   [junit4]   2> NOTE: Linux 3.13.0-52-generic amd64/Oracle Corporation 1.8.0_45 (64-bit)/cpus=4,threads=1,free=170661200,total=516947968
   [junit4]   2> NOTE: All tests run in this JVM: [TestCustomDocTransformer, MultiTermTest, MinimalSchemaTest, TestDistribIDF, TestConfigOverlay, SchemaVersionSpecificBehaviorTest, HdfsCollectionsAPIDistributedZkTest, IgnoreCommitOptimizeUpdateProcessorFactoryTest, TestNRTOpen, CollectionReloadTest, FastVectorHighlighterTest, TestStressVersions, RequestLoggingTest, TestSuggestSpellingConverter, TestMiniSolrCloudClusterSSL, TestLeaderElectionZkExpiry, URLClassifyProcessorTest, BlockCacheTest, TestCryptoKeys, SolrPluginUtilsTest, SpellCheckCollatorTest, TestSolrQueryParserResource, DistanceFunctionTest, OpenCloseCoreStressTest, SpellPossibilityIteratorTest, TestDistributedGrouping, TestTrie, TestCodecSupport, TestSchemaManager, CustomCollectionTest, TestComplexPhraseQParserPlugin, TestFreeTextSuggestions, SliceStateTest, TestBlendedInfixSuggestions, DistribCursorPagingTest, SimplePostToolTest, ClusterStateUpdateTest, HdfsRecoverLeaseTest, TestReloadAndDeleteDocs, TestFastOutputStream, TestAnalyzeInfixSuggestions, DistributedQueueTest, TestMacros, TestTolerantSearch, SpatialFilterTest, SolrCloudExampleTest]
   [junit4] Completed [133/552] on J1 in 46.03s, 1 test, 1 failure <<< FAILURES!

[...truncated 1324 lines...]
BUILD FAILED
/x1/jenkins/jenkins-slave/workspace/Lucene-Solr-Tests-trunk-Java8/build.xml:775: The following error occurred while executing this line:
/x1/jenkins/jenkins-slave/workspace/Lucene-Solr-Tests-trunk-Java8/build.xml:719: The following error occurred while executing this line:
/x1/jenkins/jenkins-slave/workspace/Lucene-Solr-Tests-trunk-Java8/build.xml:59: The following error occurred while executing this line:
/x1/jenkins/jenkins-slave/workspace/Lucene-Solr-Tests-trunk-Java8/solr/build.xml:233: The following error occurred while executing this line:
/x1/jenkins/jenkins-slave/workspace/Lucene-Solr-Tests-trunk-Java8/solr/common-build.xml:516: The following error occurred while executing this line:
/x1/jenkins/jenkins-slave/workspace/Lucene-Solr-Tests-trunk-Java8/lucene/common-build.xml:1432: The following error occurred while executing this line:
/x1/jenkins/jenkins-slave/workspace/Lucene-Solr-Tests-trunk-Java8/lucene/common-build.xml:987: There were test failures: 552 suites (8 ignored), 2170 tests, 1 failure, 50 ignored (37 assumptions) [seed: 24E7A66E8B44A37]

Total time: 55 minutes 39 seconds
Build step 'Invoke Ant' marked build as failure
Archiving artifacts
Recording test results
Email was triggered for: Failure - Any
Sending email for trigger: Failure - Any