You are viewing a plain text version of this content. The canonical link for it is here.
Posted to builds@beam.apache.org by Apache Jenkins Server <je...@builds.apache.org> on 2022/08/23 14:46:43 UTC
Build failed in Jenkins: beam_LoadTests_Java_GBK_Dataflow_V2_Batch_Java17 #247
See <https://ci-beam.apache.org/job/beam_LoadTests_Java_GBK_Dataflow_V2_Batch_Java17/247/display/redirect?page=changes>
Changes:
[yathu] Evaluate proper metric in TextIOIT
[Andrew Pilloud] Add Python nexmark to gradle
[Michael Luckey] Align neo4j error messages with API
[noreply] Add Release category to release announcement blogs (#22785)
[noreply] [BEAM-13657] Update Python version used by mypy. (#22804)
[noreply] E2E basic state support (#22798)
[noreply] Add state integration test (#22815)
------------------------------------------
[...truncated 61.43 KB...]
response = meth(req, response)
File "/usr/lib/python3.8/urllib/request.py", line 640, in http_response
response = self.parent.error(
File "/usr/lib/python3.8/urllib/request.py", line 569, in error
return self._call_chain(*args)
File "/usr/lib/python3.8/urllib/request.py", line 502, in _call_chain
result = func(*args)
File "/usr/lib/python3.8/urllib/request.py", line 649, in http_error_default
raise HTTPError(req.full_url, code, msg, hdrs, fp)
urllib.error.HTTPError: HTTP Error 503: Service Unavailable
ERROR:root:Invalid url for bcprov-jdk15on-1.67: http://www.bouncycastle.org/licence.html. Retrying...
Traceback (most recent call last):
File "<https://ci-beam.apache.org/job/beam_LoadTests_Java_GBK_Dataflow_V2_Batch_Java17/ws/src/sdks/java/container/license_scripts/pull_licenses_java.py",> line 58, in pull_from_url
url_read = urlopen(Request(url, headers={
File "/usr/lib/python3.8/urllib/request.py", line 222, in urlopen
return opener.open(url, data, timeout)
File "/usr/lib/python3.8/urllib/request.py", line 531, in open
response = meth(req, response)
File "/usr/lib/python3.8/urllib/request.py", line 640, in http_response
response = self.parent.error(
File "/usr/lib/python3.8/urllib/request.py", line 563, in error
result = self._call_chain(*args)
File "/usr/lib/python3.8/urllib/request.py", line 502, in _call_chain
result = func(*args)
File "/usr/lib/python3.8/urllib/request.py", line 755, in http_error_302
return self.parent.open(new, timeout=req.timeout)
File "/usr/lib/python3.8/urllib/request.py", line 531, in open
response = meth(req, response)
File "/usr/lib/python3.8/urllib/request.py", line 640, in http_response
response = self.parent.error(
File "/usr/lib/python3.8/urllib/request.py", line 569, in error
return self._call_chain(*args)
File "/usr/lib/python3.8/urllib/request.py", line 502, in _call_chain
result = func(*args)
File "/usr/lib/python3.8/urllib/request.py", line 649, in http_error_default
raise HTTPError(req.full_url, code, msg, hdrs, fp)
urllib.error.HTTPError: HTTP Error 503: Service Unavailable
ERROR:root:Invalid url for bcprov-jdk15on-1.67: http://www.bouncycastle.org/licence.html. Retrying...
Traceback (most recent call last):
File "<https://ci-beam.apache.org/job/beam_LoadTests_Java_GBK_Dataflow_V2_Batch_Java17/ws/src/sdks/java/container/license_scripts/pull_licenses_java.py",> line 58, in pull_from_url
url_read = urlopen(Request(url, headers={
File "/usr/lib/python3.8/urllib/request.py", line 222, in urlopen
return opener.open(url, data, timeout)
File "/usr/lib/python3.8/urllib/request.py", line 531, in open
response = meth(req, response)
File "/usr/lib/python3.8/urllib/request.py", line 640, in http_response
response = self.parent.error(
File "/usr/lib/python3.8/urllib/request.py", line 563, in error
result = self._call_chain(*args)
File "/usr/lib/python3.8/urllib/request.py", line 502, in _call_chain
result = func(*args)
File "/usr/lib/python3.8/urllib/request.py", line 755, in http_error_302
return self.parent.open(new, timeout=req.timeout)
File "/usr/lib/python3.8/urllib/request.py", line 531, in open
response = meth(req, response)
File "/usr/lib/python3.8/urllib/request.py", line 640, in http_response
response = self.parent.error(
File "/usr/lib/python3.8/urllib/request.py", line 569, in error
return self._call_chain(*args)
File "/usr/lib/python3.8/urllib/request.py", line 502, in _call_chain
result = func(*args)
File "/usr/lib/python3.8/urllib/request.py", line 649, in http_error_default
raise HTTPError(req.full_url, code, msg, hdrs, fp)
urllib.error.HTTPError: HTTP Error 503: Service Unavailable
ERROR:root:Invalid url for bcprov-jdk15on-1.67: http://www.bouncycastle.org/licence.html. Retrying...
Traceback (most recent call last):
File "<https://ci-beam.apache.org/job/beam_LoadTests_Java_GBK_Dataflow_V2_Batch_Java17/ws/src/sdks/java/container/license_scripts/pull_licenses_java.py",> line 58, in pull_from_url
url_read = urlopen(Request(url, headers={
File "/usr/lib/python3.8/urllib/request.py", line 222, in urlopen
return opener.open(url, data, timeout)
File "/usr/lib/python3.8/urllib/request.py", line 531, in open
response = meth(req, response)
File "/usr/lib/python3.8/urllib/request.py", line 640, in http_response
response = self.parent.error(
File "/usr/lib/python3.8/urllib/request.py", line 563, in error
result = self._call_chain(*args)
File "/usr/lib/python3.8/urllib/request.py", line 502, in _call_chain
result = func(*args)
File "/usr/lib/python3.8/urllib/request.py", line 755, in http_error_302
return self.parent.open(new, timeout=req.timeout)
File "/usr/lib/python3.8/urllib/request.py", line 531, in open
response = meth(req, response)
File "/usr/lib/python3.8/urllib/request.py", line 640, in http_response
response = self.parent.error(
File "/usr/lib/python3.8/urllib/request.py", line 569, in error
return self._call_chain(*args)
File "/usr/lib/python3.8/urllib/request.py", line 502, in _call_chain
result = func(*args)
File "/usr/lib/python3.8/urllib/request.py", line 649, in http_error_default
raise HTTPError(req.full_url, code, msg, hdrs, fp)
urllib.error.HTTPError: HTTP Error 503: Service Unavailable
ERROR:root:Invalid url for bcprov-jdk15on-1.67: http://www.bouncycastle.org/licence.html. Retrying...
Traceback (most recent call last):
File "<https://ci-beam.apache.org/job/beam_LoadTests_Java_GBK_Dataflow_V2_Batch_Java17/ws/src/sdks/java/container/license_scripts/pull_licenses_java.py",> line 58, in pull_from_url
url_read = urlopen(Request(url, headers={
File "/usr/lib/python3.8/urllib/request.py", line 222, in urlopen
return opener.open(url, data, timeout)
File "/usr/lib/python3.8/urllib/request.py", line 531, in open
response = meth(req, response)
File "/usr/lib/python3.8/urllib/request.py", line 640, in http_response
response = self.parent.error(
File "/usr/lib/python3.8/urllib/request.py", line 563, in error
result = self._call_chain(*args)
File "/usr/lib/python3.8/urllib/request.py", line 502, in _call_chain
result = func(*args)
File "/usr/lib/python3.8/urllib/request.py", line 755, in http_error_302
return self.parent.open(new, timeout=req.timeout)
File "/usr/lib/python3.8/urllib/request.py", line 531, in open
response = meth(req, response)
File "/usr/lib/python3.8/urllib/request.py", line 640, in http_response
response = self.parent.error(
File "/usr/lib/python3.8/urllib/request.py", line 569, in error
return self._call_chain(*args)
File "/usr/lib/python3.8/urllib/request.py", line 502, in _call_chain
result = func(*args)
File "/usr/lib/python3.8/urllib/request.py", line 649, in http_error_default
raise HTTPError(req.full_url, code, msg, hdrs, fp)
urllib.error.HTTPError: HTTP Error 503: Service Unavailable
ERROR:root:Invalid url for bcprov-jdk15on-1.67: http://www.bouncycastle.org/licence.html. Retrying...
Traceback (most recent call last):
File "<https://ci-beam.apache.org/job/beam_LoadTests_Java_GBK_Dataflow_V2_Batch_Java17/ws/src/sdks/java/container/license_scripts/pull_licenses_java.py",> line 58, in pull_from_url
url_read = urlopen(Request(url, headers={
File "/usr/lib/python3.8/urllib/request.py", line 222, in urlopen
return opener.open(url, data, timeout)
File "/usr/lib/python3.8/urllib/request.py", line 531, in open
response = meth(req, response)
File "/usr/lib/python3.8/urllib/request.py", line 640, in http_response
response = self.parent.error(
File "/usr/lib/python3.8/urllib/request.py", line 563, in error
result = self._call_chain(*args)
File "/usr/lib/python3.8/urllib/request.py", line 502, in _call_chain
result = func(*args)
File "/usr/lib/python3.8/urllib/request.py", line 755, in http_error_302
return self.parent.open(new, timeout=req.timeout)
File "/usr/lib/python3.8/urllib/request.py", line 531, in open
response = meth(req, response)
File "/usr/lib/python3.8/urllib/request.py", line 640, in http_response
response = self.parent.error(
File "/usr/lib/python3.8/urllib/request.py", line 569, in error
return self._call_chain(*args)
File "/usr/lib/python3.8/urllib/request.py", line 502, in _call_chain
result = func(*args)
File "/usr/lib/python3.8/urllib/request.py", line 649, in http_error_default
raise HTTPError(req.full_url, code, msg, hdrs, fp)
urllib.error.HTTPError: HTTP Error 503: Service Unavailable
ERROR:root:Invalid url for bcprov-jdk15on-1.67: http://www.bouncycastle.org/licence.html. Retrying...
Traceback (most recent call last):
File "<https://ci-beam.apache.org/job/beam_LoadTests_Java_GBK_Dataflow_V2_Batch_Java17/ws/src/sdks/java/container/license_scripts/pull_licenses_java.py",> line 58, in pull_from_url
url_read = urlopen(Request(url, headers={
File "/usr/lib/python3.8/urllib/request.py", line 222, in urlopen
return opener.open(url, data, timeout)
File "/usr/lib/python3.8/urllib/request.py", line 531, in open
response = meth(req, response)
File "/usr/lib/python3.8/urllib/request.py", line 640, in http_response
response = self.parent.error(
File "/usr/lib/python3.8/urllib/request.py", line 563, in error
result = self._call_chain(*args)
File "/usr/lib/python3.8/urllib/request.py", line 502, in _call_chain
result = func(*args)
File "/usr/lib/python3.8/urllib/request.py", line 755, in http_error_302
return self.parent.open(new, timeout=req.timeout)
File "/usr/lib/python3.8/urllib/request.py", line 531, in open
response = meth(req, response)
File "/usr/lib/python3.8/urllib/request.py", line 640, in http_response
response = self.parent.error(
File "/usr/lib/python3.8/urllib/request.py", line 569, in error
return self._call_chain(*args)
File "/usr/lib/python3.8/urllib/request.py", line 502, in _call_chain
result = func(*args)
File "/usr/lib/python3.8/urllib/request.py", line 649, in http_error_default
raise HTTPError(req.full_url, code, msg, hdrs, fp)
urllib.error.HTTPError: HTTP Error 503: Service Unavailable
ERROR:root:Invalid url for bcprov-jdk15on-1.67: http://www.bouncycastle.org/licence.html. Retrying...
Traceback (most recent call last):
File "<https://ci-beam.apache.org/job/beam_LoadTests_Java_GBK_Dataflow_V2_Batch_Java17/ws/src/sdks/java/container/license_scripts/pull_licenses_java.py",> line 58, in pull_from_url
url_read = urlopen(Request(url, headers={
File "/usr/lib/python3.8/urllib/request.py", line 222, in urlopen
return opener.open(url, data, timeout)
File "/usr/lib/python3.8/urllib/request.py", line 531, in open
response = meth(req, response)
File "/usr/lib/python3.8/urllib/request.py", line 640, in http_response
response = self.parent.error(
File "/usr/lib/python3.8/urllib/request.py", line 563, in error
result = self._call_chain(*args)
File "/usr/lib/python3.8/urllib/request.py", line 502, in _call_chain
result = func(*args)
File "/usr/lib/python3.8/urllib/request.py", line 755, in http_error_302
return self.parent.open(new, timeout=req.timeout)
File "/usr/lib/python3.8/urllib/request.py", line 531, in open
response = meth(req, response)
File "/usr/lib/python3.8/urllib/request.py", line 640, in http_response
response = self.parent.error(
File "/usr/lib/python3.8/urllib/request.py", line 569, in error
return self._call_chain(*args)
File "/usr/lib/python3.8/urllib/request.py", line 502, in _call_chain
result = func(*args)
File "/usr/lib/python3.8/urllib/request.py", line 649, in http_error_default
raise HTTPError(req.full_url, code, msg, hdrs, fp)
urllib.error.HTTPError: HTTP Error 503: Service Unavailable
ERROR:root:Invalid url for bcprov-jdk15on-1.67: http://www.bouncycastle.org/licence.html after 9 retries.
ERROR:root:['bcpkix-jdk15on-1.67', 'bcprov-jdk15on-1.67']
ERROR:root:**************************************** Licenses were not able to be pulled automatically for some dependencies. Please search source code of the dependencies on the internet and add "license" and "notice" (if available) field to <https://ci-beam.apache.org/job/beam_LoadTests_Java_GBK_Dataflow_V2_Batch_Java17/ws/src/sdks/java/container/license_scripts/dep_urls_java.yaml> for each missing license. Dependency List: [bcpkix-jdk15on-1.67,bcprov-jdk15on-1.67]
INFO:root:pull_licenses_java.py failed. It took 99.470109 seconds with 16 threads.
Traceback (most recent call last):
File "<https://ci-beam.apache.org/job/beam_LoadTests_Java_GBK_Dataflow_V2_Batch_Java17/ws/src/sdks/java/container/license_scripts/pull_licenses_java.py",> line 326, in <module>
raise RuntimeError('{n} error(s) occurred.'.format(n=len(error_msg)),
RuntimeError: ('1 error(s) occurred.', ['**************************************** Licenses were not able to be pulled automatically for some dependencies. Please search source code of the dependencies on the internet and add "license" and "notice" (if available) field to <https://ci-beam.apache.org/job/beam_LoadTests_Java_GBK_Dataflow_V2_Batch_Java17/ws/src/sdks/java/container/license_scripts/dep_urls_java.yaml> for each missing license. Dependency List: [bcpkix-jdk15on-1.67,bcprov-jdk15on-1.67]'])
> Task :sdks:java:container:pullLicenses FAILED
> Task :sdks:java:container:goPrepare UP-TO-DATE
> Task :sdks:java:container:goBuild
/home/jenkins/go/bin/go1.18.1 build -o ./build/target/linux_amd64/boot boot.go boot_test.go
> Task :sdks:java:container:java17:copySdkHarnessLauncher
Execution optimizations have been disabled for task ':sdks:java:container:java17:copySdkHarnessLauncher' to ensure correctness due to the following reasons:
- Gradle detected a problem with the following location: '<https://ci-beam.apache.org/job/beam_LoadTests_Java_GBK_Dataflow_V2_Batch_Java17/ws/src/sdks/java/container/build/target'.> Reason: Task ':sdks:java:container:java17:copySdkHarnessLauncher' uses this output of task ':sdks:java:container:downloadCloudProfilerAgent' without declaring an explicit or implicit dependency. This can lead to incorrect results being produced, depending on what order the tasks are executed. Please refer to https://docs.gradle.org/7.4/userguide/validation_problems.html#implicit_dependency for more details about this problem.
- Gradle detected a problem with the following location: '<https://ci-beam.apache.org/job/beam_LoadTests_Java_GBK_Dataflow_V2_Batch_Java17/ws/src/sdks/java/container/build/target'.> Reason: Task ':sdks:java:container:java17:copySdkHarnessLauncher' uses this output of task ':sdks:java:container:pullLicenses' without declaring an explicit or implicit dependency. This can lead to incorrect results being produced, depending on what order the tasks are executed. Please refer to https://docs.gradle.org/7.4/userguide/validation_problems.html#implicit_dependency for more details about this problem.
FAILURE: Build failed with an exception.
* What went wrong:
Execution failed for task ':sdks:java:container:pullLicenses'.
> Process 'command './license_scripts/license_script.sh'' finished with non-zero exit value 1
* Try:
> Run with --stacktrace option to get the stack trace.
> Run with --info or --debug option to get more log output.
> Run with --scan to get full insights.
* Get more help at https://help.gradle.org
Deprecated Gradle features were used in this build, making it incompatible with Gradle 8.0.
You can use '--warning-mode all' to show the individual deprecation warnings and determine if they come from your own scripts or plugins.
See https://docs.gradle.org/7.4/userguide/command_line_interface.html#sec:command_line_warnings
Execution optimizations have been disabled for 1 invalid unit(s) of work during this build to ensure correctness.
Please consult deprecation warnings for more details.
BUILD FAILED in 2m 16s
104 actionable tasks: 67 executed, 33 from cache, 4 up-to-date
Publishing build scan...
https://gradle.com/s/54uacsrhmzxau
Build step 'Invoke Gradle script' changed build result to FAILURE
Build step 'Invoke Gradle script' marked build as failure
---------------------------------------------------------------------
To unsubscribe, e-mail: builds-unsubscribe@beam.apache.org
For additional commands, e-mail: builds-help@beam.apache.org
Jenkins build is back to normal : beam_LoadTests_Java_GBK_Dataflow_V2_Batch_Java17 #249
Posted by Apache Jenkins Server <je...@builds.apache.org>.
See <https://ci-beam.apache.org/job/beam_LoadTests_Java_GBK_Dataflow_V2_Batch_Java17/249/display/redirect?page=changes>
---------------------------------------------------------------------
To unsubscribe, e-mail: builds-unsubscribe@beam.apache.org
For additional commands, e-mail: builds-help@beam.apache.org
Build failed in Jenkins: beam_LoadTests_Java_GBK_Dataflow_V2_Batch_Java17 #248
Posted by Apache Jenkins Server <je...@builds.apache.org>.
See <https://ci-beam.apache.org/job/beam_LoadTests_Java_GBK_Dataflow_V2_Batch_Java17/248/display/redirect?page=changes>
Changes:
[Kenneth Knowles] Eliminate some null errors and rawtypes from sdks/java/core
[Kiley Sok] Update Beam 2.41.0 release docs
[noreply] [Playground] Setup Datastore in Playground project using Terraform -
[noreply] Add bag state support (#22816)
[Kiley Sok] Fix dates for 2.41.0 release
[noreply] added link to setup instructions in WordCount example (#22832)
[noreply] Bump google.golang.org/api from 0.93.0 to 0.94.0 in /sdks (#22839)
[noreply] Bump cloud.google.com/go/bigquery from 1.38.0 to 1.39.0 in /sdks
[noreply] Add an integration test for bag state (#22827)
------------------------------------------
[...truncated 47.55 KB...]
+ chmod -R a+w /output/licenses
> Task :sdks:java:container:java17:copyJavaThirdPartyLicenses
> Task :release:go-licenses:java:createLicenses
> Task :sdks:java:container:java17:copyGolangLicenses
> Task :sdks:java:container:goBuild
/home/jenkins/go/bin/go1.18.1 build -o ./build/target/linux_amd64/boot boot.go boot_test.go
> Task :sdks:java:container:java17:copySdkHarnessLauncher
Execution optimizations have been disabled for task ':sdks:java:container:java17:copySdkHarnessLauncher' to ensure correctness due to the following reasons:
- Gradle detected a problem with the following location: '<https://ci-beam.apache.org/job/beam_LoadTests_Java_GBK_Dataflow_V2_Batch_Java17/ws/src/sdks/java/container/build/target'.> Reason: Task ':sdks:java:container:java17:copySdkHarnessLauncher' uses this output of task ':sdks:java:container:downloadCloudProfilerAgent' without declaring an explicit or implicit dependency. This can lead to incorrect results being produced, depending on what order the tasks are executed. Please refer to https://docs.gradle.org/7.4/userguide/validation_problems.html#implicit_dependency for more details about this problem.
- Gradle detected a problem with the following location: '<https://ci-beam.apache.org/job/beam_LoadTests_Java_GBK_Dataflow_V2_Batch_Java17/ws/src/sdks/java/container/build/target'.> Reason: Task ':sdks:java:container:java17:copySdkHarnessLauncher' uses this output of task ':sdks:java:container:pullLicenses' without declaring an explicit or implicit dependency. This can lead to incorrect results being produced, depending on what order the tasks are executed. Please refer to https://docs.gradle.org/7.4/userguide/validation_problems.html#implicit_dependency for more details about this problem.
> Task :sdks:java:container:java17:dockerPrepare
> Task :sdks:java:container:java17:docker
> Task :runners:google-cloud-dataflow-java:buildAndPushDockerJavaContainer
WARNING: `gcloud docker` will not be supported for Docker client versions above 18.03.
As an alternative, use `gcloud auth configure-docker` to configure `docker` to
use `gcloud` as a credential helper, then use `docker` as you would for non-GCR
registries, e.g. `docker pull gcr.io/project-id/my-image`. Add
`--verbosity=error` to silence this warning: `gcloud docker
--verbosity=error -- pull gcr.io/project-id/my-image`.
See: https://cloud.google.com/container-registry/docs/support/deprecation-notices#gcloud-docker
The push refers to repository [us.gcr.io/apache-beam-testing/java-postcommit-it/java]
e2c83c0b6f2a: Preparing
e44e3c2cd4f5: Preparing
8fccfbc59c62: Preparing
7da38025b499: Preparing
3581f4841be5: Preparing
2e4ac3c75747: Preparing
9d4c27f243fe: Preparing
63be73d9a750: Preparing
23db7e947e27: Preparing
0c8294c27d2d: Preparing
364354861943: Preparing
0623581a0589: Preparing
281439971dd6: Preparing
fcf14690a08d: Preparing
fcaeada044d3: Preparing
3bc383470c05: Preparing
e93827457889: Preparing
08fa02ce37eb: Preparing
a037458de4e0: Preparing
bafdbe68e4ae: Preparing
a13c519c6361: Preparing
23db7e947e27: Waiting
9d4c27f243fe: Waiting
63be73d9a750: Waiting
0c8294c27d2d: Waiting
3bc383470c05: Waiting
a037458de4e0: Waiting
0623581a0589: Waiting
e93827457889: Waiting
fcf14690a08d: Waiting
08fa02ce37eb: Waiting
bafdbe68e4ae: Waiting
364354861943: Waiting
281439971dd6: Waiting
fcaeada044d3: Waiting
2e4ac3c75747: Waiting
e44e3c2cd4f5: Pushed
7da38025b499: Pushed
8fccfbc59c62: Pushed
3581f4841be5: Pushed
e2c83c0b6f2a: Pushed
63be73d9a750: Pushed
9d4c27f243fe: Pushed
0c8294c27d2d: Pushed
23db7e947e27: Pushed
0623581a0589: Pushed
2e4ac3c75747: Pushed
364354861943: Pushed
3bc383470c05: Layer already exists
e93827457889: Layer already exists
08fa02ce37eb: Layer already exists
a037458de4e0: Layer already exists
bafdbe68e4ae: Layer already exists
a13c519c6361: Layer already exists
fcf14690a08d: Pushed
fcaeada044d3: Pushed
281439971dd6: Pushed
20220824144439: digest: sha256:48e40529d51747f2b20d91c47e28b64f3c82bd17735ea2803fe5b7c5d0143904 size: 4729
> Task :sdks:java:testing:load-tests:run
Aug 24, 2022 2:45:43 PM org.apache.beam.runners.dataflow.options.DataflowPipelineOptions$StagingLocationFactory create
INFO: No stagingLocation provided, falling back to gcpTempLocation
Aug 24, 2022 2:45:43 PM org.apache.beam.runners.dataflow.DataflowRunner fromOptions
INFO: PipelineOptions.filesToStage was not specified. Defaulting to files from the classpath: will stage 222 files. Enable logging at DEBUG level to see which files will be staged.
Aug 24, 2022 2:45:44 PM org.apache.beam.runners.dataflow.DataflowRunner run
INFO: Executing pipeline on the Dataflow Service, which will have billing implications related to Google Compute Engine usage and other Google Cloud Services.
Aug 24, 2022 2:45:46 PM org.apache.beam.runners.dataflow.util.PackageUtil stageClasspathElements
INFO: Uploading 222 files from PipelineOptions.filesToStage to staging location to prepare for execution.
Aug 24, 2022 2:45:46 PM org.apache.beam.runners.dataflow.util.PackageUtil stageClasspathElements
INFO: Staging files complete: 222 files cached, 0 files newly uploaded in 0 seconds
Aug 24, 2022 2:45:46 PM org.apache.beam.runners.dataflow.DataflowRunner run
INFO: Staging portable pipeline proto to gs://temp-storage-for-perf-tests/loadtests/staging/
Aug 24, 2022 2:45:46 PM org.apache.beam.runners.dataflow.util.PackageUtil tryStagePackage
INFO: Uploading <95094 bytes, hash eaf7af39b29fc1cb6d6ab1780b9c457b5793040f9e58e8acd6e8c6de362c524f> to gs://temp-storage-for-perf-tests/loadtests/staging/pipeline-6vevObKfwcttarF4C5xFe1eTBA-eWOis1ujG3jYsUk8.pb
Aug 24, 2022 2:45:48 PM org.apache.beam.runners.dataflow.DataflowPipelineTranslator$Translator addStep
INFO: Adding Read input as step s1
Aug 24, 2022 2:45:48 PM org.apache.beam.runners.dataflow.DataflowPipelineTranslator$Translator addStep
INFO: Adding Collect start time metrics as step s2
Aug 24, 2022 2:45:48 PM org.apache.beam.runners.dataflow.DataflowPipelineTranslator$Translator addStep
INFO: Adding Total bytes monitor as step s3
Aug 24, 2022 2:45:48 PM org.apache.beam.runners.dataflow.DataflowPipelineTranslator$Translator addStep
INFO: Adding Window.Into()/Window.Assign as step s4
Aug 24, 2022 2:45:48 PM org.apache.beam.runners.dataflow.DataflowPipelineTranslator$Translator addStep
INFO: Adding Group by key (0) as step s5
Aug 24, 2022 2:45:48 PM org.apache.beam.runners.dataflow.DataflowPipelineTranslator$Translator addStep
INFO: Adding Ungroup and reiterate (0) as step s6
Aug 24, 2022 2:45:48 PM org.apache.beam.runners.dataflow.DataflowPipelineTranslator$Translator addStep
INFO: Adding Collect end time metrics (0) as step s7
Aug 24, 2022 2:45:48 PM org.apache.beam.runners.dataflow.DataflowRunner run
INFO: Dataflow SDK version: 2.42.0-SNAPSHOT
Aug 24, 2022 2:45:49 PM org.apache.beam.runners.dataflow.DataflowRunner run
INFO: To access the Dataflow monitoring console, please navigate to https://console.cloud.google.com/dataflow/jobs/us-central1/2022-08-24_07_45_48-8177530779249444824?project=apache-beam-testing
Aug 24, 2022 2:45:49 PM org.apache.beam.runners.dataflow.DataflowRunner run
INFO: Submitted job: 2022-08-24_07_45_48-8177530779249444824
Aug 24, 2022 2:45:49 PM org.apache.beam.runners.dataflow.DataflowRunner run
INFO: To cancel the job using the 'gcloud' tool, run:
> gcloud dataflow jobs --project=apache-beam-testing cancel --region=us-central1 2022-08-24_07_45_48-8177530779249444824
Aug 24, 2022 2:45:59 PM org.apache.beam.runners.dataflow.util.MonitoringUtil$LoggingHandler process
WARNING: 2022-08-24T14:45:52.967Z: The workflow name is not a valid Cloud Label. Labels applied to Cloud resources (such as GCE Instances) for monitoring will be labeled with this modified job name: load0tests0java170dataflow0v20batch0gbk01-jenkins-08241445-malq. For the best monitoring experience, please name your job with a valid Cloud Label. For details, see: https://cloud.google.com/compute/docs/labeling-resources#restrictions
Aug 24, 2022 2:46:04 PM org.apache.beam.runners.dataflow.util.MonitoringUtil$LoggingHandler process
INFO: 2022-08-24T14:46:02.978Z: Worker configuration: e2-standard-2 in us-central1-a.
Aug 24, 2022 2:46:04 PM org.apache.beam.runners.dataflow.util.MonitoringUtil$LoggingHandler process
INFO: 2022-08-24T14:46:04.076Z: Expanding SplittableParDo operations into optimizable parts.
Aug 24, 2022 2:46:04 PM org.apache.beam.runners.dataflow.util.MonitoringUtil$LoggingHandler process
INFO: 2022-08-24T14:46:04.112Z: Expanding CollectionToSingleton operations into optimizable parts.
Aug 24, 2022 2:46:04 PM org.apache.beam.runners.dataflow.util.MonitoringUtil$LoggingHandler process
INFO: 2022-08-24T14:46:04.196Z: Expanding CoGroupByKey operations into optimizable parts.
Aug 24, 2022 2:46:06 PM org.apache.beam.runners.dataflow.util.MonitoringUtil$LoggingHandler process
INFO: 2022-08-24T14:46:04.269Z: Expanding GroupByKey operations into optimizable parts.
Aug 24, 2022 2:46:06 PM org.apache.beam.runners.dataflow.util.MonitoringUtil$LoggingHandler process
INFO: 2022-08-24T14:46:04.322Z: Fusing adjacent ParDo, Read, Write, and Flatten operations
Aug 24, 2022 2:46:06 PM org.apache.beam.runners.dataflow.util.MonitoringUtil$LoggingHandler process
INFO: 2022-08-24T14:46:04.338Z: Fusing consumer Read input/ParDo(OutputSingleSource)/ParMultiDo(OutputSingleSource) into Read input/Impulse
Aug 24, 2022 2:46:06 PM org.apache.beam.runners.dataflow.util.MonitoringUtil$LoggingHandler process
INFO: 2022-08-24T14:46:04.361Z: Fusing consumer Read-input-ParDo-BoundedSourceAsSDFWrapper--ParMultiDo-BoundedSourceAsSDFWrapper-/PairWithRestriction into Read input/ParDo(OutputSingleSource)/ParMultiDo(OutputSingleSource)
Aug 24, 2022 2:46:06 PM org.apache.beam.runners.dataflow.util.MonitoringUtil$LoggingHandler process
INFO: 2022-08-24T14:46:04.441Z: Fusing consumer Read-input-ParDo-BoundedSourceAsSDFWrapper--ParMultiDo-BoundedSourceAsSDFWrapper-/SplitWithSizing into Read-input-ParDo-BoundedSourceAsSDFWrapper--ParMultiDo-BoundedSourceAsSDFWrapper-/PairWithRestriction
Aug 24, 2022 2:46:06 PM org.apache.beam.runners.dataflow.util.MonitoringUtil$LoggingHandler process
INFO: 2022-08-24T14:46:04.485Z: Fusing consumer Collect start time metrics/ParMultiDo(TimeMonitor) into Read-input-ParDo-BoundedSourceAsSDFWrapper--ParMultiDo-BoundedSourceAsSDFWrapper-/ProcessElementAndRestrictionWithSizing
Aug 24, 2022 2:46:06 PM org.apache.beam.runners.dataflow.util.MonitoringUtil$LoggingHandler process
INFO: 2022-08-24T14:46:04.507Z: Fusing consumer Total bytes monitor/ParMultiDo(ByteMonitor) into Collect start time metrics/ParMultiDo(TimeMonitor)
Aug 24, 2022 2:46:06 PM org.apache.beam.runners.dataflow.util.MonitoringUtil$LoggingHandler process
INFO: 2022-08-24T14:46:04.586Z: Fusing consumer Window.Into()/Window.Assign into Total bytes monitor/ParMultiDo(ByteMonitor)
Aug 24, 2022 2:46:06 PM org.apache.beam.runners.dataflow.util.MonitoringUtil$LoggingHandler process
INFO: 2022-08-24T14:46:04.613Z: Fusing consumer Group by key (0)/Write into Window.Into()/Window.Assign
Aug 24, 2022 2:46:06 PM org.apache.beam.runners.dataflow.util.MonitoringUtil$LoggingHandler process
INFO: 2022-08-24T14:46:04.640Z: Fusing consumer Ungroup and reiterate (0)/ParMultiDo(UngroupAndReiterate) into Group by key (0)/Read
Aug 24, 2022 2:46:06 PM org.apache.beam.runners.dataflow.util.MonitoringUtil$LoggingHandler process
INFO: 2022-08-24T14:46:04.664Z: Fusing consumer Collect end time metrics (0)/ParMultiDo(TimeMonitor) into Ungroup and reiterate (0)/ParMultiDo(UngroupAndReiterate)
Aug 24, 2022 2:46:06 PM org.apache.beam.runners.dataflow.util.MonitoringUtil$LoggingHandler process
INFO: 2022-08-24T14:46:04.994Z: Executing operation Read input/Impulse+Read input/ParDo(OutputSingleSource)/ParMultiDo(OutputSingleSource)+Read-input-ParDo-BoundedSourceAsSDFWrapper--ParMultiDo-BoundedSourceAsSDFWrapper-/PairWithRestriction+Read-input-ParDo-BoundedSourceAsSDFWrapper--ParMultiDo-BoundedSourceAsSDFWrapper-/SplitWithSizing
Aug 24, 2022 2:46:06 PM org.apache.beam.runners.dataflow.util.MonitoringUtil$LoggingHandler process
INFO: 2022-08-24T14:46:05.069Z: Starting 5 ****s in us-central1-a...
Aug 24, 2022 2:46:34 PM org.apache.beam.runners.dataflow.util.MonitoringUtil$LoggingHandler process
INFO: 2022-08-24T14:46:32.988Z: Your project already contains 100 Dataflow-created metric descriptors, so new user metrics of the form custom.googleapis.com/* will not be created. However, all user metrics are also available in the metric dataflow.googleapis.com/job/user_counter. If you rely on the custom metrics, you can delete old / unused metric descriptors. See https://developers.google.com/apis-explorer/#p/monitoring/v3/monitoring.projects.metricDescriptors.list and https://developers.google.com/apis-explorer/#p/monitoring/v3/monitoring.projects.metricDescriptors.delete
Aug 24, 2022 2:46:48 PM org.apache.beam.runners.dataflow.util.MonitoringUtil$LoggingHandler process
INFO: 2022-08-24T14:46:48.270Z: Autoscaling: Raised the number of ****s to 5 based on the rate of progress in the currently running stage(s).
Aug 24, 2022 2:47:49 PM org.apache.beam.runners.dataflow.util.MonitoringUtil$LoggingHandler process
INFO: 2022-08-24T14:47:48.275Z: Workers have started successfully.
Aug 24, 2022 2:48:09 PM org.apache.beam.runners.dataflow.util.MonitoringUtil$LoggingHandler process
INFO: 2022-08-24T14:48:08.132Z: Finished operation Read input/Impulse+Read input/ParDo(OutputSingleSource)/ParMultiDo(OutputSingleSource)+Read-input-ParDo-BoundedSourceAsSDFWrapper--ParMultiDo-BoundedSourceAsSDFWrapper-/PairWithRestriction+Read-input-ParDo-BoundedSourceAsSDFWrapper--ParMultiDo-BoundedSourceAsSDFWrapper-/SplitWithSizing
Aug 24, 2022 2:48:09 PM org.apache.beam.runners.dataflow.util.MonitoringUtil$LoggingHandler process
INFO: 2022-08-24T14:48:08.325Z: Executing operation Group by key (0)/Create
Aug 24, 2022 2:48:11 PM org.apache.beam.runners.dataflow.util.MonitoringUtil$LoggingHandler process
INFO: 2022-08-24T14:48:09.875Z: Finished operation Group by key (0)/Create
Aug 24, 2022 2:48:11 PM org.apache.beam.runners.dataflow.util.MonitoringUtil$LoggingHandler process
INFO: 2022-08-24T14:48:10.018Z: Executing operation Read-input-ParDo-BoundedSourceAsSDFWrapper--ParMultiDo-BoundedSourceAsSDFWrapper-/ProcessElementAndRestrictionWithSizing+Collect start time metrics/ParMultiDo(TimeMonitor)+Total bytes monitor/ParMultiDo(ByteMonitor)+Window.Into()/Window.Assign+Group by key (0)/Write
Aug 24, 2022 2:49:04 PM org.apache.beam.runners.dataflow.util.MonitoringUtil$LoggingHandler process
INFO: 2022-08-24T14:49:03.450Z: Finished operation Read-input-ParDo-BoundedSourceAsSDFWrapper--ParMultiDo-BoundedSourceAsSDFWrapper-/ProcessElementAndRestrictionWithSizing+Collect start time metrics/ParMultiDo(TimeMonitor)+Total bytes monitor/ParMultiDo(ByteMonitor)+Window.Into()/Window.Assign+Group by key (0)/Write
Aug 24, 2022 2:49:04 PM org.apache.beam.runners.dataflow.util.MonitoringUtil$LoggingHandler process
INFO: 2022-08-24T14:49:03.517Z: Executing operation Group by key (0)/Close
Aug 24, 2022 2:49:04 PM org.apache.beam.runners.dataflow.util.MonitoringUtil$LoggingHandler process
INFO: 2022-08-24T14:49:04.121Z: Finished operation Group by key (0)/Close
Aug 24, 2022 2:49:04 PM org.apache.beam.runners.dataflow.util.MonitoringUtil$LoggingHandler process
INFO: 2022-08-24T14:49:04.203Z: Executing operation Group by key (0)/Read+Ungroup and reiterate (0)/ParMultiDo(UngroupAndReiterate)+Collect end time metrics (0)/ParMultiDo(TimeMonitor)
Aug 24, 2022 2:49:40 PM org.apache.beam.runners.dataflow.util.MonitoringUtil$LoggingHandler process
INFO: 2022-08-24T14:49:39.583Z: Finished operation Group by key (0)/Read+Ungroup and reiterate (0)/ParMultiDo(UngroupAndReiterate)+Collect end time metrics (0)/ParMultiDo(TimeMonitor)
Aug 24, 2022 2:49:40 PM org.apache.beam.runners.dataflow.util.MonitoringUtil$LoggingHandler process
INFO: 2022-08-24T14:49:39.739Z: Cleaning up.
Aug 24, 2022 2:49:40 PM org.apache.beam.runners.dataflow.util.MonitoringUtil$LoggingHandler process
INFO: 2022-08-24T14:49:39.814Z: Stopping **** pool...
Aug 24, 2022 2:51:53 PM org.apache.beam.runners.dataflow.util.MonitoringUtil$LoggingHandler process
INFO: 2022-08-24T14:51:53.654Z: Autoscaling: Resized **** pool from 5 to 0.
Aug 24, 2022 2:51:53 PM org.apache.beam.runners.dataflow.util.MonitoringUtil$LoggingHandler process
INFO: 2022-08-24T14:51:53.726Z: Worker pool stopped.
Aug 24, 2022 2:51:59 PM org.apache.beam.runners.dataflow.DataflowPipelineJob logTerminalState
INFO: Job 2022-08-24_07_45_48-8177530779249444824 finished with status DONE.
Load test results for test (ID): 188947d3-f551-48fa-aca6-1d7a0dda3849 and timestamp: 2022-08-24T14:45:43.994000000Z:
Metric: Value:
dataflow_v2_java17_runtime_sec 86.95
dataflow_v2_java17_total_bytes_count 2.0E9
> Task :runners:google-cloud-dataflow-java:cleanUpDockerJavaImages
Untagged: us.gcr.io/apache-beam-testing/java-postcommit-it/java:20220824144439
Untagged: us.gcr.io/apache-beam-testing/java-postcommit-it/java@sha256:48e40529d51747f2b20d91c47e28b64f3c82bd17735ea2803fe5b7c5d0143904
Tag: [us.gcr.io/apache-beam-testing/java-postcommit-it/java:20220824144439]
- referencing digest: [us.gcr.io/apache-beam-testing/java-postcommit-it/java@sha256:48e40529d51747f2b20d91c47e28b64f3c82bd17735ea2803fe5b7c5d0143904]
Deleted [[us.gcr.io/apache-beam-testing/java-postcommit-it/java:20220824144439] (referencing [us.gcr.io/apache-beam-testing/java-postcommit-it/java@sha256:48e40529d51747f2b20d91c47e28b64f3c82bd17735ea2803fe5b7c5d0143904])].
Removing untagged image us.gcr.io/apache-beam-testing/java-postcommit-it/java@sha256:48e40529d51747f2b20d91c47e28b64f3c82bd17735ea2803fe5b7c5d0143904
Digests:
- us.gcr.io/apache-beam-testing/java-postcommit-it/java@sha256:48e40529d51747f2b20d91c47e28b64f3c82bd17735ea2803fe5b7c5d0143904
ERROR: (gcloud.container.images.delete) Not found: response: {'docker-distribution-api-version': 'registry/2.0', 'content-type': 'application/json', 'date': 'Wed, 24 Aug 2022 14:52:06 GMT', 'server': 'Docker Registry', 'cache-control': 'private', 'x-xss-protection': '0', 'x-frame-options': 'SAMEORIGIN', 'transfer-encoding': 'chunked', 'status': '404', 'content-length': '168', '-content-encoding': 'gzip'}
Failed to compute blob liveness for manifest: 'sha256:48e40529d51747f2b20d91c47e28b64f3c82bd17735ea2803fe5b7c5d0143904': None
> Task :runners:google-cloud-dataflow-java:cleanUpDockerJavaImages FAILED
FAILURE: Build failed with an exception.
* Where:
Build file '<https://ci-beam.apache.org/job/beam_LoadTests_Java_GBK_Dataflow_V2_Batch_Java17/ws/src/runners/google-cloud-dataflow-java/build.gradle'> line: 302
* What went wrong:
Execution failed for task ':runners:google-cloud-dataflow-java:cleanUpDockerJavaImages'.
> Process 'command './scripts/cleanup_untagged_gcr_images.sh'' finished with non-zero exit value 1
* Try:
> Run with --stacktrace option to get the stack trace.
> Run with --info or --debug option to get more log output.
> Run with --scan to get full insights.
* Get more help at https://help.gradle.org
Deprecated Gradle features were used in this build, making it incompatible with Gradle 8.0.
You can use '--warning-mode all' to show the individual deprecation warnings and determine if they come from your own scripts or plugins.
See https://docs.gradle.org/7.4/userguide/command_line_interface.html#sec:command_line_warnings
Execution optimizations have been disabled for 1 invalid unit(s) of work during this build to ensure correctness.
Please consult deprecation warnings for more details.
BUILD FAILED in 7m 41s
110 actionable tasks: 73 executed, 33 from cache, 4 up-to-date
Publishing build scan...
https://gradle.com/s/gdp4mbbcltcd4
Build step 'Invoke Gradle script' changed build result to FAILURE
Build step 'Invoke Gradle script' marked build as failure
---------------------------------------------------------------------
To unsubscribe, e-mail: builds-unsubscribe@beam.apache.org
For additional commands, e-mail: builds-help@beam.apache.org