You are viewing a plain text version of this content. The canonical link for it is here.
Posted to builds@beam.apache.org by Apache Jenkins Server <je...@builds.apache.org> on 2021/09/23 07:33:35 UTC
Build failed in Jenkins:
beam_PostCommit_Java_Nexmark_Dataflow_V2_Java11 #487
See <https://ci-beam.apache.org/job/beam_PostCommit_Java_Nexmark_Dataflow_V2_Java11/487/display/redirect?page=changes>
Changes:
[Kyle Weaver] [BEAM-12898] Use new postbuildscript dsl in Flink load tests
[Kyle Weaver] run postbuild regardless of test result
[Kyle Weaver] spotless
[noreply] [BEAM-12383] Adding Go SDK and Kafka IO to Gradle cross-language test
------------------------------------------
[...truncated 675.86 KB...]
2021-09-23T07:27:09.665Z no activity
2021-09-23T07:27:24.701Z RUNNING Query7
2021-09-23T07:27:25.361Z sample of 63.1 sec not long enough to calculate steady-state event rate
Sep 23, 2021 7:27:25 AM org.apache.beam.sdk.testutils.metrics.MetricsReader getCounterMetric
2021-09-23T07:27:25.463Z WARNING: streaming query appears to have been stuck for 56 min.
SEVERE: Failed to get metric fatal, from namespace Query7
2021-09-23T07:27:25.463Z no activity
2021-09-23T07:27:40.496Z RUNNING Query7
2021-09-23T07:27:41.220Z sample of 63.1 sec not long enough to calculate steady-state event rate
Sep 23, 2021 7:27:41 AM org.apache.beam.sdk.testutils.metrics.MetricsReader getCounterMetric
2021-09-23T07:27:41.312Z WARNING: streaming query appears to have been stuck for 56 min.
2021-09-23T07:27:41.312Z no activity
SEVERE: Failed to get metric fatal, from namespace Query7
2021-09-23T07:27:56.353Z RUNNING Query7
2021-09-23T07:27:57.147Z sample of 63.1 sec not long enough to calculate steady-state event rate
Sep 23, 2021 7:27:57 AM org.apache.beam.sdk.testutils.metrics.MetricsReader getCounterMetric
2021-09-23T07:27:57.209Z WARNING: streaming query appears to have been stuck for 57 min.
SEVERE: Failed to get metric fatal, from namespace Query7
2021-09-23T07:27:57.209Z no activity
2021-09-23T07:28:12.272Z RUNNING Query7
2021-09-23T07:28:12.977Z sample of 63.1 sec not long enough to calculate steady-state event rate
Sep 23, 2021 7:28:13 AM org.apache.beam.sdk.testutils.metrics.MetricsReader getCounterMetric
SEVERE: Failed to get metric fatal, from namespace Query7
2021-09-23T07:28:13.038Z WARNING: streaming query appears to have been stuck for 57 min.
2021-09-23T07:28:13.038Z no activity
2021-09-23T07:28:28.077Z RUNNING Query7
2021-09-23T07:28:28.799Z sample of 63.1 sec not long enough to calculate steady-state event rate
Sep 23, 2021 7:28:28 AM org.apache.beam.sdk.testutils.metrics.MetricsReader getCounterMetric
2021-09-23T07:28:28.849Z WARNING: streaming query appears to have been stuck for 57 min.
SEVERE: Failed to get metric fatal, from namespace Query7
2021-09-23T07:28:28.849Z no activity
2021-09-23T07:28:43.888Z RUNNING Query7
2021-09-23T07:28:44.592Z sample of 63.1 sec not long enough to calculate steady-state event rate
Sep 23, 2021 7:28:44 AM org.apache.beam.sdk.testutils.metrics.MetricsReader getCounterMetric
SEVERE: Failed to get metric fatal, from namespace Query7
2021-09-23T07:28:44.655Z WARNING: streaming query appears to have been stuck for 58 min.
2021-09-23T07:28:44.655Z no activity
2021-09-23T07:28:59.698Z RUNNING Query7
2021-09-23T07:29:00.426Z sample of 63.1 sec not long enough to calculate steady-state event rate
Sep 23, 2021 7:29:00 AM org.apache.beam.sdk.testutils.metrics.MetricsReader getCounterMetric
SEVERE: Failed to get metric fatal, from namespace Query7
2021-09-23T07:29:00.598Z WARNING: streaming query appears to have been stuck for 58 min.
2021-09-23T07:29:00.598Z no activity
2021-09-23T07:29:15.642Z RUNNING Query7
2021-09-23T07:29:16.403Z sample of 63.1 sec not long enough to calculate steady-state event rate
Sep 23, 2021 7:29:16 AM org.apache.beam.sdk.testutils.metrics.MetricsReader getCounterMetric
2021-09-23T07:29:16.471Z WARNING: streaming query appears to have been stuck for 58 min.
2021-09-23T07:29:16.471Z no activity
SEVERE: Failed to get metric fatal, from namespace Query7
2021-09-23T07:29:31.520Z RUNNING Query7
2021-09-23T07:29:32.284Z sample of 63.1 sec not long enough to calculate steady-state event rate
Sep 23, 2021 7:29:32 AM org.apache.beam.sdk.testutils.metrics.MetricsReader getCounterMetric
SEVERE: Failed to get metric fatal, from namespace Query7
2021-09-23T07:29:32.442Z WARNING: streaming query appears to have been stuck for 58 min.
2021-09-23T07:29:32.442Z no activity
2021-09-23T07:29:47.493Z RUNNING Query7
2021-09-23T07:29:48.190Z sample of 63.1 sec not long enough to calculate steady-state event rate
Sep 23, 2021 7:29:48 AM org.apache.beam.sdk.testutils.metrics.MetricsReader getCounterMetric
2021-09-23T07:29:48.299Z WARNING: streaming query appears to have been stuck for 59 min.
SEVERE: Failed to get metric fatal, from namespace Query7
2021-09-23T07:29:48.299Z no activity
2021-09-23T07:30:03.352Z RUNNING Query7
2021-09-23T07:30:04.070Z sample of 63.1 sec not long enough to calculate steady-state event rate
Sep 23, 2021 7:30:04 AM org.apache.beam.sdk.testutils.metrics.MetricsReader getCounterMetric
2021-09-23T07:30:04.163Z WARNING: streaming query appears to have been stuck for 59 min.
SEVERE: Failed to get metric fatal, from namespace Query7
2021-09-23T07:30:04.163Z no activity
2021-09-23T07:30:19.195Z RUNNING Query7
2021-09-23T07:30:19.876Z sample of 63.1 sec not long enough to calculate steady-state event rate
Sep 23, 2021 7:30:20 AM org.apache.beam.sdk.testutils.metrics.MetricsReader getCounterMetric
SEVERE: Failed to get metric fatal, from namespace Query7
2021-09-23T07:30:20.011Z WARNING: streaming query appears to have been stuck for 59 min.
2021-09-23T07:30:20.011Z no activity
2021-09-23T07:30:35.049Z RUNNING Query7
2021-09-23T07:30:35.827Z sample of 63.1 sec not long enough to calculate steady-state event rate
Sep 23, 2021 7:30:35 AM org.apache.beam.sdk.testutils.metrics.MetricsReader getCounterMetric
SEVERE: Failed to get metric fatal, from namespace Query7
2021-09-23T07:30:35.919Z WARNING: streaming query appears to have been stuck for 59 min.
2021-09-23T07:30:35.919Z no activity
2021-09-23T07:30:50.955Z RUNNING Query7
2021-09-23T07:30:51.850Z sample of 63.1 sec not long enough to calculate steady-state event rate
Sep 23, 2021 7:30:51 AM org.apache.beam.sdk.testutils.metrics.MetricsReader getCounterMetric
SEVERE: Failed to get metric fatal, from namespace Query7
2021-09-23T07:30:51.919Z ERROR: streaming query appears to have been stuck for 60 minutes, cancelling job.
2021-09-23T07:30:51.954Z no activity
2021-09-23T07:31:06.990Z RUNNING Query7 (waiting for shutdown)
2021-09-23T07:31:07.652Z sample of 63.1 sec not long enough to calculate steady-state event rate
2021-09-23T07:31:07.652Z no activity
2021-09-23T07:31:22.686Z RUNNING Query7 (waiting for shutdown)
2021-09-23T07:31:23.452Z sample of 63.1 sec not long enough to calculate steady-state event rate
2021-09-23T07:31:23.452Z no activity
2021-09-23T07:31:38.483Z RUNNING Query7 (waiting for shutdown)
2021-09-23T07:31:39.181Z sample of 63.1 sec not long enough to calculate steady-state event rate
2021-09-23T07:31:39.181Z no activity
2021-09-23T07:31:54.215Z RUNNING Query7 (waiting for shutdown)
2021-09-23T07:31:54.871Z sample of 63.1 sec not long enough to calculate steady-state event rate
2021-09-23T07:31:54.871Z no activity
2021-09-23T07:32:09.907Z RUNNING Query7 (waiting for shutdown)
2021-09-23T07:32:10.760Z sample of 63.1 sec not long enough to calculate steady-state event rate
2021-09-23T07:32:10.760Z no activity
2021-09-23T07:32:25.811Z RUNNING Query7 (waiting for shutdown)
2021-09-23T07:32:26.487Z sample of 63.1 sec not long enough to calculate steady-state event rate
2021-09-23T07:32:26.487Z no activity
2021-09-23T07:32:41.518Z RUNNING Query7 (waiting for shutdown)
2021-09-23T07:32:42.360Z sample of 63.1 sec not long enough to calculate steady-state event rate
2021-09-23T07:32:42.360Z no activity
2021-09-23T07:32:57.450Z RUNNING Query7 (waiting for shutdown)
2021-09-23T07:32:58.409Z sample of 63.1 sec not long enough to calculate steady-state event rate
2021-09-23T07:32:58.410Z no activity
2021-09-23T07:33:13.512Z RUNNING Query7 (waiting for shutdown)
2021-09-23T07:33:14.376Z sample of 63.1 sec not long enough to calculate steady-state event rate
2021-09-23T07:33:14.376Z no activity
2021-09-23T07:33:29.411Z CANCELLED Query7 (waiting for shutdown)
2021-09-23T07:33:29.452Z sample of 63.1 sec not long enough to calculate steady-state event rate
==========================================================================================
Run started 2021-09-23T06:21:56.773Z and ran for PT4292.680S
Default configuration:
{"debug":true,"query":null,"sourceType":"DIRECT","generateEventFilePathPrefix":null,"sinkType":"DEVNULL","exportSummaryToBigQuery":false,"pubSubMode":"COMBINED","pubsubMessageSerializationMethod":"CODER","sideInputType":"DIRECT","sideInputRowCount":500,"sideInputNumShards":3,"sideInputUrl":null,"sessionGap":600000,"numEvents":100000,"numEventGenerators":100,"rateShape":"SINE","firstEventRate":10000,"nextEventRate":10000,"rateUnit":"PER_SECOND","ratePeriodSec":600,"preloadSeconds":0,"streamTimeout":240,"isRateLimited":false,"useWallclockEventTime":false,"avgPersonByteSize":200,"avgAuctionByteSize":500,"avgBidByteSize":100,"hotAuctionRatio":2,"hotSellersRatio":4,"hotBiddersRatio":4,"windowSizeSec":10,"windowPeriodSec":5,"watermarkHoldbackSec":0,"numInFlightAuctions":100,"numActivePeople":1000,"coderStrategy":"HAND","cpuDelayMs":0,"diskBusyBytes":0,"auctionSkip":123,"fanout":5,"maxAuctionsWaitingTime":600,"occasionalDelaySec":3,"probDelayedEvent":0.1,"maxLogEvents":100000,"usePubsubPublishTime":false,"outOfOrderGroupSize":1,"numKeyBuckets":20000,"pardoCPUFactor":1.0}
Configurations:
Conf Description
0000 query:PASSTHROUGH; numEvents:10000000
0001 query:CURRENCY_CONVERSION; numEvents:10000000
0002 query:SELECTION; numEvents:10000000
0003 query:LOCAL_ITEM_SUGGESTION; numEvents:10000000
0004 query:AVERAGE_PRICE_FOR_CATEGORY; numEvents:1000000
0005 query:HOT_ITEMS; numEvents:10000000
0006 query:AVERAGE_SELLING_PRICE_BY_SELLER; numEvents:1000000
0007 query:HIGHEST_BID; numEvents:10000000
0008 query:MONITOR_NEW_USERS; numEvents:10000000
0009 query:WINNING_BIDS; numEvents:1000000
0010 query:LOG_TO_SHARDED_FILES; numEvents:10000000
0011 query:USER_SESSIONS; numEvents:10000000
0012 query:PROCESSING_TIME_WINDOWS; numEvents:10000000
0013 query:PORTABILITY_BATCH; numEvents:10000000
0014 query:BOUNDED_SIDE_INPUT_JOIN; numEvents:10000000
0015 query:SESSION_SIDE_INPUT_JOIN; numEvents:10000000
Performance:
Conf Runtime(sec) (Baseline) Events(/sec) (Baseline) Results (Baseline)
0000 40.9 197707.5 8077142
0001 35.3 258142.1 8375783
0002 19.6 479196.1 75847
0003 92.8 107757.5 59864
0004 *** not run ***
0005 439.2 22545.9 4528
0006 *** not run ***
0007 322.7 29830.3 100
*** Cancelling streaming job since it appeared stuck for 60 min. ***
0008 146.5 67753.6 92163
0009 *** not run ***
0010 133.4 74253.5 100
0011 593.2 16858.2 1839657
0012 126.7 78944.0 301071
0013 *** not run ***
0014 *** not run ***
0015 *** not run ***
==========================================================================================
==========================================================================================
Run started 2021-09-23T06:21:56.773Z and ran for PT4292.885S
Default configuration:
{"debug":true,"query":null,"sourceType":"DIRECT","generateEventFilePathPrefix":null,"sinkType":"DEVNULL","exportSummaryToBigQuery":false,"pubSubMode":"COMBINED","pubsubMessageSerializationMethod":"CODER","sideInputType":"DIRECT","sideInputRowCount":500,"sideInputNumShards":3,"sideInputUrl":null,"sessionGap":600000,"numEvents":100000,"numEventGenerators":100,"rateShape":"SINE","firstEventRate":10000,"nextEventRate":10000,"rateUnit":"PER_SECOND","ratePeriodSec":600,"preloadSeconds":0,"streamTimeout":240,"isRateLimited":false,"useWallclockEventTime":false,"avgPersonByteSize":200,"avgAuctionByteSize":500,"avgBidByteSize":100,"hotAuctionRatio":2,"hotSellersRatio":4,"hotBiddersRatio":4,"windowSizeSec":10,"windowPeriodSec":5,"watermarkHoldbackSec":0,"numInFlightAuctions":100,"numActivePeople":1000,"coderStrategy":"HAND","cpuDelayMs":0,"diskBusyBytes":0,"auctionSkip":123,"fanout":5,"maxAuctionsWaitingTime":600,"occasionalDelaySec":3,"probDelayedEvent":0.1,"maxLogEvents":100000,"usePubsubPublishTime":false,"outOfOrderGroupSize":1,"numKeyBuckets":20000,"pardoCPUFactor":1.0}
Configurations:
Conf Description
0000 query:PASSTHROUGH; numEvents:10000000
0001 query:CURRENCY_CONVERSION; numEvents:10000000
0002 query:SELECTION; numEvents:10000000
0003 query:LOCAL_ITEM_SUGGESTION; numEvents:10000000
0004 query:AVERAGE_PRICE_FOR_CATEGORY; numEvents:1000000
0005 query:HOT_ITEMS; numEvents:10000000
0006 query:AVERAGE_SELLING_PRICE_BY_SELLER; numEvents:1000000
0007 query:HIGHEST_BID; numEvents:10000000
0008 query:MONITOR_NEW_USERS; numEvents:10000000
0009 query:WINNING_BIDS; numEvents:1000000
0010 query:LOG_TO_SHARDED_FILES; numEvents:10000000
0011 query:USER_SESSIONS; numEvents:10000000
0012 query:PROCESSING_TIME_WINDOWS; numEvents:10000000
0013 query:PORTABILITY_BATCH; numEvents:10000000
0014 query:BOUNDED_SIDE_INPUT_JOIN; numEvents:10000000
0015 query:SESSION_SIDE_INPUT_JOIN; numEvents:10000000
Performance:
Conf Runtime(sec) (Baseline) Events(/sec) (Baseline) Results (Baseline)
0000 40.9 197707.5 8077142
0001 35.3 258142.1 8375783
0002 19.6 479196.1 75847
0003 92.8 107757.5 59864
0004 *** not run ***
0005 439.2 22545.9 4528
0006 *** not run ***
0007 322.7 29830.3 100
*** Cancelling streaming job since it appeared stuck for 60 min. ***
0008 146.5 67753.6 92163
0009 *** not run ***
0010 133.4 74253.5 100
0011 593.2 16858.2 1839657
0012 126.7 78944.0 301071
0013 *** not run ***
0014 *** not run ***
0015 *** not run ***
==========================================================================================
Exception in thread "main" java.lang.RuntimeException: Execution was not successful
at org.apache.beam.sdk.nexmark.Main.runAll(Main.java:186)
at org.apache.beam.sdk.nexmark.Main.main(Main.java:495)
> Task :sdks:java:testing:nexmark:run FAILED
> Task :runners:google-cloud-dataflow-java:cleanUpDockerImages
Untagged: us.gcr.io/apache-beam-testing/java-postcommit-it/java:20210923062126
Untagged: us.gcr.io/apache-beam-testing/java-postcommit-it/java@sha256:4f29db0fc2728debaa40e7ca57fdda32658f7dbc74acfbe606ec27bf1580d6cd
Tag: [us.gcr.io/apache-beam-testing/java-postcommit-it/java:20210923062126]
- referencing digest: [us.gcr.io/apache-beam-testing/java-postcommit-it/java@sha256:4f29db0fc2728debaa40e7ca57fdda32658f7dbc74acfbe606ec27bf1580d6cd]
Deleted [[us.gcr.io/apache-beam-testing/java-postcommit-it/java:20210923062126] (referencing [us.gcr.io/apache-beam-testing/java-postcommit-it/java@sha256:4f29db0fc2728debaa40e7ca57fdda32658f7dbc74acfbe606ec27bf1580d6cd])].
Removing untagged image us.gcr.io/apache-beam-testing/java-postcommit-it/java@sha256:4f29db0fc2728debaa40e7ca57fdda32658f7dbc74acfbe606ec27bf1580d6cd
Digests:
- us.gcr.io/apache-beam-testing/java-postcommit-it/java@sha256:4f29db0fc2728debaa40e7ca57fdda32658f7dbc74acfbe606ec27bf1580d6cd
Deleted [us.gcr.io/apache-beam-testing/java-postcommit-it/java@sha256:4f29db0fc2728debaa40e7ca57fdda32658f7dbc74acfbe606ec27bf1580d6cd].
FAILURE: Build failed with an exception.
* What went wrong:
Execution failed for task ':sdks:java:testing:nexmark:run'.
> Process 'command '/usr/lib/jvm/java-8-openjdk-amd64/bin/java'' finished with non-zero exit value 1
* Try:
Run with --stacktrace option to get the stack trace. Run with --info or --debug option to get more log output. Run with --scan to get full insights.
* Get more help at https://help.gradle.org
Deprecated Gradle features were used in this build, making it incompatible with Gradle 7.0.
Use '--warning-mode all' to show the individual deprecation warnings.
See https://docs.gradle.org/6.9.1/userguide/command_line_interface.html#sec:command_line_warnings
BUILD FAILED in 1h 12m 9s
123 actionable tasks: 10 executed, 113 up-to-date
Publishing build scan...
https://gradle.com/s/tktavpiqtpyfy
Build step 'Invoke Gradle script' changed build result to FAILURE
Build step 'Invoke Gradle script' marked build as failure
---------------------------------------------------------------------
To unsubscribe, e-mail: builds-unsubscribe@beam.apache.org
For additional commands, e-mail: builds-help@beam.apache.org
Jenkins build is back to normal :
beam_PostCommit_Java_Nexmark_Dataflow_V2_Java11 #491
Posted by Apache Jenkins Server <je...@builds.apache.org>.
See <https://ci-beam.apache.org/job/beam_PostCommit_Java_Nexmark_Dataflow_V2_Java11/491/display/redirect?page=changes>
---------------------------------------------------------------------
To unsubscribe, e-mail: builds-unsubscribe@beam.apache.org
For additional commands, e-mail: builds-help@beam.apache.org
beam_PostCommit_Java_Nexmark_Dataflow_V2_Java11 - Build # 490 -
Aborted!
Posted by Apache Jenkins Server <je...@builds.apache.org>.
beam_PostCommit_Java_Nexmark_Dataflow_V2_Java11 - Build # 490 - Aborted:
Check console output at https://ci-beam.apache.org/job/beam_PostCommit_Java_Nexmark_Dataflow_V2_Java11/490/ to view the results.
Build failed in Jenkins:
beam_PostCommit_Java_Nexmark_Dataflow_V2_Java11 #489
Posted by Apache Jenkins Server <je...@builds.apache.org>.
See <https://ci-beam.apache.org/job/beam_PostCommit_Java_Nexmark_Dataflow_V2_Java11/489/display/redirect?page=changes>
Changes:
[kawaigin] Implicitly watch and track anonymous pipeline and PCollections
[chamikaramj] Reject requests when parameter names cannot be validated unless
[chamikaramj] Updates error message
------------------------------------------
[...truncated 672.15 KB...]
2021-09-23T19:16:06.197Z no activity
2021-09-23T19:16:21.236Z RUNNING Query7
2021-09-23T19:16:21.982Z sample of 62.7 sec not long enough to calculate steady-state event rate
Sep 23, 2021 7:16:22 PM org.apache.beam.sdk.testutils.metrics.MetricsReader getCounterMetric
2021-09-23T19:16:22.042Z WARNING: streaming query appears to have been stuck for 56 min.
SEVERE: Failed to get metric fatal, from namespace Query7
2021-09-23T19:16:22.042Z no activity
2021-09-23T19:16:37.083Z RUNNING Query7
2021-09-23T19:16:37.855Z sample of 62.7 sec not long enough to calculate steady-state event rate
Sep 23, 2021 7:16:37 PM org.apache.beam.sdk.testutils.metrics.MetricsReader getCounterMetric
2021-09-23T19:16:37.934Z WARNING: streaming query appears to have been stuck for 56 min.
2021-09-23T19:16:37.934Z no activity
SEVERE: Failed to get metric fatal, from namespace Query7
2021-09-23T19:16:52.974Z RUNNING Query7
2021-09-23T19:16:53.745Z sample of 62.7 sec not long enough to calculate steady-state event rate
Sep 23, 2021 7:16:53 PM org.apache.beam.sdk.testutils.metrics.MetricsReader getCounterMetric
SEVERE: Failed to get metric fatal, from namespace Query7
2021-09-23T19:16:53.808Z WARNING: streaming query appears to have been stuck for 57 min.
2021-09-23T19:16:53.808Z no activity
2021-09-23T19:17:08.857Z RUNNING Query7
2021-09-23T19:17:09.626Z sample of 62.7 sec not long enough to calculate steady-state event rate
Sep 23, 2021 7:17:09 PM org.apache.beam.sdk.testutils.metrics.MetricsReader getCounterMetric
2021-09-23T19:17:09.710Z WARNING: streaming query appears to have been stuck for 57 min.
SEVERE: Failed to get metric fatal, from namespace Query7
2021-09-23T19:17:09.710Z no activity
2021-09-23T19:17:24.744Z RUNNING Query7
2021-09-23T19:17:25.411Z sample of 62.7 sec not long enough to calculate steady-state event rate
Sep 23, 2021 7:17:25 PM org.apache.beam.sdk.testutils.metrics.MetricsReader getCounterMetric
2021-09-23T19:17:25.480Z WARNING: streaming query appears to have been stuck for 57 min.
2021-09-23T19:17:25.480Z no activity
SEVERE: Failed to get metric fatal, from namespace Query7
2021-09-23T19:17:40.522Z RUNNING Query7
2021-09-23T19:17:42.050Z sample of 62.7 sec not long enough to calculate steady-state event rate
Sep 23, 2021 7:17:42 PM org.apache.beam.sdk.testutils.metrics.MetricsReader getCounterMetric
2021-09-23T19:17:42.118Z WARNING: streaming query appears to have been stuck for 57 min.
2021-09-23T19:17:42.118Z no activity
SEVERE: Failed to get metric fatal, from namespace Query7
2021-09-23T19:17:57.209Z RUNNING Query7
2021-09-23T19:17:57.913Z sample of 62.7 sec not long enough to calculate steady-state event rate
Sep 23, 2021 7:17:57 PM org.apache.beam.sdk.testutils.metrics.MetricsReader getCounterMetric
SEVERE: Failed to get metric fatal, from namespace Query7
2021-09-23T19:17:57.983Z WARNING: streaming query appears to have been stuck for 58 min.
2021-09-23T19:17:57.983Z no activity
2021-09-23T19:18:13.026Z RUNNING Query7
2021-09-23T19:18:13.844Z sample of 62.7 sec not long enough to calculate steady-state event rate
Sep 23, 2021 7:18:13 PM org.apache.beam.sdk.testutils.metrics.MetricsReader getCounterMetric
2021-09-23T19:18:13.927Z WARNING: streaming query appears to have been stuck for 58 min.
SEVERE: Failed to get metric fatal, from namespace Query7
2021-09-23T19:18:13.927Z no activity
2021-09-23T19:18:28.960Z RUNNING Query7
2021-09-23T19:18:30.473Z sample of 62.7 sec not long enough to calculate steady-state event rate
Sep 23, 2021 7:18:30 PM org.apache.beam.sdk.testutils.metrics.MetricsReader getCounterMetric
2021-09-23T19:18:30.642Z WARNING: streaming query appears to have been stuck for 58 min.
2021-09-23T19:18:30.642Z no activity
SEVERE: Failed to get metric fatal, from namespace Query7
2021-09-23T19:18:45.672Z RUNNING Query7
2021-09-23T19:18:46.611Z sample of 62.7 sec not long enough to calculate steady-state event rate
Sep 23, 2021 7:18:46 PM org.apache.beam.sdk.testutils.metrics.MetricsReader getCounterMetric
SEVERE: Failed to get metric fatal, from namespace Query7
2021-09-23T19:18:46.662Z WARNING: streaming query appears to have been stuck for 59 min.
2021-09-23T19:18:46.662Z no activity
2021-09-23T19:19:01.692Z RUNNING Query7
2021-09-23T19:19:02.398Z sample of 62.7 sec not long enough to calculate steady-state event rate
Sep 23, 2021 7:19:02 PM org.apache.beam.sdk.testutils.metrics.MetricsReader getCounterMetric
SEVERE: Failed to get metric fatal, from namespace Query7
2021-09-23T19:19:02.465Z WARNING: streaming query appears to have been stuck for 59 min.
2021-09-23T19:19:02.465Z no activity
2021-09-23T19:19:17.513Z RUNNING Query7
2021-09-23T19:19:18.207Z sample of 62.7 sec not long enough to calculate steady-state event rate
Sep 23, 2021 7:19:18 PM org.apache.beam.sdk.testutils.metrics.MetricsReader getCounterMetric
SEVERE: Failed to get metric fatal, from namespace Query7
2021-09-23T19:19:18.306Z WARNING: streaming query appears to have been stuck for 59 min.
2021-09-23T19:19:18.306Z no activity
2021-09-23T19:19:33.378Z RUNNING Query7
2021-09-23T19:19:34.119Z sample of 62.7 sec not long enough to calculate steady-state event rate
Sep 23, 2021 7:19:34 PM org.apache.beam.sdk.testutils.metrics.MetricsReader getCounterMetric
2021-09-23T19:19:34.182Z WARNING: streaming query appears to have been stuck for 59 min.
2021-09-23T19:19:34.182Z no activity
SEVERE: Failed to get metric fatal, from namespace Query7
2021-09-23T19:19:49.222Z RUNNING Query7
2021-09-23T19:19:50.009Z sample of 62.7 sec not long enough to calculate steady-state event rate
Sep 23, 2021 7:19:50 PM org.apache.beam.sdk.testutils.metrics.MetricsReader getCounterMetric
2021-09-23T19:19:50.085Z ERROR: streaming query appears to have been stuck for 60 minutes, cancelling job.
SEVERE: Failed to get metric fatal, from namespace Query7
2021-09-23T19:19:50.116Z no activity
2021-09-23T19:20:05.146Z RUNNING Query7 (waiting for shutdown)
2021-09-23T19:20:05.912Z sample of 62.7 sec not long enough to calculate steady-state event rate
2021-09-23T19:20:05.913Z no activity
2021-09-23T19:20:20.945Z RUNNING Query7 (waiting for shutdown)
2021-09-23T19:20:21.692Z sample of 62.7 sec not long enough to calculate steady-state event rate
2021-09-23T19:20:21.693Z no activity
2021-09-23T19:20:36.721Z RUNNING Query7 (waiting for shutdown)
2021-09-23T19:20:37.406Z sample of 62.7 sec not long enough to calculate steady-state event rate
2021-09-23T19:20:37.406Z no activity
2021-09-23T19:20:52.443Z RUNNING Query7 (waiting for shutdown)
2021-09-23T19:20:53.185Z sample of 62.7 sec not long enough to calculate steady-state event rate
2021-09-23T19:20:53.186Z no activity
2021-09-23T19:21:08.216Z RUNNING Query7 (waiting for shutdown)
2021-09-23T19:21:08.923Z sample of 62.7 sec not long enough to calculate steady-state event rate
2021-09-23T19:21:08.923Z no activity
2021-09-23T19:21:23.958Z RUNNING Query7 (waiting for shutdown)
2021-09-23T19:21:24.662Z sample of 62.7 sec not long enough to calculate steady-state event rate
2021-09-23T19:21:24.662Z no activity
2021-09-23T19:21:39.713Z RUNNING Query7 (waiting for shutdown)
2021-09-23T19:21:40.547Z sample of 62.7 sec not long enough to calculate steady-state event rate
2021-09-23T19:21:40.547Z no activity
2021-09-23T19:21:55.593Z RUNNING Query7 (waiting for shutdown)
2021-09-23T19:21:56.559Z sample of 62.7 sec not long enough to calculate steady-state event rate
2021-09-23T19:21:56.559Z no activity
2021-09-23T19:22:11.601Z RUNNING Query7 (waiting for shutdown)
2021-09-23T19:22:12.303Z sample of 62.7 sec not long enough to calculate steady-state event rate
2021-09-23T19:22:12.303Z no activity
2021-09-23T19:22:27.341Z CANCELLED Query7 (waiting for shutdown)
2021-09-23T19:22:27.375Z sample of 62.7 sec not long enough to calculate steady-state event rate
==========================================================================================
Run started 2021-09-23T18:11:13.694Z and ran for PT4273.682S
Default configuration:
{"debug":true,"query":null,"sourceType":"DIRECT","generateEventFilePathPrefix":null,"sinkType":"DEVNULL","exportSummaryToBigQuery":false,"pubSubMode":"COMBINED","pubsubMessageSerializationMethod":"CODER","sideInputType":"DIRECT","sideInputRowCount":500,"sideInputNumShards":3,"sideInputUrl":null,"sessionGap":600000,"numEvents":100000,"numEventGenerators":100,"rateShape":"SINE","firstEventRate":10000,"nextEventRate":10000,"rateUnit":"PER_SECOND","ratePeriodSec":600,"preloadSeconds":0,"streamTimeout":240,"isRateLimited":false,"useWallclockEventTime":false,"avgPersonByteSize":200,"avgAuctionByteSize":500,"avgBidByteSize":100,"hotAuctionRatio":2,"hotSellersRatio":4,"hotBiddersRatio":4,"windowSizeSec":10,"windowPeriodSec":5,"watermarkHoldbackSec":0,"numInFlightAuctions":100,"numActivePeople":1000,"coderStrategy":"HAND","cpuDelayMs":0,"diskBusyBytes":0,"auctionSkip":123,"fanout":5,"maxAuctionsWaitingTime":600,"occasionalDelaySec":3,"probDelayedEvent":0.1,"maxLogEvents":100000,"usePubsubPublishTime":false,"outOfOrderGroupSize":1,"numKeyBuckets":20000,"pardoCPUFactor":1.0}
Configurations:
Conf Description
0000 query:PASSTHROUGH; numEvents:10000000
0001 query:CURRENCY_CONVERSION; numEvents:10000000
0002 query:SELECTION; numEvents:10000000
0003 query:LOCAL_ITEM_SUGGESTION; numEvents:10000000
0004 query:AVERAGE_PRICE_FOR_CATEGORY; numEvents:1000000
0005 query:HOT_ITEMS; numEvents:10000000
0006 query:AVERAGE_SELLING_PRICE_BY_SELLER; numEvents:1000000
0007 query:HIGHEST_BID; numEvents:10000000
0008 query:MONITOR_NEW_USERS; numEvents:10000000
0009 query:WINNING_BIDS; numEvents:1000000
0010 query:LOG_TO_SHARDED_FILES; numEvents:10000000
0011 query:USER_SESSIONS; numEvents:10000000
0012 query:PROCESSING_TIME_WINDOWS; numEvents:10000000
0013 query:PORTABILITY_BATCH; numEvents:10000000
0014 query:BOUNDED_SIDE_INPUT_JOIN; numEvents:10000000
0015 query:SESSION_SIDE_INPUT_JOIN; numEvents:10000000
Performance:
Conf Runtime(sec) (Baseline) Events(/sec) (Baseline) Results (Baseline)
0000 40.4 209096.8 8443120
0001 32.3 234339.1 6973893
0002 22.3 416324.7 74772
0003 93.1 107437.9 59588
0004 *** not run ***
0005 464.6 21522.7 4567
0006 *** not run ***
0007 299.1 33321.9 100
*** Cancelling streaming job since it appeared stuck for 60 min. ***
0008 113.1 88425.9 92833
0009 *** not run ***
0010 142.5 69936.2 100
0011 400.9 24596.0 1813905
0012 129.3 76724.2 285923
0013 *** not run ***
0014 *** not run ***
0015 *** not run ***
==========================================================================================
==========================================================================================
Run started 2021-09-23T18:11:13.694Z and ran for PT4273.881S
Default configuration:
{"debug":true,"query":null,"sourceType":"DIRECT","generateEventFilePathPrefix":null,"sinkType":"DEVNULL","exportSummaryToBigQuery":false,"pubSubMode":"COMBINED","pubsubMessageSerializationMethod":"CODER","sideInputType":"DIRECT","sideInputRowCount":500,"sideInputNumShards":3,"sideInputUrl":null,"sessionGap":600000,"numEvents":100000,"numEventGenerators":100,"rateShape":"SINE","firstEventRate":10000,"nextEventRate":10000,"rateUnit":"PER_SECOND","ratePeriodSec":600,"preloadSeconds":0,"streamTimeout":240,"isRateLimited":false,"useWallclockEventTime":false,"avgPersonByteSize":200,"avgAuctionByteSize":500,"avgBidByteSize":100,"hotAuctionRatio":2,"hotSellersRatio":4,"hotBiddersRatio":4,"windowSizeSec":10,"windowPeriodSec":5,"watermarkHoldbackSec":0,"numInFlightAuctions":100,"numActivePeople":1000,"coderStrategy":"HAND","cpuDelayMs":0,"diskBusyBytes":0,"auctionSkip":123,"fanout":5,"maxAuctionsWaitingTime":600,"occasionalDelaySec":3,"probDelayedEvent":0.1,"maxLogEvents":100000,"usePubsubPublishTime":false,"outOfOrderGroupSize":1,"numKeyBuckets":20000,"pardoCPUFactor":1.0}
Configurations:
Conf Description
0000 query:PASSTHROUGH; numEvents:10000000
0001 query:CURRENCY_CONVERSION; numEvents:10000000
0002 query:SELECTION; numEvents:10000000
0003 query:LOCAL_ITEM_SUGGESTION; numEvents:10000000
0004 query:AVERAGE_PRICE_FOR_CATEGORY; numEvents:1000000
0005 query:HOT_ITEMS; numEvents:10000000
0006 query:AVERAGE_SELLING_PRICE_BY_SELLER; numEvents:1000000
0007 query:HIGHEST_BID; numEvents:10000000
0008 query:MONITOR_NEW_USERS; numEvents:10000000
0009 query:WINNING_BIDS; numEvents:1000000
0010 query:LOG_TO_SHARDED_FILES; numEvents:10000000
0011 query:USER_SESSIONS; numEvents:10000000
0012 query:PROCESSING_TIME_WINDOWS; numEvents:10000000
0013 query:PORTABILITY_BATCH; numEvents:10000000
0014 query:BOUNDED_SIDE_INPUT_JOIN; numEvents:10000000
0015 query:SESSION_SIDE_INPUT_JOIN; numEvents:10000000
Performance:
Conf Runtime(sec) (Baseline) Events(/sec) (Baseline) Results (Baseline)
0000 40.4 209096.8 8443120
0001 32.3 234339.1 6973893
0002 22.3 416324.7 74772
0003 93.1 107437.9 59588
0004 *** not run ***
0005 464.6 21522.7 4567
0006 *** not run ***
0007 299.1 33321.9 100
*** Cancelling streaming job since it appeared stuck for 60 min. ***
0008 113.1 88425.9 92833
0009 *** not run ***
0010 142.5 69936.2 100
0011 400.9 24596.0 1813905
0012 129.3 76724.2 285923
0013 *** not run ***
0014 *** not run ***
0015 *** not run ***
==========================================================================================
Exception in thread "main" java.lang.RuntimeException: Execution was not successful
at org.apache.beam.sdk.nexmark.Main.runAll(Main.java:186)
at org.apache.beam.sdk.nexmark.Main.main(Main.java:495)
> Task :sdks:java:testing:nexmark:run FAILED
> Task :runners:google-cloud-dataflow-java:cleanUpDockerImages
Untagged: us.gcr.io/apache-beam-testing/java-postcommit-it/java:20210923181037
Untagged: us.gcr.io/apache-beam-testing/java-postcommit-it/java@sha256:ac0135debf5abd7c77cfb35a67cf3dbf203f706aac9855346e05040df36b8015
Tag: [us.gcr.io/apache-beam-testing/java-postcommit-it/java:20210923181037]
- referencing digest: [us.gcr.io/apache-beam-testing/java-postcommit-it/java@sha256:ac0135debf5abd7c77cfb35a67cf3dbf203f706aac9855346e05040df36b8015]
Deleted [[us.gcr.io/apache-beam-testing/java-postcommit-it/java:20210923181037] (referencing [us.gcr.io/apache-beam-testing/java-postcommit-it/java@sha256:ac0135debf5abd7c77cfb35a67cf3dbf203f706aac9855346e05040df36b8015])].
Removing untagged image us.gcr.io/apache-beam-testing/java-postcommit-it/java@sha256:ac0135debf5abd7c77cfb35a67cf3dbf203f706aac9855346e05040df36b8015
Digests:
- us.gcr.io/apache-beam-testing/java-postcommit-it/java@sha256:ac0135debf5abd7c77cfb35a67cf3dbf203f706aac9855346e05040df36b8015
Deleted [us.gcr.io/apache-beam-testing/java-postcommit-it/java@sha256:ac0135debf5abd7c77cfb35a67cf3dbf203f706aac9855346e05040df36b8015].
FAILURE: Build failed with an exception.
* What went wrong:
Execution failed for task ':sdks:java:testing:nexmark:run'.
> Process 'command '/usr/lib/jvm/java-8-openjdk-amd64/bin/java'' finished with non-zero exit value 1
* Try:
Run with --stacktrace option to get the stack trace. Run with --info or --debug option to get more log output. Run with --scan to get full insights.
* Get more help at https://help.gradle.org
Deprecated Gradle features were used in this build, making it incompatible with Gradle 7.0.
Use '--warning-mode all' to show the individual deprecation warnings.
See https://docs.gradle.org/6.9.1/userguide/command_line_interface.html#sec:command_line_warnings
BUILD FAILED in 1h 11m 56s
123 actionable tasks: 10 executed, 113 up-to-date
Publishing build scan...
https://gradle.com/s/fajy4fh36dnqq
Build step 'Invoke Gradle script' changed build result to FAILURE
Build step 'Invoke Gradle script' marked build as failure
---------------------------------------------------------------------
To unsubscribe, e-mail: builds-unsubscribe@beam.apache.org
For additional commands, e-mail: builds-help@beam.apache.org
beam_PostCommit_Java_Nexmark_Dataflow_V2_Java11 - Build # 488 -
Aborted!
Posted by Apache Jenkins Server <je...@builds.apache.org>.
beam_PostCommit_Java_Nexmark_Dataflow_V2_Java11 - Build # 488 - Aborted:
Check console output at https://ci-beam.apache.org/job/beam_PostCommit_Java_Nexmark_Dataflow_V2_Java11/488/ to view the results.