You are viewing a plain text version of this content. The canonical link for it is here.
Posted to builds@beam.apache.org by Apache Jenkins Server <je...@builds.apache.org> on 2023/12/12 22:51:43 UTC

Build failed in Jenkins: beam_PostCommit_Python310 #1656

See <https://ci-beam.apache.org/job/beam_PostCommit_Python310/1656/display/redirect>

Changes:


------------------------------------------
[...truncated 12.96 MB...]
Traceback (most recent call last):
  File "<https://ci-beam.apache.org/job/beam_PostCommit_Python310/ws/src/sdks/python/apache_beam/runners/worker/data_plane.py",> line 669, in _read_inputs
    for elements in elements_iterator:
  File "<https://ci-beam.apache.org/job/beam_PostCommit_Python310/ws/src/build/gradleenv/-1720702907/lib/python3.10/site-packages/grpc/_channel.py",> line 540, in __next__
    return self._next()
  File "<https://ci-beam.apache.org/job/beam_PostCommit_Python310/ws/src/build/gradleenv/-1720702907/lib/python3.10/site-packages/grpc/_channel.py",> line 966, in _next
    raise self
grpc._channel._MultiThreadedRendezvous: <_MultiThreadedRendezvous of RPC that terminated with:
	status = StatusCode.UNAVAILABLE
	details = "recvmsg:Connection reset by peer"
	debug_error_string = "UNKNOWN:Error received from peer ipv6:%5B::1%5D:37505 {created_time:"2023-12-12T21:30:06.442764396+00:00", grpc_status:14, grpc_message:"recvmsg:Connection reset by peer"}"
>
Exception in thread read_grpc_client_inputs:
Traceback (most recent call last):
  File "/usr/lib/python3.10/threading.py", line 1009, in _bootstrap_inner
    self._target(*self._args, **self._kwargs)
  File "<https://ci-beam.apache.org/job/beam_PostCommit_Python310/ws/src/sdks/python/apache_beam/runners/worker/sdk_worker.py",> line 265, in run
    for response in responses:
    self.run()
  File "<https://ci-beam.apache.org/job/beam_PostCommit_Python310/ws/src/build/gradleenv/-1720702907/lib/python3.10/site-packages/grpc/_channel.py",> line 540, in __next__
    for work_request in self._control_stub.Control(get_responses()):
  File "/usr/lib/python3.10/threading.py", line 946, in run
  File "<https://ci-beam.apache.org/job/beam_PostCommit_Python310/ws/src/build/gradleenv/-1720702907/lib/python3.10/site-packages/grpc/_channel.py",> line 540, in __next__
    self._target(*self._args, **self._kwargs)
    return self._next()
    return self._next()
  File "<https://ci-beam.apache.org/job/beam_PostCommit_Python310/ws/src/build/gradleenv/-1720702907/lib/python3.10/site-packages/grpc/_channel.py",> line 966, in _next
  File "<https://ci-beam.apache.org/job/beam_PostCommit_Python310/ws/src/build/gradleenv/-1720702907/lib/python3.10/site-packages/grpc/_channel.py",> line 966, in _next
  File "<https://ci-beam.apache.org/job/beam_PostCommit_Python310/ws/src/sdks/python/apache_beam/runners/worker/data_plane.py",> line 686, in <lambda>
    raise self
grpc._channel._MultiThreadedRendezvous: <_MultiThreadedRendezvous of RPC that terminated with:
	status = StatusCode.UNAVAILABLE
	details = "Socket closed"
	debug_error_string = "UNKNOWN:Error received from peer ipv6:%5B::1%5D:45973 {grpc_message:"Socket closed", grpc_status:14, created_time:"2023-12-12T21:30:06.442770091+00:00"}"
>
    target=lambda: self._read_inputs(elements_iterator),
    raise self
  File "<https://ci-beam.apache.org/job/beam_PostCommit_Python310/ws/src/sdks/python/apache_beam/runners/worker/data_plane.py",> line 669, in _read_inputs
grpc._channel._MultiThreadedRendezvous: <_MultiThreadedRendezvous of RPC that terminated with:
	status = StatusCode.UNAVAILABLE
	details = "Socket closed"
	debug_error_string = "UNKNOWN:Error received from peer ipv6:%5B::1%5D:46517 {created_time:"2023-12-12T21:30:06.442775582+00:00", grpc_status:14, grpc_message:"Socket closed"}"
>
    for elements in elements_iterator:
  File "<https://ci-beam.apache.org/job/beam_PostCommit_Python310/ws/src/build/gradleenv/-1720702907/lib/python3.10/site-packages/grpc/_channel.py",> line 540, in __next__
    return self._next()
  File "<https://ci-beam.apache.org/job/beam_PostCommit_Python310/ws/src/build/gradleenv/-1720702907/lib/python3.10/site-packages/grpc/_channel.py",> line 966, in _next
    raise self
grpc._channel._MultiThreadedRendezvous: <_MultiThreadedRendezvous of RPC that terminated with:
	status = StatusCode.UNAVAILABLE
	details = "recvmsg:Connection reset by peer"
	debug_error_string = "UNKNOWN:Error received from peer ipv6:%5B::1%5D:37505 {created_time:"2023-12-12T21:30:06.442764396+00:00", grpc_status:14, grpc_message:"recvmsg:Connection reset by peer"}"
>

> Task :sdks:python:test-suites:dataflow:py310:postCommitIT

[gw0] PASSED apache_beam/ml/inference/sklearn_inference_it_test.py::SklearnInference::test_sklearn_mnist_classification 
apache_beam/ml/inference/sklearn_inference_it_test.py::SklearnInference::test_sklearn_mnist_classification_large_model 
[gw5] PASSED apache_beam/io/gcp/bigquery_io_read_it_test.py::BigqueryIOReadIT::test_bigquery_read_1M_python 
apache_beam/io/gcp/bigquery_io_read_it_test.py::BigqueryIOReadIT::test_bigquery_read_custom_1M_python 
[gw1] PASSED apache_beam/dataframe/io_it_test.py::ReadUsingReadGbqTests::test_ReadGbq_export_with_project 
apache_beam/dataframe/io_it_test.py::ReadUsingReadGbqTests::test_ReadGbq_with_computation 
[gw6] PASSED apache_beam/io/gcp/bigquery_write_it_test.py::BigQueryWriteIntegrationTests::test_big_query_write_new_types 
apache_beam/io/gcp/bigquery_write_it_test.py::BigQueryWriteIntegrationTests::test_big_query_write_schema_autodetect 
[gw6] SKIPPED apache_beam/io/gcp/bigquery_write_it_test.py::BigQueryWriteIntegrationTests::test_big_query_write_schema_autodetect 
apache_beam/io/gcp/bigquery_write_it_test.py::BigQueryWriteIntegrationTests::test_big_query_write_without_schema 
[gw4] PASSED apache_beam/io/gcp/bigquery_read_it_test.py::ReadTests::test_table_schema_retrieve_specifying_only_table 
apache_beam/io/gcp/bigquery_read_it_test.py::ReadTests::test_table_schema_retrieve_with_direct_read 
[gw7] PASSED apache_beam/io/gcp/big_query_query_to_table_it_test.py::BigQueryQueryToTableIT::test_big_query_standard_sql 
apache_beam/examples/dataframe/taxiride_it_test.py::TaxirideIT::test_aggregation 
[gw0] PASSED apache_beam/ml/inference/sklearn_inference_it_test.py::SklearnInference::test_sklearn_mnist_classification_large_model 
apache_beam/ml/inference/sklearn_inference_it_test.py::SklearnInference::test_sklearn_regression 
[gw5] PASSED apache_beam/io/gcp/bigquery_io_read_it_test.py::BigqueryIOReadIT::test_bigquery_read_custom_1M_python 
apache_beam/io/gcp/gcsio_integration_test.py::GcsIOIntegrationTest::test_batch_copy_and_delete 
[gw5] PASSED apache_beam/io/gcp/gcsio_integration_test.py::GcsIOIntegrationTest::test_batch_copy_and_delete 
apache_beam/io/gcp/gcsio_integration_test.py::GcsIOIntegrationTest::test_copy 
[gw5] PASSED apache_beam/io/gcp/gcsio_integration_test.py::GcsIOIntegrationTest::test_copy 
apache_beam/examples/streaming_wordcount_debugging_it_test.py::StreamingWordcountDebuggingIT::test_streaming_wordcount_debugging_it 
[gw5] SKIPPED apache_beam/examples/streaming_wordcount_debugging_it_test.py::StreamingWordcountDebuggingIT::test_streaming_wordcount_debugging_it 
apache_beam/examples/streaming_wordcount_it_test.py::StreamingWordCountIT::test_streaming_wordcount_it 
[gw1] PASSED apache_beam/dataframe/io_it_test.py::ReadUsingReadGbqTests::test_ReadGbq_with_computation 
apache_beam/io/gcp/pubsub_integration_test.py::PubSubIntegrationTest::test_streaming_data_only 
[gw2] PASSED apache_beam/io/gcp/bigquery_json_it_test.py::BigQueryJsonIT::test_streaming_inserts 
apache_beam/examples/wordcount_it_test.py::WordCountIT::test_wordcount_impersonation_it 
[gw6] PASSED apache_beam/io/gcp/bigquery_write_it_test.py::BigQueryWriteIntegrationTests::test_big_query_write_without_schema 
apache_beam/ml/gcp/cloud_dlp_it_test.py::CloudDLPIT::test_deidentification 
[gw4] PASSED apache_beam/io/gcp/bigquery_read_it_test.py::ReadTests::test_table_schema_retrieve_with_direct_read 
apache_beam/io/gcp/bigquery_read_it_test.py::ReadUsingStorageApiTests::test_iobase_source 
[gw3] PASSED apache_beam/io/gcp/bigquery_test.py::PubSubBigQueryIT::test_file_loads 
apache_beam/io/gcp/bigquery_test.py::PubSubBigQueryIT::test_streaming_inserts 
[gw0] PASSED apache_beam/ml/inference/sklearn_inference_it_test.py::SklearnInference::test_sklearn_regression 
apache_beam/io/gcp/healthcare/dicomio_integration_test.py::DICOMIoIntegrationTest::test_dicom_search_instances 
[gw6] PASSED apache_beam/ml/gcp/cloud_dlp_it_test.py::CloudDLPIT::test_deidentification 
apache_beam/ml/gcp/cloud_dlp_it_test.py::CloudDLPIT::test_inspection 
[gw7] PASSED apache_beam/examples/dataframe/taxiride_it_test.py::TaxirideIT::test_aggregation 
apache_beam/examples/dataframe/taxiride_it_test.py::TaxirideIT::test_enrich 
[gw2] PASSED apache_beam/examples/wordcount_it_test.py::WordCountIT::test_wordcount_impersonation_it 
apache_beam/examples/wordcount_it_test.py::WordCountIT::test_wordcount_it 
[gw4] PASSED apache_beam/io/gcp/bigquery_read_it_test.py::ReadUsingStorageApiTests::test_iobase_source 
apache_beam/io/gcp/bigquery_read_it_test.py::ReadUsingStorageApiTests::test_iobase_source_with_column_selection 
[gw0] PASSED apache_beam/io/gcp/healthcare/dicomio_integration_test.py::DICOMIoIntegrationTest::test_dicom_search_instances 
apache_beam/io/gcp/healthcare/dicomio_integration_test.py::DICOMIoIntegrationTest::test_dicom_store_instance_from_gcs 
[gw6] PASSED apache_beam/ml/gcp/cloud_dlp_it_test.py::CloudDLPIT::test_inspection 
apache_beam/examples/complete/game/user_score_it_test.py::UserScoreIT::test_user_score_it 
[gw1] PASSED apache_beam/io/gcp/pubsub_integration_test.py::PubSubIntegrationTest::test_streaming_data_only 
apache_beam/io/gcp/pubsub_integration_test.py::PubSubIntegrationTest::test_streaming_with_attributes 
[gw4] PASSED apache_beam/io/gcp/bigquery_read_it_test.py::ReadUsingStorageApiTests::test_iobase_source_with_column_selection 
apache_beam/io/gcp/bigquery_read_it_test.py::ReadUsingStorageApiTests::test_iobase_source_with_column_selection_and_row_restriction 
[gw2] PASSED apache_beam/examples/wordcount_it_test.py::WordCountIT::test_wordcount_it 
apache_beam/examples/complete/game/leader_board_it_test.py::LeaderBoardIT::test_leader_board_it 
[gw5] PASSED apache_beam/examples/streaming_wordcount_it_test.py::StreamingWordCountIT::test_streaming_wordcount_it 
apache_beam/examples/complete/autocomplete_test.py::AutocompleteTest::test_autocomplete_it 
[gw0] PASSED apache_beam/io/gcp/healthcare/dicomio_integration_test.py::DICOMIoIntegrationTest::test_dicom_store_instance_from_gcs 
apache_beam/examples/cookbook/bigquery_tornadoes_it_test.py::BigqueryTornadoesIT::test_bigquery_tornadoes_it 
[gw4] PASSED apache_beam/io/gcp/bigquery_read_it_test.py::ReadUsingStorageApiTests::test_iobase_source_with_column_selection_and_row_restriction 
apache_beam/io/gcp/bigquery_read_it_test.py::ReadUsingStorageApiTests::test_iobase_source_with_column_selection_and_row_restriction_rows 
[gw5] PASSED apache_beam/examples/complete/autocomplete_test.py::AutocompleteTest::test_autocomplete_it 
apache_beam/examples/complete/game/game_stats_it_test.py::GameStatsIT::test_game_stats_it 
[gw3] PASSED apache_beam/io/gcp/bigquery_test.py::PubSubBigQueryIT::test_streaming_inserts 
apache_beam/io/gcp/bigquery_test.py::BigQueryFileLoadsIntegrationTests::test_avro_file_load 
[gw0] PASSED apache_beam/examples/cookbook/bigquery_tornadoes_it_test.py::BigqueryTornadoesIT::test_bigquery_tornadoes_it 
apache_beam/io/fileio_test.py::MatchIntegrationTest::test_transform_on_gcs 
[gw1] PASSED apache_beam/io/gcp/pubsub_integration_test.py::PubSubIntegrationTest::test_streaming_with_attributes 
apache_beam/examples/complete/game/hourly_team_score_it_test.py::HourlyTeamScoreIT::test_hourly_team_score_it 
[gw4] PASSED apache_beam/io/gcp/bigquery_read_it_test.py::ReadUsingStorageApiTests::test_iobase_source_with_column_selection_and_row_restriction_rows 
apache_beam/io/gcp/bigquery_read_it_test.py::ReadUsingStorageApiTests::test_iobase_source_with_native_datetime 
[gw6] PASSED apache_beam/examples/complete/game/user_score_it_test.py::UserScoreIT::test_user_score_it 
apache_beam/examples/cookbook/datastore_wordcount_it_test.py::DatastoreWordCountIT::test_datastore_wordcount_it 
[gw2] PASSED apache_beam/examples/complete/game/leader_board_it_test.py::LeaderBoardIT::test_leader_board_it 
apache_beam/examples/inference/tfx_bsl/tfx_bsl_inference_it_test.py::TFXRunInferenceTests::test_tfx_run_inference_mobilenetv2 
[gw2] SKIPPED apache_beam/examples/inference/tfx_bsl/tfx_bsl_inference_it_test.py::TFXRunInferenceTests::test_tfx_run_inference_mobilenetv2 
apache_beam/ml/gcp/naturallanguageml_test_it.py::NaturalLanguageMlTestIT::test_analyzing_syntax 
[gw2] SKIPPED apache_beam/ml/gcp/naturallanguageml_test_it.py::NaturalLanguageMlTestIT::test_analyzing_syntax 
[gw7] PASSED apache_beam/examples/dataframe/taxiride_it_test.py::TaxirideIT::test_enrich 
apache_beam/examples/fastavro_it_test.py::FastavroIT::test_avro_it 
[gw0] PASSED apache_beam/io/fileio_test.py::MatchIntegrationTest::test_transform_on_gcs 
apache_beam/ml/gcp/visionml_test_it.py::VisionMlTestIT::test_text_detection_with_language_hint 
[gw3] PASSED apache_beam/io/gcp/bigquery_test.py::BigQueryFileLoadsIntegrationTests::test_avro_file_load 
apache_beam/examples/complete/juliaset/juliaset/juliaset_test_it.py::JuliaSetTestIT::test_run_example_with_setup_file 
[gw4] PASSED apache_beam/io/gcp/bigquery_read_it_test.py::ReadUsingStorageApiTests::test_iobase_source_with_native_datetime 
apache_beam/io/gcp/bigquery_read_it_test.py::ReadUsingStorageApiTests::test_iobase_source_with_query <https://ci-beam.apache.org/job/beam_PostCommit_Python310/ws/src/build/gradleenv/2050596098/bin/python3.10>: No module named build
warning: sdist: standard file not found: should have one of README, README.rst, README.txt, README.md

warning: check: missing required meta-data: url

warning: check: missing meta-data: either (author and author_email) or (maintainer and maintainer_email) should be supplied


[gw6] PASSED apache_beam/examples/cookbook/datastore_wordcount_it_test.py::DatastoreWordCountIT::test_datastore_wordcount_it 
apache_beam/io/parquetio_it_test.py::TestParquetIT::test_parquetio_it 
[gw0] PASSED apache_beam/ml/gcp/visionml_test_it.py::VisionMlTestIT::test_text_detection_with_language_hint 
apache_beam/runners/dataflow/dataflow_exercise_metrics_pipeline_test.py::ExerciseMetricsPipelineTest::test_metrics_it 
[gw0] SKIPPED apache_beam/runners/dataflow/dataflow_exercise_metrics_pipeline_test.py::ExerciseMetricsPipelineTest::test_metrics_it 
[gw5] PASSED apache_beam/examples/complete/game/game_stats_it_test.py::GameStatsIT::test_game_stats_it 
apache_beam/ml/gcp/videointelligenceml_test_it.py::VideoIntelligenceMlTestIT::test_label_detection_with_video_context 
[gw5] SKIPPED apache_beam/ml/gcp/videointelligenceml_test_it.py::VideoIntelligenceMlTestIT::test_label_detection_with_video_context 
apache_beam/ml/inference/base_test.py::RunInferenceBaseTest::test_run_inference_with_side_inputin_streaming 
[gw5] SKIPPED apache_beam/ml/inference/base_test.py::RunInferenceBaseTest::test_run_inference_with_side_inputin_streaming 
[gw4] PASSED apache_beam/io/gcp/bigquery_read_it_test.py::ReadUsingStorageApiTests::test_iobase_source_with_query 
apache_beam/io/gcp/bigquery_read_it_test.py::ReadUsingStorageApiTests::test_iobase_source_with_query_and_filters 
[gw3] PASSED apache_beam/examples/complete/juliaset/juliaset/juliaset_test_it.py::JuliaSetTestIT::test_run_example_with_setup_file 
apache_beam/ml/inference/onnx_inference_it_test.py::OnnxInference::test_onnx_run_inference_roberta_sentiment_classification 
[gw3] SKIPPED apache_beam/ml/inference/onnx_inference_it_test.py::OnnxInference::test_onnx_run_inference_roberta_sentiment_classification 
[gw6] PASSED apache_beam/io/parquetio_it_test.py::TestParquetIT::test_parquetio_it 
apache_beam/transforms/periodicsequence_it_test.py::PeriodicSequenceIT::test_periodicsequence_outputs_valid_watermarks_it 
[gw6] SKIPPED apache_beam/transforms/periodicsequence_it_test.py::PeriodicSequenceIT::test_periodicsequence_outputs_valid_watermarks_it 
[gw1] PASSED apache_beam/examples/complete/game/hourly_team_score_it_test.py::HourlyTeamScoreIT::test_hourly_team_score_it 
apache_beam/io/gcp/datastore/v1new/datastore_write_it_test.py::DatastoreWriteIT::test_datastore_write_limit 
[gw7] PASSED apache_beam/examples/fastavro_it_test.py::FastavroIT::test_avro_it 
apache_beam/examples/dataframe/flight_delays_it_test.py::FlightDelaysTest::test_flight_delays 
[gw4] PASSED apache_beam/io/gcp/bigquery_read_it_test.py::ReadUsingStorageApiTests::test_iobase_source_with_query_and_filters 
apache_beam/io/gcp/bigquery_read_it_test.py::ReadUsingStorageApiTests::test_iobase_source_with_row_restriction 
[gw7] PASSED apache_beam/examples/dataframe/flight_delays_it_test.py::FlightDelaysTest::test_flight_delays 
[gw4] PASSED apache_beam/io/gcp/bigquery_read_it_test.py::ReadUsingStorageApiTests::test_iobase_source_with_row_restriction 
apache_beam/io/gcp/bigquery_read_it_test.py::ReadUsingStorageApiTests::test_iobase_source_with_very_selective_filters 
[gw4] PASSED apache_beam/io/gcp/bigquery_read_it_test.py::ReadUsingStorageApiTests::test_iobase_source_with_very_selective_filters 
apache_beam/io/gcp/bigquery_read_it_test.py::ReadNewTypesTests::test_iobase_source 
[gw4] PASSED apache_beam/io/gcp/bigquery_read_it_test.py::ReadNewTypesTests::test_iobase_source 
apache_beam/io/gcp/bigquery_read_it_test.py::ReadNewTypesTests::test_native_source 
[gw1] PASSED apache_beam/io/gcp/datastore/v1new/datastore_write_it_test.py::DatastoreWriteIT::test_datastore_write_limit 
apache_beam/transforms/external_it_test.py::ExternalTransformIT::test_job_python_from_python_it 
[gw4] PASSED apache_beam/io/gcp/bigquery_read_it_test.py::ReadNewTypesTests::test_native_source 
apache_beam/io/gcp/bigquery_read_it_test.py::ReadAllBQTests::test_read_queries 
[gw1] PASSED apache_beam/transforms/external_it_test.py::ExternalTransformIT::test_job_python_from_python_it 
[gw4] PASSED apache_beam/io/gcp/bigquery_read_it_test.py::ReadAllBQTests::test_read_queries 
apache_beam/io/gcp/bigquery_read_it_test.py::ReadInteractiveRunnerTests::test_read_in_interactive_runner 
[gw4] PASSED apache_beam/io/gcp/bigquery_read_it_test.py::ReadInteractiveRunnerTests::test_read_in_interactive_runner 

=============================== warnings summary ===============================
apache_beam/io/gcp/bigquery.py:2603
  <https://ci-beam.apache.org/job/beam_PostCommit_Python310/ws/src/sdks/python/apache_beam/io/gcp/bigquery.py>:2603: DeprecationWarning: invalid escape sequence '\#'
    """Read data from BigQuery.

apache_beam/io/gcp/bigquery_read_it_test.py::ReadTests::test_native_source
  <https://ci-beam.apache.org/job/beam_PostCommit_Python310/ws/src/sdks/python/apache_beam/io/gcp/bigquery_read_it_test.py>:170: BeamDeprecationWarning: BigQuerySource is deprecated since 2.25.0. Use ReadFromBigQuery instead.
    beam.io.BigQuerySource(query=self.query, use_standard_sql=True)))

apache_beam/io/gcp/bigquery_test.py::PubSubBigQueryIT::test_file_loads
apache_beam/io/gcp/bigquery_test.py::PubSubBigQueryIT::test_streaming_inserts
apache_beam/examples/complete/game/leader_board_it_test.py::LeaderBoardIT::test_leader_board_it
apache_beam/examples/complete/game/game_stats_it_test.py::GameStatsIT::test_game_stats_it
apache_beam/examples/complete/game/hourly_team_score_it_test.py::HourlyTeamScoreIT::test_hourly_team_score_it
  <https://ci-beam.apache.org/job/beam_PostCommit_Python310/ws/src/sdks/python/apache_beam/io/gcp/tests/utils.py>:63: PendingDeprecationWarning: Client.dataset is deprecated and will be removed in a future version. Use a string like 'my_project.my_dataset' or a cloud.google.bigquery.DatasetReference object, instead.
    dataset_ref = client.dataset(unique_dataset_name, project=project)

apache_beam/examples/cookbook/bigquery_tornadoes_it_test.py::BigqueryTornadoesIT::test_bigquery_tornadoes_it
  <https://ci-beam.apache.org/job/beam_PostCommit_Python310/ws/src/sdks/python/apache_beam/io/gcp/tests/utils.py>:100: PendingDeprecationWarning: Client.dataset is deprecated and will be removed in a future version. Use a string like 'my_project.my_dataset' or a cloud.google.bigquery.DatasetReference object, instead.
    table_ref = client.dataset(dataset_id).table(table_id)

apache_beam/examples/dataframe/flight_delays_it_test.py::FlightDelaysTest::test_flight_delays
  <https://ci-beam.apache.org/job/beam_PostCommit_Python310/ws/src/sdks/python/apache_beam/examples/dataframe/flight_delays.py>:47: FutureWarning: The default value of numeric_only in DataFrame.mean is deprecated. In a future version, it will default to False. In addition, specifying 'numeric_only=None' is deprecated. Select only valid columns or specify the value of numeric_only to silence this warning.
    return airline_df[at_top_airports].mean()

apache_beam/io/gcp/bigquery_read_it_test.py::ReadNewTypesTests::test_native_source
  <https://ci-beam.apache.org/job/beam_PostCommit_Python310/ws/src/sdks/python/apache_beam/io/gcp/bigquery_read_it_test.py>:706: BeamDeprecationWarning: BigQuerySource is deprecated since 2.25.0. Use ReadFromBigQuery instead.
    beam.io.BigQuerySource(query=self.query, use_standard_sql=True)))

-- Docs: https://docs.pytest.org/en/stable/how-to/capture-warnings.html
- generated xml file: <https://ci-beam.apache.org/job/beam_PostCommit_Python310/ws/src/sdks/python/pytest_postCommitIT-df-py310.xml> -
=========== 83 passed, 49 skipped, 10 warnings in 6094.21s (1:41:34) ===========

FAILURE: Build failed with an exception.

* Where:
Script '<https://ci-beam.apache.org/job/beam_PostCommit_Python310/ws/src/sdks/python/test-suites/portable/common.gradle'> line: 326

* What went wrong:
Execution failed for task ':sdks:python:test-suites:portable:py310:postCommitPy310IT'.
> Process 'command 'sh'' finished with non-zero exit value 1

* Try:
> Run with --stacktrace option to get the stack trace.
> Run with --info or --debug option to get more log output.
> Get more help at https://help.gradle.org.

Deprecated Gradle features were used in this build, making it incompatible with Gradle 9.0.

You can use '--warning-mode all' to show the individual deprecation warnings and determine if they come from your own scripts or plugins.

For more on this, please refer to https://docs.gradle.org/8.4/userguide/command_line_interface.html#sec:command_line_warnings in the Gradle documentation.

BUILD FAILED in 1h 47m 59s
217 actionable tasks: 155 executed, 58 from cache, 4 up-to-date

Publishing build scan...
https://ge.apache.org/s/2kkhd7nwzbr4k

Build step 'Invoke Gradle script' changed build result to FAILURE
Build step 'Invoke Gradle script' marked build as failure

---------------------------------------------------------------------
To unsubscribe, e-mail: builds-unsubscribe@beam.apache.org
For additional commands, e-mail: builds-help@beam.apache.org


Jenkins build is back to normal : beam_PostCommit_Python310 #1663

Posted by Apache Jenkins Server <je...@builds.apache.org>.
See <https://ci-beam.apache.org/job/beam_PostCommit_Python310/1663/display/redirect>


---------------------------------------------------------------------
To unsubscribe, e-mail: builds-unsubscribe@beam.apache.org
For additional commands, e-mail: builds-help@beam.apache.org


Build failed in Jenkins: beam_PostCommit_Python310 #1662

Posted by Apache Jenkins Server <je...@builds.apache.org>.
See <https://ci-beam.apache.org/job/beam_PostCommit_Python310/1662/display/redirect>

Changes:


------------------------------------------
[...truncated 7.60 MB...]
  File "apache_beam/runners/common.py", line 636, in apache_beam.runners.common.SimpleInvoker.invoke_process
  File "apache_beam/runners/common.py", line 1611, in apache_beam.runners.common._OutputHandler.handle_process_outputs
  File "/opt/apache/beam-venv/beam-venv-worker-sdk-0-0/lib/python3.10/site-packages/apache_beam/io/filebasedsource.py", line 391, in process
    for record in source.read(range.new_tracker()):
RuntimeError: generator raised StopIteration

During handling of the above exception, another exception occurred:

Traceback (most recent call last):
  File "/opt/apache/beam-venv/beam-venv-worker-sdk-0-0/lib/python3.10/site-packages/apache_beam/runners/worker/sdk_worker.py", line 300, in _execute
    response = task()
  File "/opt/apache/beam-venv/beam-venv-worker-sdk-0-0/lib/python3.10/site-packages/apache_beam/runners/worker/sdk_worker.py", line 375, in <lambda>
    lambda: self.create_worker().do_instruction(request), request)
  File "/opt/apache/beam-venv/beam-venv-worker-sdk-0-0/lib/python3.10/site-packages/apache_beam/runners/worker/sdk_worker.py", line 639, in do_instruction
    return getattr(self, request_type)(
  File "/opt/apache/beam-venv/beam-venv-worker-sdk-0-0/lib/python3.10/site-packages/apache_beam/runners/worker/sdk_worker.py", line 677, in process_bundle
    bundle_processor.process_bundle(instruction_id))
  File "/opt/apache/beam-venv/beam-venv-worker-sdk-0-0/lib/python3.10/site-packages/apache_beam/runners/worker/bundle_processor.py", line 1113, in process_bundle
    input_op_by_transform_id[element.transform_id].process_encoded(
  File "/opt/apache/beam-venv/beam-venv-worker-sdk-0-0/lib/python3.10/site-packages/apache_beam/runners/worker/bundle_processor.py", line 237, in process_encoded
    self.output(decoded_value)
  File "apache_beam/runners/worker/operations.py", line 570, in apache_beam.runners.worker.operations.Operation.output
  File "apache_beam/runners/worker/operations.py", line 572, in apache_beam.runners.worker.operations.Operation.output
  File "apache_beam/runners/worker/operations.py", line 263, in apache_beam.runners.worker.operations.SingletonElementConsumerSet.receive
  File "apache_beam/runners/worker/operations.py", line 266, in apache_beam.runners.worker.operations.SingletonElementConsumerSet.receive
  File "apache_beam/runners/worker/operations.py", line 953, in apache_beam.runners.worker.operations.DoOperation.process
  File "apache_beam/runners/worker/operations.py", line 954, in apache_beam.runners.worker.operations.DoOperation.process
  File "apache_beam/runners/common.py", line 1437, in apache_beam.runners.common.DoFnRunner.process
  File "apache_beam/runners/common.py", line 1526, in apache_beam.runners.common.DoFnRunner._reraise_augmented
  File "apache_beam/runners/common.py", line 1435, in apache_beam.runners.common.DoFnRunner.process
  File "apache_beam/runners/common.py", line 636, in apache_beam.runners.common.SimpleInvoker.invoke_process
  File "apache_beam/runners/common.py", line 1621, in apache_beam.runners.common._OutputHandler.handle_process_outputs
  File "apache_beam/runners/common.py", line 1734, in apache_beam.runners.common._OutputHandler._write_value_to_tag
  File "apache_beam/runners/worker/operations.py", line 266, in apache_beam.runners.worker.operations.SingletonElementConsumerSet.receive
  File "apache_beam/runners/worker/operations.py", line 953, in apache_beam.runners.worker.operations.DoOperation.process
  File "apache_beam/runners/worker/operations.py", line 954, in apache_beam.runners.worker.operations.DoOperation.process
  File "apache_beam/runners/common.py", line 1437, in apache_beam.runners.common.DoFnRunner.process
  File "apache_beam/runners/common.py", line 1526, in apache_beam.runners.common.DoFnRunner._reraise_augmented
  File "apache_beam/runners/common.py", line 1435, in apache_beam.runners.common.DoFnRunner.process
  File "apache_beam/runners/common.py", line 636, in apache_beam.runners.common.SimpleInvoker.invoke_process
  File "apache_beam/runners/common.py", line 1621, in apache_beam.runners.common._OutputHandler.handle_process_outputs
  File "apache_beam/runners/common.py", line 1734, in apache_beam.runners.common._OutputHandler._write_value_to_tag
  File "apache_beam/runners/worker/operations.py", line 266, in apache_beam.runners.worker.operations.SingletonElementConsumerSet.receive
  File "apache_beam/runners/worker/operations.py", line 953, in apache_beam.runners.worker.operations.DoOperation.process
  File "apache_beam/runners/worker/operations.py", line 954, in apache_beam.runners.worker.operations.DoOperation.process
  File "apache_beam/runners/common.py", line 1437, in apache_beam.runners.common.DoFnRunner.process
  File "apache_beam/runners/common.py", line 1547, in apache_beam.runners.common.DoFnRunner._reraise_augmented
  File "apache_beam/runners/common.py", line 1435, in apache_beam.runners.common.DoFnRunner.process
  File "apache_beam/runners/common.py", line 636, in apache_beam.runners.common.SimpleInvoker.invoke_process
  File "apache_beam/runners/common.py", line 1611, in apache_beam.runners.common._OutputHandler.handle_process_outputs
  File "/opt/apache/beam-venv/beam-venv-worker-sdk-0-0/lib/python3.10/site-packages/apache_beam/io/filebasedsource.py", line 391, in process
    for record in source.read(range.new_tracker()):
RuntimeError: generator raised StopIteration [while running 'read-fastavro/read-fastavro/ReadRange-ptransform-59']

      Worker ID: beamapp-jenkins-121410015-12140207-8lce-harness-rqzk,

      Root cause: Traceback (most recent call last):
  File "/opt/apache/beam-venv/beam-venv-worker-sdk-0-0/lib/python3.10/site-packages/apache_beam/io/avroio.py", line 348, in read_records
    block = next(blocks)
  File "fastavro/_read.pyx", line 1081, in fastavro._read.file_reader.__next__
StopIteration

The above exception was the direct cause of the following exception:

Traceback (most recent call last):
  File "apache_beam/runners/common.py", line 1435, in apache_beam.runners.common.DoFnRunner.process
  File "apache_beam/runners/common.py", line 636, in apache_beam.runners.common.SimpleInvoker.invoke_process
  File "apache_beam/runners/common.py", line 1611, in apache_beam.runners.common._OutputHandler.handle_process_outputs
  File "/opt/apache/beam-venv/beam-venv-worker-sdk-0-0/lib/python3.10/site-packages/apache_beam/io/filebasedsource.py", line 391, in process
    for record in source.read(range.new_tracker()):
RuntimeError: generator raised StopIteration

During handling of the above exception, another exception occurred:

Traceback (most recent call last):
  File "/opt/apache/beam-venv/beam-venv-worker-sdk-0-0/lib/python3.10/site-packages/apache_beam/runners/worker/sdk_worker.py", line 300, in _execute
    response = task()
  File "/opt/apache/beam-venv/beam-venv-worker-sdk-0-0/lib/python3.10/site-packages/apache_beam/runners/worker/sdk_worker.py", line 375, in <lambda>
    lambda: self.create_worker().do_instruction(request), request)
  File "/opt/apache/beam-venv/beam-venv-worker-sdk-0-0/lib/python3.10/site-packages/apache_beam/runners/worker/sdk_worker.py", line 639, in do_instruction
    return getattr(self, request_type)(
  File "/opt/apache/beam-venv/beam-venv-worker-sdk-0-0/lib/python3.10/site-packages/apache_beam/runners/worker/sdk_worker.py", line 677, in process_bundle
    bundle_processor.process_bundle(instruction_id))
  File "/opt/apache/beam-venv/beam-venv-worker-sdk-0-0/lib/python3.10/site-packages/apache_beam/runners/worker/bundle_processor.py", line 1113, in process_bundle
    input_op_by_transform_id[element.transform_id].process_encoded(
  File "/opt/apache/beam-venv/beam-venv-worker-sdk-0-0/lib/python3.10/site-packages/apache_beam/runners/worker/bundle_processor.py", line 237, in process_encoded
    self.output(decoded_value)
  File "apache_beam/runners/worker/operations.py", line 570, in apache_beam.runners.worker.operations.Operation.output
  File "apache_beam/runners/worker/operations.py", line 572, in apache_beam.runners.worker.operations.Operation.output
  File "apache_beam/runners/worker/operations.py", line 263, in apache_beam.runners.worker.operations.SingletonElementConsumerSet.receive
  File "apache_beam/runners/worker/operations.py", line 266, in apache_beam.runners.worker.operations.SingletonElementConsumerSet.receive
  File "apache_beam/runners/worker/operations.py", line 953, in apache_beam.runners.worker.operations.DoOperation.process
  File "apache_beam/runners/worker/operations.py", line 954, in apache_beam.runners.worker.operations.DoOperation.process
  File "apache_beam/runners/common.py", line 1437, in apache_beam.runners.common.DoFnRunner.process
  File "apache_beam/runners/common.py", line 1526, in apache_beam.runners.common.DoFnRunner._reraise_augmented
  File "apache_beam/runners/common.py", line 1435, in apache_beam.runners.common.DoFnRunner.process
  File "apache_beam/runners/common.py", line 636, in apache_beam.runners.common.SimpleInvoker.invoke_process
  File "apache_beam/runners/common.py", line 1621, in apache_beam.runners.common._OutputHandler.handle_process_outputs
  File "apache_beam/runners/common.py", line 1734, in apache_beam.runners.common._OutputHandler._write_value_to_tag
  File "apache_beam/runners/worker/operations.py", line 266, in apache_beam.runners.worker.operations.SingletonElementConsumerSet.receive
  File "apache_beam/runners/worker/operations.py", line 953, in apache_beam.runners.worker.operations.DoOperation.process
  File "apache_beam/runners/worker/operations.py", line 954, in apache_beam.runners.worker.operations.DoOperation.process
  File "apache_beam/runners/common.py", line 1437, in apache_beam.runners.common.DoFnRunner.process
  File "apache_beam/runners/common.py", line 1526, in apache_beam.runners.common.DoFnRunner._reraise_augmented
  File "apache_beam/runners/common.py", line 1435, in apache_beam.runners.common.DoFnRunner.process
  File "apache_beam/runners/common.py", line 636, in apache_beam.runners.common.SimpleInvoker.invoke_process
  File "apache_beam/runners/common.py", line 1621, in apache_beam.runners.common._OutputHandler.handle_process_outputs
  File "apache_beam/runners/common.py", line 1734, in apache_beam.runners.common._OutputHandler._write_value_to_tag
  File "apache_beam/runners/worker/operations.py", line 266, in apache_beam.runners.worker.operations.SingletonElementConsumerSet.receive
  File "apache_beam/runners/worker/operations.py", line 953, in apache_beam.runners.worker.operations.DoOperation.process
  File "apache_beam/runners/worker/operations.py", line 954, in apache_beam.runners.worker.operations.DoOperation.process
  File "apache_beam/runners/common.py", line 1437, in apache_beam.runners.common.DoFnRunner.process
  File "apache_beam/runners/common.py", line 1547, in apache_beam.runners.common.DoFnRunner._reraise_augmented
  File "apache_beam/runners/common.py", line 1435, in apache_beam.runners.common.DoFnRunner.process
  File "apache_beam/runners/common.py", line 636, in apache_beam.runners.common.SimpleInvoker.invoke_process
  File "apache_beam/runners/common.py", line 1611, in apache_beam.runners.common._OutputHandler.handle_process_outputs
  File "/opt/apache/beam-venv/beam-venv-worker-sdk-0-0/lib/python3.10/site-packages/apache_beam/io/filebasedsource.py", line 391, in process
    for record in source.read(range.new_tracker()):
RuntimeError: generator raised StopIteration [while running 'read-fastavro/read-fastavro/ReadRange-ptransform-59']

      Worker ID: beamapp-jenkins-121410015-12140207-8lce-harness-rqzk
INFO     apache_beam.runners.dataflow.dataflow_runner:dataflow_runner.py:201 2023-12-14T10:14:09.301Z: JOB_MESSAGE_BASIC: Stopping worker pool...
INFO     apache_beam.runners.dataflow.dataflow_runner:dataflow_runner.py:201 2023-12-14T10:16:31.621Z: JOB_MESSAGE_BASIC: Worker pool stopped.
INFO     apache_beam.runners.dataflow.dataflow_runner:dataflow_runner.py:151 Job 2023-12-14_02_07_45-2449279670354559312 is in state JOB_STATE_FAILED
ERROR    apache_beam.runners.dataflow.dataflow_runner:dataflow_runner.py:776 Console URL: https://console.cloud.google.com/dataflow/jobs/<RegionId>/2023-12-14_02_07_45-2449279670354559312?project=<ProjectId>
=============================== warnings summary ===============================
apache_beam/io/gcp/bigquery_read_it_test.py::ReadTests::test_native_source
  <https://ci-beam.apache.org/job/beam_PostCommit_Python310/ws/src/sdks/python/apache_beam/io/gcp/bigquery_read_it_test.py>:170: BeamDeprecationWarning: BigQuerySource is deprecated since 2.25.0. Use ReadFromBigQuery instead.
    beam.io.BigQuerySource(query=self.query, use_standard_sql=True)))

apache_beam/io/gcp/bigquery_test.py::PubSubBigQueryIT::test_file_loads
apache_beam/io/gcp/bigquery_test.py::PubSubBigQueryIT::test_streaming_inserts
apache_beam/examples/complete/game/leader_board_it_test.py::LeaderBoardIT::test_leader_board_it
apache_beam/examples/complete/game/game_stats_it_test.py::GameStatsIT::test_game_stats_it
apache_beam/examples/complete/game/hourly_team_score_it_test.py::HourlyTeamScoreIT::test_hourly_team_score_it
  <https://ci-beam.apache.org/job/beam_PostCommit_Python310/ws/src/sdks/python/apache_beam/io/gcp/tests/utils.py>:63: PendingDeprecationWarning: Client.dataset is deprecated and will be removed in a future version. Use a string like 'my_project.my_dataset' or a cloud.google.bigquery.DatasetReference object, instead.
    dataset_ref = client.dataset(unique_dataset_name, project=project)

apache_beam/examples/dataframe/flight_delays_it_test.py::FlightDelaysTest::test_flight_delays
  <https://ci-beam.apache.org/job/beam_PostCommit_Python310/ws/src/sdks/python/apache_beam/examples/dataframe/flight_delays.py>:47: FutureWarning: The default value of numeric_only in DataFrame.mean is deprecated. In a future version, it will default to False. In addition, specifying 'numeric_only=None' is deprecated. Select only valid columns or specify the value of numeric_only to silence this warning.
    return airline_df[at_top_airports].mean()

apache_beam/examples/cookbook/bigquery_tornadoes_it_test.py::BigqueryTornadoesIT::test_bigquery_tornadoes_it
  <https://ci-beam.apache.org/job/beam_PostCommit_Python310/ws/src/sdks/python/apache_beam/io/gcp/tests/utils.py>:100: PendingDeprecationWarning: Client.dataset is deprecated and will be removed in a future version. Use a string like 'my_project.my_dataset' or a cloud.google.bigquery.DatasetReference object, instead.
    table_ref = client.dataset(dataset_id).table(table_id)

apache_beam/io/gcp/bigquery_read_it_test.py::ReadNewTypesTests::test_native_source
  <https://ci-beam.apache.org/job/beam_PostCommit_Python310/ws/src/sdks/python/apache_beam/io/gcp/bigquery_read_it_test.py>:706: BeamDeprecationWarning: BigQuerySource is deprecated since 2.25.0. Use ReadFromBigQuery instead.
    beam.io.BigQuerySource(query=self.query, use_standard_sql=True)))

-- Docs: https://docs.pytest.org/en/stable/how-to/capture-warnings.html
- generated xml file: <https://ci-beam.apache.org/job/beam_PostCommit_Python310/ws/src/sdks/python/pytest_postCommitIT-df-py310.xml> -
=========================== short test summary info ============================
FAILED apache_beam/examples/fastavro_it_test.py::FastavroIT::test_avro_it - apache_beam.runners.dataflow.dataflow_runner.DataflowRuntimeException: Dataflow pipeline failed. State: FAILED, Error:
Traceback (most recent call last):
  File "/opt/apache/beam-venv/beam-venv-worker-sdk-0-0/lib/python3.10/site-packages/apache_beam/io/avroio.py", line 348, in read_records
    block = next(blocks)
  File "fastavro/_read.pyx", line 1081, in fastavro._read.file_reader.__next__
StopIteration

The above exception was the direct cause of the following exception:

Traceback (most recent call last):
  File "apache_beam/runners/common.py", line 1435, in apache_beam.runners.common.DoFnRunner.process
  File "apache_beam/runners/common.py", line 636, in apache_beam.runners.common.SimpleInvoker.invoke_process
  File "apache_beam/runners/common.py", line 1611, in apache_beam.runners.common._OutputHandler.handle_process_outputs
  File "/opt/apache/beam-venv/beam-venv-worker-sdk-0-0/lib/python3.10/site-packages/apache_beam/io/filebasedsource.py", line 391, in process
    for record in source.read(range.new_tracker()):
RuntimeError: generator raised StopIteration

During handling of the above exception, another exception occurred:

Traceback (most recent call last):
  File "/opt/apache/beam-venv/beam-venv-worker-sdk-0-0/lib/python3.10/site-packages/apache_beam/runners/worker/sdk_worker.py", line 300, in _execute
    response = task()
  File "/opt/apache/beam-venv/beam-venv-worker-sdk-0-0/lib/python3.10/site-packages/apache_beam/runners/worker/sdk_worker.py", line 375, in <lambda>
    lambda: self.create_worker().do_instruction(request), request)
  File "/opt/apache/beam-venv/beam-venv-worker-sdk-0-0/lib/python3.10/site-packages/apache_beam/runners/worker/sdk_worker.py", line 639, in do_instruction
    return getattr(self, request_type)(
  File "/opt/apache/beam-venv/beam-venv-worker-sdk-0-0/lib/python3.10/site-packages/apache_beam/runners/worker/sdk_worker.py", line 677, in process_bundle
    bundle_processor.process_bundle(instruction_id))
  File "/opt/apache/beam-venv/beam-venv-worker-sdk-0-0/lib/python3.10/site-packages/apache_beam/runners/worker/bundle_processor.py", line 1113, in process_bundle
    input_op_by_transform_id[element.transform_id].process_encoded(
  File "/opt/apache/beam-venv/beam-venv-worker-sdk-0-0/lib/python3.10/site-packages/apache_beam/runners/worker/bundle_processor.py", line 237, in process_encoded
    self.output(decoded_value)
  File "apache_beam/runners/worker/operations.py", line 570, in apache_beam.runners.worker.operations.Operation.output
  File "apache_beam/runners/worker/operations.py", line 572, in apache_beam.runners.worker.operations.Operation.output
  File "apache_beam/runners/worker/operations.py", line 263, in apache_beam.runners.worker.operations.SingletonElementConsumerSet.receive
  File "apache_beam/runners/worker/operations.py", line 266, in apache_beam.runners.worker.operations.SingletonElementConsumerSet.receive
  File "apache_beam/runners/worker/operations.py", line 953, in apache_beam.runners.worker.operations.DoOperation.process
  File "apache_beam/runners/worker/operations.py", line 954, in apache_beam.runners.worker.operations.DoOperation.process
  File "apache_beam/runners/common.py", line 1437, in apache_beam.runners.common.DoFnRunner.process
  File "apache_beam/runners/common.py", line 1526, in apache_beam.runners.common.DoFnRunner._reraise_augmented
  File "apache_beam/runners/common.py", line 1435, in apache_beam.runners.common.DoFnRunner.process
  File "apache_beam/runners/common.py", line 636, in apache_beam.runners.common.SimpleInvoker.invoke_process
  File "apache_beam/runners/common.py", line 1621, in apache_beam.runners.common._OutputHandler.handle_process_outputs
  File "apache_beam/runners/common.py", line 1734, in apache_beam.runners.common._OutputHandler._write_value_to_tag
  File "apache_beam/runners/worker/operations.py", line 266, in apache_beam.runners.worker.operations.SingletonElementConsumerSet.receive
  File "apache_beam/runners/worker/operations.py", line 953, in apache_beam.runners.worker.operations.DoOperation.process
  File "apache_beam/runners/worker/operations.py", line 954, in apache_beam.runners.worker.operations.DoOperation.process
  File "apache_beam/runners/common.py", line 1437, in apache_beam.runners.common.DoFnRunner.process
  File "apache_beam/runners/common.py", line 1526, in apache_beam.runners.common.DoFnRunner._reraise_augmented
  File "apache_beam/runners/common.py", line 1435, in apache_beam.runners.common.DoFnRunner.process
  File "apache_beam/runners/common.py", line 636, in apache_beam.runners.common.SimpleInvoker.invoke_process
  File "apache_beam/runners/common.py", line 1621, in apache_beam.runners.common._OutputHandler.handle_process_outputs
  File "apache_beam/runners/common.py", line 1734, in apache_beam.runners.common._OutputHandler._write_value_to_tag
  File "apache_beam/runners/worker/operations.py", line 266, in apache_beam.runners.worker.operations.SingletonElementConsumerSet.receive
  File "apache_beam/runners/worker/operations.py", line 953, in apache_beam.runners.worker.operations.DoOperation.process
  File "apache_beam/runners/worker/operations.py", line 954, in apache_beam.runners.worker.operations.DoOperation.process
  File "apache_beam/runners/common.py", line 1437, in apache_beam.runners.common.DoFnRunner.process
  File "apache_beam/runners/common.py", line 1547, in apache_beam.runners.common.DoFnRunner._reraise_augmented
  File "apache_beam/runners/common.py", line 1435, in apache_beam.runners.common.DoFnRunner.process
  File "apache_beam/runners/common.py", line 636, in apache_beam.runners.common.SimpleInvoker.invoke_process
  File "apache_beam/runners/common.py", line 1611, in apache_beam.runners.common._OutputHandler.handle_process_outputs
  File "/opt/apache/beam-venv/beam-venv-worker-sdk-0-0/lib/python3.10/site-packages/apache_beam/io/filebasedsource.py", line 391, in process
    for record in source.read(range.new_tracker()):
RuntimeError: generator raised StopIteration [while running 'read-fastavro/read-fastavro/ReadRange-ptransform-59']
====== 1 failed, 82 passed, 49 skipped, 9 warnings in 5831.19s (1:37:11) =======

> Task :sdks:python:test-suites:dataflow:py310:postCommitIT FAILED

FAILURE: Build failed with an exception.

* Where:
Script '<https://ci-beam.apache.org/job/beam_PostCommit_Python310/ws/src/sdks/python/test-suites/dataflow/common.gradle'> line: 139

* What went wrong:
Execution failed for task ':sdks:python:test-suites:dataflow:py310:postCommitIT'.
> Process 'command 'sh'' finished with non-zero exit value 1

* Try:
> Run with --stacktrace option to get the stack trace.
> Run with --info or --debug option to get more log output.
> Get more help at https://help.gradle.org.

Deprecated Gradle features were used in this build, making it incompatible with Gradle 9.0.

You can use '--warning-mode all' to show the individual deprecation warnings and determine if they come from your own scripts or plugins.

For more on this, please refer to https://docs.gradle.org/8.4/userguide/command_line_interface.html#sec:command_line_warnings in the Gradle documentation.

BUILD FAILED in 1h 43m 22s
217 actionable tasks: 152 executed, 61 from cache, 4 up-to-date

Publishing build scan...
https://ge.apache.org/s/ak2nkp4wtxokq

Build step 'Invoke Gradle script' changed build result to FAILURE
Build step 'Invoke Gradle script' marked build as failure

---------------------------------------------------------------------
To unsubscribe, e-mail: builds-unsubscribe@beam.apache.org
For additional commands, e-mail: builds-help@beam.apache.org


Build failed in Jenkins: beam_PostCommit_Python310 #1661

Posted by Apache Jenkins Server <je...@builds.apache.org>.
See <https://ci-beam.apache.org/job/beam_PostCommit_Python310/1661/display/redirect>

Changes:


------------------------------------------
[...truncated 11.81 MB...]
  	details = "Multiplexer hanging up"
  	debug_error_string = "UNKNOWN:Error received from peer ipv6:%5B::1%5D:40561 {grpc_message:"Multiplexer hanging up", grpc_status:1, created_time:"2023-12-14T03:30:00.04028529+00:00"}"
  >
  
    warnings.warn(pytest.PytestUnhandledThreadExceptionWarning(msg))

apache_beam/io/external/xlang_kinesisio_it_test.py::CrossLanguageKinesisIOTest::test_kinesis_write
  <https://ci-beam.apache.org/job/beam_PostCommit_Python310/ws/src/build/gradleenv/-1720702907/lib/python3.10/site-packages/_pytest/threadexception.py>:73: PytestUnhandledThreadExceptionWarning: Exception in thread read_grpc_client_inputs
  
  Traceback (most recent call last):
    File "/usr/lib/python3.10/threading.py", line 1009, in _bootstrap_inner
      self.run()
    File "/usr/lib/python3.10/threading.py", line 946, in run
      self._target(*self._args, **self._kwargs)
    File "<https://ci-beam.apache.org/job/beam_PostCommit_Python310/ws/src/sdks/python/apache_beam/runners/worker/data_plane.py",> line 686, in <lambda>
      target=lambda: self._read_inputs(elements_iterator),
    File "<https://ci-beam.apache.org/job/beam_PostCommit_Python310/ws/src/sdks/python/apache_beam/runners/worker/data_plane.py",> line 669, in _read_inputs
      for elements in elements_iterator:
    File "<https://ci-beam.apache.org/job/beam_PostCommit_Python310/ws/src/build/gradleenv/-1720702907/lib/python3.10/site-packages/grpc/_channel.py",> line 540, in __next__
      return self._next()
    File "<https://ci-beam.apache.org/job/beam_PostCommit_Python310/ws/src/build/gradleenv/-1720702907/lib/python3.10/site-packages/grpc/_channel.py",> line 966, in _next
      raise self
  grpc._channel._MultiThreadedRendezvous: <_MultiThreadedRendezvous of RPC that terminated with:
  	status = StatusCode.CANCELLED
  	details = "Multiplexer hanging up"
  	debug_error_string = "UNKNOWN:Error received from peer ipv6:%5B::1%5D:42497 {grpc_message:"Multiplexer hanging up", grpc_status:1, created_time:"2023-12-14T03:30:48.770074562+00:00"}"
  >
  
    warnings.warn(pytest.PytestUnhandledThreadExceptionWarning(msg))

apache_beam/io/external/xlang_debeziumio_it_test.py::CrossLanguageDebeziumIOTest::test_xlang_debezium_read
  <https://ci-beam.apache.org/job/beam_PostCommit_Python310/ws/src/build/gradleenv/-1720702907/lib/python3.10/site-packages/_pytest/threadexception.py>:73: PytestUnhandledThreadExceptionWarning: Exception in thread read_grpc_client_inputs
  
  Traceback (most recent call last):
    File "/usr/lib/python3.10/threading.py", line 1009, in _bootstrap_inner
      self.run()
    File "/usr/lib/python3.10/threading.py", line 946, in run
      self._target(*self._args, **self._kwargs)
    File "<https://ci-beam.apache.org/job/beam_PostCommit_Python310/ws/src/sdks/python/apache_beam/runners/worker/data_plane.py",> line 686, in <lambda>
      target=lambda: self._read_inputs(elements_iterator),
    File "<https://ci-beam.apache.org/job/beam_PostCommit_Python310/ws/src/sdks/python/apache_beam/runners/worker/data_plane.py",> line 669, in _read_inputs
      for elements in elements_iterator:
    File "<https://ci-beam.apache.org/job/beam_PostCommit_Python310/ws/src/build/gradleenv/-1720702907/lib/python3.10/site-packages/grpc/_channel.py",> line 540, in __next__
      return self._next()
    File "<https://ci-beam.apache.org/job/beam_PostCommit_Python310/ws/src/build/gradleenv/-1720702907/lib/python3.10/site-packages/grpc/_channel.py",> line 966, in _next
      raise self
  grpc._channel._MultiThreadedRendezvous: <_MultiThreadedRendezvous of RPC that terminated with:
  	status = StatusCode.CANCELLED
  	details = "Multiplexer hanging up"
  	debug_error_string = "UNKNOWN:Error received from peer ipv6:%5B::1%5D:39497 {created_time:"2023-12-14T03:31:14.71022247+00:00", grpc_status:1, grpc_message:"Multiplexer hanging up"}"
  >
  
    warnings.warn(pytest.PytestUnhandledThreadExceptionWarning(msg))

-- Docs: https://docs.pytest.org/en/stable/how-to/capture-warnings.html
- generated xml file: <https://ci-beam.apache.org/job/beam_PostCommit_Python310/ws/src/sdks/python/pytest_postCommitIT-flink-py310.xml> -
============ 20 passed, 7 skipped, 6 warnings in 566.57s (0:09:26) =============

> Task :sdks:python:test-suites:portable:py310:postCommitPy310

> Task :sdks:python:test-suites:dataflow:py310:postCommitIT

[gw1] PASSED apache_beam/dataframe/io_it_test.py::ReadUsingReadGbqTests::test_ReadGbq_export_with_project 
apache_beam/dataframe/io_it_test.py::ReadUsingReadGbqTests::test_ReadGbq_with_computation 
[gw0] PASSED apache_beam/io/gcp/bigquery_read_it_test.py::ReadTests::test_table_schema_retrieve_specifying_only_table 
apache_beam/io/gcp/bigquery_read_it_test.py::ReadTests::test_table_schema_retrieve_with_direct_read 
[gw3] PASSED apache_beam/io/gcp/bigquery_write_it_test.py::BigQueryWriteIntegrationTests::test_big_query_write_new_types 
apache_beam/io/gcp/bigquery_write_it_test.py::BigQueryWriteIntegrationTests::test_big_query_write_schema_autodetect 
[gw3] SKIPPED apache_beam/io/gcp/bigquery_write_it_test.py::BigQueryWriteIntegrationTests::test_big_query_write_schema_autodetect 
apache_beam/io/gcp/bigquery_write_it_test.py::BigQueryWriteIntegrationTests::test_big_query_write_without_schema 
[gw7] PASSED apache_beam/io/gcp/big_query_query_to_table_it_test.py::BigQueryQueryToTableIT::test_big_query_standard_sql 
apache_beam/examples/dataframe/taxiride_it_test.py::TaxirideIT::test_aggregation 
[gw6] PASSED apache_beam/ml/inference/sklearn_inference_it_test.py::SklearnInference::test_sklearn_mnist_classification_large_model 
apache_beam/ml/inference/sklearn_inference_it_test.py::SklearnInference::test_sklearn_regression 
[gw0] PASSED apache_beam/io/gcp/bigquery_read_it_test.py::ReadTests::test_table_schema_retrieve_with_direct_read 
apache_beam/io/gcp/bigquery_read_it_test.py::ReadUsingStorageApiTests::test_iobase_source 
[gw1] PASSED apache_beam/dataframe/io_it_test.py::ReadUsingReadGbqTests::test_ReadGbq_with_computation 
apache_beam/io/gcp/bigquery_io_read_it_test.py::BigqueryIOReadIT::test_bigquery_read_1M_python 
[gw4] PASSED apache_beam/io/gcp/bigquery_json_it_test.py::BigQueryJsonIT::test_streaming_inserts 
apache_beam/examples/wordcount_it_test.py::WordCountIT::test_wordcount_impersonation_it 
[gw3] PASSED apache_beam/io/gcp/bigquery_write_it_test.py::BigQueryWriteIntegrationTests::test_big_query_write_without_schema 
apache_beam/examples/fastavro_it_test.py::FastavroIT::test_avro_it 
[gw2] PASSED apache_beam/io/gcp/pubsub_integration_test.py::PubSubIntegrationTest::test_streaming_data_only 
apache_beam/io/gcp/pubsub_integration_test.py::PubSubIntegrationTest::test_streaming_with_attributes 
[gw5] PASSED apache_beam/io/gcp/bigquery_test.py::PubSubBigQueryIT::test_file_loads 
apache_beam/io/gcp/bigquery_test.py::PubSubBigQueryIT::test_streaming_inserts 
[gw6] PASSED apache_beam/ml/inference/sklearn_inference_it_test.py::SklearnInference::test_sklearn_regression 
apache_beam/ml/gcp/cloud_dlp_it_test.py::CloudDLPIT::test_deidentification 
[gw7] PASSED apache_beam/examples/dataframe/taxiride_it_test.py::TaxirideIT::test_aggregation 
apache_beam/examples/dataframe/taxiride_it_test.py::TaxirideIT::test_enrich 
[gw0] PASSED apache_beam/io/gcp/bigquery_read_it_test.py::ReadUsingStorageApiTests::test_iobase_source 
apache_beam/io/gcp/bigquery_read_it_test.py::ReadUsingStorageApiTests::test_iobase_source_with_column_selection 
[gw1] PASSED apache_beam/io/gcp/bigquery_io_read_it_test.py::BigqueryIOReadIT::test_bigquery_read_1M_python 
apache_beam/io/gcp/bigquery_io_read_it_test.py::BigqueryIOReadIT::test_bigquery_read_custom_1M_python 
[gw4] PASSED apache_beam/examples/wordcount_it_test.py::WordCountIT::test_wordcount_impersonation_it 
apache_beam/examples/wordcount_it_test.py::WordCountIT::test_wordcount_it 
[gw6] PASSED apache_beam/ml/gcp/cloud_dlp_it_test.py::CloudDLPIT::test_deidentification 
apache_beam/ml/gcp/cloud_dlp_it_test.py::CloudDLPIT::test_inspection 
[gw0] PASSED apache_beam/io/gcp/bigquery_read_it_test.py::ReadUsingStorageApiTests::test_iobase_source_with_column_selection 
apache_beam/io/gcp/bigquery_read_it_test.py::ReadUsingStorageApiTests::test_iobase_source_with_column_selection_and_row_restriction 
[gw1] PASSED apache_beam/io/gcp/bigquery_io_read_it_test.py::BigqueryIOReadIT::test_bigquery_read_custom_1M_python 
apache_beam/examples/complete/autocomplete_test.py::AutocompleteTest::test_autocomplete_it 
[gw2] PASSED apache_beam/io/gcp/pubsub_integration_test.py::PubSubIntegrationTest::test_streaming_with_attributes 
apache_beam/io/gcp/healthcare/dicomio_integration_test.py::DICOMIoIntegrationTest::test_dicom_search_instances 
[gw4] PASSED apache_beam/examples/wordcount_it_test.py::WordCountIT::test_wordcount_it 
apache_beam/examples/complete/game/game_stats_it_test.py::GameStatsIT::test_game_stats_it 
[gw3] PASSED apache_beam/examples/fastavro_it_test.py::FastavroIT::test_avro_it 
apache_beam/examples/streaming_wordcount_debugging_it_test.py::StreamingWordcountDebuggingIT::test_streaming_wordcount_debugging_it 
[gw3] SKIPPED apache_beam/examples/streaming_wordcount_debugging_it_test.py::StreamingWordcountDebuggingIT::test_streaming_wordcount_debugging_it 
apache_beam/examples/complete/game/hourly_team_score_it_test.py::HourlyTeamScoreIT::test_hourly_team_score_it 
[gw6] PASSED apache_beam/ml/gcp/cloud_dlp_it_test.py::CloudDLPIT::test_inspection 
apache_beam/examples/complete/game/user_score_it_test.py::UserScoreIT::test_user_score_it 
[gw0] PASSED apache_beam/io/gcp/bigquery_read_it_test.py::ReadUsingStorageApiTests::test_iobase_source_with_column_selection_and_row_restriction 
apache_beam/io/gcp/bigquery_read_it_test.py::ReadUsingStorageApiTests::test_iobase_source_with_column_selection_and_row_restriction_rows 
[gw1] PASSED apache_beam/examples/complete/autocomplete_test.py::AutocompleteTest::test_autocomplete_it 
apache_beam/examples/cookbook/bigquery_tornadoes_it_test.py::BigqueryTornadoesIT::test_bigquery_tornadoes_it 
[gw2] PASSED apache_beam/io/gcp/healthcare/dicomio_integration_test.py::DICOMIoIntegrationTest::test_dicom_search_instances 
apache_beam/io/gcp/healthcare/dicomio_integration_test.py::DICOMIoIntegrationTest::test_dicom_store_instance_from_gcs 
[gw5] PASSED apache_beam/io/gcp/bigquery_test.py::PubSubBigQueryIT::test_streaming_inserts 
apache_beam/io/gcp/bigquery_test.py::BigQueryFileLoadsIntegrationTests::test_avro_file_load 
[gw0] PASSED apache_beam/io/gcp/bigquery_read_it_test.py::ReadUsingStorageApiTests::test_iobase_source_with_column_selection_and_row_restriction_rows 
apache_beam/io/gcp/bigquery_read_it_test.py::ReadUsingStorageApiTests::test_iobase_source_with_native_datetime 
[gw1] PASSED apache_beam/examples/cookbook/bigquery_tornadoes_it_test.py::BigqueryTornadoesIT::test_bigquery_tornadoes_it 
apache_beam/examples/inference/tfx_bsl/tfx_bsl_inference_it_test.py::TFXRunInferenceTests::test_tfx_run_inference_mobilenetv2 
[gw1] SKIPPED apache_beam/examples/inference/tfx_bsl/tfx_bsl_inference_it_test.py::TFXRunInferenceTests::test_tfx_run_inference_mobilenetv2 
apache_beam/ml/gcp/visionml_test_it.py::VisionMlTestIT::test_text_detection_with_language_hint 
[gw2] PASSED apache_beam/io/gcp/healthcare/dicomio_integration_test.py::DICOMIoIntegrationTest::test_dicom_store_instance_from_gcs 
apache_beam/io/fileio_test.py::MatchIntegrationTest::test_transform_on_gcs 
[gw7] PASSED apache_beam/examples/dataframe/taxiride_it_test.py::TaxirideIT::test_enrich 
apache_beam/examples/streaming_wordcount_it_test.py::StreamingWordCountIT::test_streaming_wordcount_it 
[gw3] PASSED apache_beam/examples/complete/game/hourly_team_score_it_test.py::HourlyTeamScoreIT::test_hourly_team_score_it 
apache_beam/io/gcp/datastore/v1new/datastore_write_it_test.py::DatastoreWriteIT::test_datastore_write_limit 
[gw4] PASSED apache_beam/examples/complete/game/game_stats_it_test.py::GameStatsIT::test_game_stats_it 
apache_beam/examples/cookbook/datastore_wordcount_it_test.py::DatastoreWordCountIT::test_datastore_wordcount_it 
[gw5] PASSED apache_beam/io/gcp/bigquery_test.py::BigQueryFileLoadsIntegrationTests::test_avro_file_load 
apache_beam/examples/complete/game/leader_board_it_test.py::LeaderBoardIT::test_leader_board_it 
[gw0] PASSED apache_beam/io/gcp/bigquery_read_it_test.py::ReadUsingStorageApiTests::test_iobase_source_with_native_datetime 
apache_beam/io/gcp/bigquery_read_it_test.py::ReadUsingStorageApiTests::test_iobase_source_with_query 
[gw6] PASSED apache_beam/examples/complete/game/user_score_it_test.py::UserScoreIT::test_user_score_it 
apache_beam/examples/dataframe/flight_delays_it_test.py::FlightDelaysTest::test_flight_delays 
[gw2] PASSED apache_beam/io/fileio_test.py::MatchIntegrationTest::test_transform_on_gcs 
apache_beam/ml/inference/base_test.py::RunInferenceBaseTest::test_run_inference_with_side_inputin_streaming 
[gw2] SKIPPED apache_beam/ml/inference/base_test.py::RunInferenceBaseTest::test_run_inference_with_side_inputin_streaming 
apache_beam/transforms/periodicsequence_it_test.py::PeriodicSequenceIT::test_periodicsequence_outputs_valid_watermarks_it 
[gw2] SKIPPED apache_beam/transforms/periodicsequence_it_test.py::PeriodicSequenceIT::test_periodicsequence_outputs_valid_watermarks_it 
[gw1] PASSED apache_beam/ml/gcp/visionml_test_it.py::VisionMlTestIT::test_text_detection_with_language_hint 
apache_beam/runners/dataflow/dataflow_exercise_metrics_pipeline_test.py::ExerciseMetricsPipelineTest::test_metrics_it 
[gw1] SKIPPED apache_beam/runners/dataflow/dataflow_exercise_metrics_pipeline_test.py::ExerciseMetricsPipelineTest::test_metrics_it 
apache_beam/transforms/external_it_test.py::ExternalTransformIT::test_job_python_from_python_it 
[gw4] PASSED apache_beam/examples/cookbook/datastore_wordcount_it_test.py::DatastoreWordCountIT::test_datastore_wordcount_it 
apache_beam/io/parquetio_it_test.py::TestParquetIT::test_parquetio_it 
[gw0] PASSED apache_beam/io/gcp/bigquery_read_it_test.py::ReadUsingStorageApiTests::test_iobase_source_with_query 
apache_beam/io/gcp/bigquery_read_it_test.py::ReadUsingStorageApiTests::test_iobase_source_with_query_and_filters 
[gw6] PASSED apache_beam/examples/dataframe/flight_delays_it_test.py::FlightDelaysTest::test_flight_delays 
apache_beam/ml/gcp/videointelligenceml_test_it.py::VideoIntelligenceMlTestIT::test_label_detection_with_video_context 
[gw6] SKIPPED apache_beam/ml/gcp/videointelligenceml_test_it.py::VideoIntelligenceMlTestIT::test_label_detection_with_video_context 
[gw1] PASSED apache_beam/transforms/external_it_test.py::ExternalTransformIT::test_job_python_from_python_it 
[gw4] PASSED apache_beam/io/parquetio_it_test.py::TestParquetIT::test_parquetio_it 
[gw7] PASSED apache_beam/examples/streaming_wordcount_it_test.py::StreamingWordCountIT::test_streaming_wordcount_it 
apache_beam/examples/complete/juliaset/juliaset/juliaset_test_it.py::JuliaSetTestIT::test_run_example_with_setup_file <https://ci-beam.apache.org/job/beam_PostCommit_Python310/ws/src/build/gradleenv/2050596098/bin/python3.10>: No module named build
warning: sdist: standard file not found: should have one of README, README.rst, README.txt, README.md

warning: check: missing required meta-data: url

warning: check: missing meta-data: either (author and author_email) or (maintainer and maintainer_email) should be supplied


[gw5] PASSED apache_beam/examples/complete/game/leader_board_it_test.py::LeaderBoardIT::test_leader_board_it 
apache_beam/ml/inference/onnx_inference_it_test.py::OnnxInference::test_onnx_run_inference_roberta_sentiment_classification 
[gw5] SKIPPED apache_beam/ml/inference/onnx_inference_it_test.py::OnnxInference::test_onnx_run_inference_roberta_sentiment_classification 
[gw0] PASSED apache_beam/io/gcp/bigquery_read_it_test.py::ReadUsingStorageApiTests::test_iobase_source_with_query_and_filters 
apache_beam/io/gcp/bigquery_read_it_test.py::ReadUsingStorageApiTests::test_iobase_source_with_row_restriction 
[gw7] PASSED apache_beam/examples/complete/juliaset/juliaset/juliaset_test_it.py::JuliaSetTestIT::test_run_example_with_setup_file 
[gw0] PASSED apache_beam/io/gcp/bigquery_read_it_test.py::ReadUsingStorageApiTests::test_iobase_source_with_row_restriction 
apache_beam/io/gcp/bigquery_read_it_test.py::ReadUsingStorageApiTests::test_iobase_source_with_very_selective_filters 
[gw3] PASSED apache_beam/io/gcp/datastore/v1new/datastore_write_it_test.py::DatastoreWriteIT::test_datastore_write_limit 
apache_beam/ml/gcp/naturallanguageml_test_it.py::NaturalLanguageMlTestIT::test_analyzing_syntax 
[gw3] SKIPPED apache_beam/ml/gcp/naturallanguageml_test_it.py::NaturalLanguageMlTestIT::test_analyzing_syntax 
[gw0] PASSED apache_beam/io/gcp/bigquery_read_it_test.py::ReadUsingStorageApiTests::test_iobase_source_with_very_selective_filters 
apache_beam/io/gcp/bigquery_read_it_test.py::ReadNewTypesTests::test_iobase_source 
[gw0] PASSED apache_beam/io/gcp/bigquery_read_it_test.py::ReadNewTypesTests::test_iobase_source 
apache_beam/io/gcp/bigquery_read_it_test.py::ReadNewTypesTests::test_native_source 
[gw0] PASSED apache_beam/io/gcp/bigquery_read_it_test.py::ReadNewTypesTests::test_native_source 
apache_beam/io/gcp/bigquery_read_it_test.py::ReadAllBQTests::test_read_queries 
[gw0] PASSED apache_beam/io/gcp/bigquery_read_it_test.py::ReadAllBQTests::test_read_queries 
apache_beam/io/gcp/bigquery_read_it_test.py::ReadInteractiveRunnerTests::test_read_in_interactive_runner 
[gw0] PASSED apache_beam/io/gcp/bigquery_read_it_test.py::ReadInteractiveRunnerTests::test_read_in_interactive_runner 

=============================== warnings summary ===============================
apache_beam/io/gcp/bigquery.py:2603
  <https://ci-beam.apache.org/job/beam_PostCommit_Python310/ws/src/sdks/python/apache_beam/io/gcp/bigquery.py>:2603: DeprecationWarning: invalid escape sequence '\#'
    """Read data from BigQuery.

apache_beam/io/gcp/bigquery_read_it_test.py::ReadTests::test_native_source
  <https://ci-beam.apache.org/job/beam_PostCommit_Python310/ws/src/sdks/python/apache_beam/io/gcp/bigquery_read_it_test.py>:170: BeamDeprecationWarning: BigQuerySource is deprecated since 2.25.0. Use ReadFromBigQuery instead.
    beam.io.BigQuerySource(query=self.query, use_standard_sql=True)))

apache_beam/io/gcp/bigquery_test.py::PubSubBigQueryIT::test_file_loads
apache_beam/io/gcp/bigquery_test.py::PubSubBigQueryIT::test_streaming_inserts
apache_beam/examples/complete/game/hourly_team_score_it_test.py::HourlyTeamScoreIT::test_hourly_team_score_it
apache_beam/examples/complete/game/game_stats_it_test.py::GameStatsIT::test_game_stats_it
apache_beam/examples/complete/game/leader_board_it_test.py::LeaderBoardIT::test_leader_board_it
  <https://ci-beam.apache.org/job/beam_PostCommit_Python310/ws/src/sdks/python/apache_beam/io/gcp/tests/utils.py>:63: PendingDeprecationWarning: Client.dataset is deprecated and will be removed in a future version. Use a string like 'my_project.my_dataset' or a cloud.google.bigquery.DatasetReference object, instead.
    dataset_ref = client.dataset(unique_dataset_name, project=project)

apache_beam/examples/cookbook/bigquery_tornadoes_it_test.py::BigqueryTornadoesIT::test_bigquery_tornadoes_it
  <https://ci-beam.apache.org/job/beam_PostCommit_Python310/ws/src/sdks/python/apache_beam/io/gcp/tests/utils.py>:100: PendingDeprecationWarning: Client.dataset is deprecated and will be removed in a future version. Use a string like 'my_project.my_dataset' or a cloud.google.bigquery.DatasetReference object, instead.
    table_ref = client.dataset(dataset_id).table(table_id)

apache_beam/examples/dataframe/flight_delays_it_test.py::FlightDelaysTest::test_flight_delays
  <https://ci-beam.apache.org/job/beam_PostCommit_Python310/ws/src/sdks/python/apache_beam/examples/dataframe/flight_delays.py>:47: FutureWarning: The default value of numeric_only in DataFrame.mean is deprecated. In a future version, it will default to False. In addition, specifying 'numeric_only=None' is deprecated. Select only valid columns or specify the value of numeric_only to silence this warning.
    return airline_df[at_top_airports].mean()

apache_beam/io/gcp/bigquery_read_it_test.py::ReadNewTypesTests::test_native_source
  <https://ci-beam.apache.org/job/beam_PostCommit_Python310/ws/src/sdks/python/apache_beam/io/gcp/bigquery_read_it_test.py>:706: BeamDeprecationWarning: BigQuerySource is deprecated since 2.25.0. Use ReadFromBigQuery instead.
    beam.io.BigQuerySource(query=self.query, use_standard_sql=True)))

-- Docs: https://docs.pytest.org/en/stable/how-to/capture-warnings.html
- generated xml file: <https://ci-beam.apache.org/job/beam_PostCommit_Python310/ws/src/sdks/python/pytest_postCommitIT-df-py310.xml> -
=========== 83 passed, 49 skipped, 10 warnings in 6229.10s (1:43:49) ===========

FAILURE: Build failed with an exception.

* Where:
Script '<https://ci-beam.apache.org/job/beam_PostCommit_Python310/ws/src/sdks/python/test-suites/direct/common.gradle'> line: 52

* What went wrong:
Execution failed for task ':sdks:python:test-suites:direct:py310:postCommitIT'.
> Process 'command 'sh'' finished with non-zero exit value 1

* Try:
> Run with --stacktrace option to get the stack trace.
> Run with --info or --debug option to get more log output.
> Get more help at https://help.gradle.org.

Deprecated Gradle features were used in this build, making it incompatible with Gradle 9.0.

You can use '--warning-mode all' to show the individual deprecation warnings and determine if they come from your own scripts or plugins.

For more on this, please refer to https://docs.gradle.org/8.4/userguide/command_line_interface.html#sec:command_line_warnings in the Gradle documentation.

BUILD FAILED in 1h 51m 4s
217 actionable tasks: 192 executed, 21 from cache, 4 up-to-date

Publishing build scan...
https://ge.apache.org/s/wbiq6a6fyl2cm

Build step 'Invoke Gradle script' changed build result to FAILURE
Build step 'Invoke Gradle script' marked build as failure

---------------------------------------------------------------------
To unsubscribe, e-mail: builds-unsubscribe@beam.apache.org
For additional commands, e-mail: builds-help@beam.apache.org


Build failed in Jenkins: beam_PostCommit_Python310 #1660

Posted by Apache Jenkins Server <je...@builds.apache.org>.
See <https://ci-beam.apache.org/job/beam_PostCommit_Python310/1660/display/redirect>

Changes:


------------------------------------------
[...truncated 12.16 MB...]
 supports_download: False>
http_response = Response(info={'vary': 'Origin, X-Origin, Referer', 'content-type': 'application/json; charset=UTF-8', 'date': 'Wed, 1...pis.com/v1b3/projects/apache-beam-testing/locations/us-central1/jobs/2023-12-13_14_09_37-3481339433901798323?alt=json')
request = <DataflowProjectsLocationsJobsUpdateRequest
 job: <Job
 requestedState: RequestedStateValueValuesEnum(JOB_STATE_CANCEL...iles: []>
 jobId: '2023-12-13_14_09_37-3481339433901798323'
 location: 'us-central1'
 projectId: 'apache-beam-testing'>

    def __ProcessHttpResponse(self, method_config, http_response, request):
        """Process the given http response."""
        if http_response.status_code not in (http_client.OK,
                                             http_client.CREATED,
                                             http_client.NO_CONTENT):
>           raise exceptions.HttpError.FromResponse(
                http_response, method_config=method_config, request=request)
E           apitools.base.py.exceptions.HttpBadRequestError: HttpError accessing <https://dataflow.googleapis.com/v1b3/projects/apache-beam-testing/locations/us-central1/jobs/2023-12-13_14_09_37-3481339433901798323?alt=json>: response: <{'vary': 'Origin, X-Origin, Referer', 'content-type': 'application/json; charset=UTF-8', 'date': 'Wed, 13 Dec 2023 22:19:42 GMT', 'server': 'ESF', 'cache-control': 'private', 'x-xss-protection': '0', 'x-frame-options': 'SAMEORIGIN', 'x-content-type-options': 'nosniff', 'transfer-encoding': 'chunked', 'status': '400', 'content-length': '315', '-content-encoding': 'gzip'}>, content <{
E             "error": {
E               "code": 400,
E               "message": "(afd51a636fed3e28): Workflow modification failed. Causes: (8e9b3656f1c7af6c): Operation cancel not allowed for job 2023-12-13_14_09_37-3481339433901798323. Job is not yet ready for canceling. Please retry in a few minutes.",
E               "status": "FAILED_PRECONDITION"
E             }
E           }
E           >

../../build/gradleenv/2050596098/lib/python3.10/site-packages/apitools/base/py/base_api.py:603: HttpBadRequestError
------------------------------ Captured log call -------------------------------
WARNING  apache_beam.options.pipeline_options:pipeline_options.py:339 Unknown pipeline options received: --sleep_secs=20,--kms_key_name=projects/apache-beam-testing/locations/global/keyRings/beam-it/cryptoKeys/test. Ignore if flags are used for internal purposes.
INFO     root:pipeline.py:196 Missing pipeline option (runner). Executing pipeline using the default runner: DirectRunner.
INFO     apache_beam.runners.portability.stager:stager.py:322 Copying Beam SDK "<https://ci-beam.apache.org/job/beam_PostCommit_Python310/ws/src/sdks/python/build/apache_beam-2.54.0.dev0-cp310-cp310-manylinux_2_17_x86_64.manylinux2014_x86_64.whl"> to staging location.
INFO     apache_beam.runners.dataflow.dataflow_runner:dataflow_runner.py:395 Pipeline has additional dependencies to be installed in SDK worker container, consider using the SDK container image pre-building workflow to avoid repetitive installations. Learn more on https://cloud.google.com/dataflow/docs/guides/using-custom-containers#prebuild
INFO     root:environments.py:314 Using provided Python SDK container image: gcr.io/cloud-dataflow/v1beta3/beam_python3.10_sdk:beam-master-20231212
INFO     root:environments.py:321 Python SDK container image set to "gcr.io/cloud-dataflow/v1beta3/beam_python3.10_sdk:beam-master-20231212" for Docker environment
INFO     apache_beam.runners.portability.fn_api_runner.translations:translations.py:712 ==================== <function pack_combiners at 0x7fc6cd94ae60> ====================
INFO     apache_beam.runners.portability.fn_api_runner.translations:translations.py:712 ==================== <function sort_stages at 0x7fc6cd94b640> ====================
INFO     apache_beam.runners.dataflow.internal.apiclient:apiclient.py:673 Starting GCS upload to gs://temp-storage-for-end-to-end-tests/staging-it/beamapp-jenkins-1213220936-954413-htv3r2nv.1702505376.954575/apache_beam-2.54.0.dev0-cp310-cp310-manylinux_2_17_x86_64.manylinux2014_x86_64.whl...
INFO     apache_beam.runners.dataflow.internal.apiclient:apiclient.py:683 Completed GCS upload to gs://temp-storage-for-end-to-end-tests/staging-it/beamapp-jenkins-1213220936-954413-htv3r2nv.1702505376.954575/apache_beam-2.54.0.dev0-cp310-cp310-manylinux_2_17_x86_64.manylinux2014_x86_64.whl in 0 seconds.
INFO     apache_beam.runners.dataflow.internal.apiclient:apiclient.py:673 Starting GCS upload to gs://temp-storage-for-end-to-end-tests/staging-it/beamapp-jenkins-1213220936-954413-htv3r2nv.1702505376.954575/pipeline.pb...
INFO     apache_beam.runners.dataflow.internal.apiclient:apiclient.py:683 Completed GCS upload to gs://temp-storage-for-end-to-end-tests/staging-it/beamapp-jenkins-1213220936-954413-htv3r2nv.1702505376.954575/pipeline.pb in 0 seconds.
WARNING  apache_beam.options.pipeline_options:pipeline_options.py:339 Unknown pipeline options received: --sleep_secs=20,--kms_key_name=projects/apache-beam-testing/locations/global/keyRings/beam-it/cryptoKeys/test. Ignore if flags are used for internal purposes.
WARNING  apache_beam.options.pipeline_options:pipeline_options.py:339 Unknown pipeline options received: --sleep_secs=20,--kms_key_name=projects/apache-beam-testing/locations/global/keyRings/beam-it/cryptoKeys/test. Ignore if flags are used for internal purposes.
INFO     apache_beam.runners.dataflow.internal.apiclient:apiclient.py:854 Create job: <Job
 clientRequestId: '20231213220936955513-1335'
 createTime: '2023-12-13T22:09:38.078855Z'
 currentStateTime: '1970-01-01T00:00:00Z'
 id: '2023-12-13_14_09_37-3481339433901798323'
 location: 'us-central1'
 name: 'beamapp-jenkins-1213220936-954413-htv3r2nv'
 projectId: 'apache-beam-testing'
 stageStates: []
 startTime: '2023-12-13T22:09:38.078855Z'
 steps: []
 tempFiles: []
 type: TypeValueValuesEnum(JOB_TYPE_BATCH, 1)>
INFO     apache_beam.runners.dataflow.internal.apiclient:apiclient.py:856 Created job with id: [2023-12-13_14_09_37-3481339433901798323]
INFO     apache_beam.runners.dataflow.internal.apiclient:apiclient.py:857 Submitted job: 2023-12-13_14_09_37-3481339433901798323
INFO     apache_beam.runners.dataflow.internal.apiclient:apiclient.py:858 To access the Dataflow monitoring console, please navigate to https://console.cloud.google.com/dataflow/jobs/us-central1/2023-12-13_14_09_37-3481339433901798323?project=apache-beam-testing
INFO     apache_beam.runners.dataflow.test_dataflow_runner:test_dataflow_runner.py:58 Console log: 
INFO     apache_beam.runners.dataflow.test_dataflow_runner:test_dataflow_runner.py:59 https://console.cloud.google.com/dataflow/jobs/us-central1/2023-12-13_14_09_37-3481339433901798323?project=apache-beam-testing
ERROR    apache_beam.runners.dataflow.test_dataflow_runner:test_dataflow_runner.py:102 Console URL: https://console.cloud.google.com/dataflow/<regionId>/2023-12-13_14_09_37-3481339433901798323?project=<projectId>
______ ReadUsingStorageApiTests.test_iobase_source_with_query_and_filters ______
[gw2] linux -- Python 3.10.2 <https://ci-beam.apache.org/job/beam_PostCommit_Python310/ws/src/build/gradleenv/2050596098/bin/python3.10>

self = <apache_beam.io.gcp.bigquery_read_it_test.ReadUsingStorageApiTests testMethod=test_iobase_source_with_query_and_filters>

    @pytest.mark.it_postcommit
    def test_iobase_source_with_query_and_filters(self):
      EXPECTED_TABLE_DATA = [{'string': 'привет'}]
      query = StaticValueProvider(str, self.query)
>     with beam.Pipeline(argv=self.args) as p:

apache_beam/io/gcp/bigquery_read_it_test.py:591: 
_ _ _ _ _ _ _ _ _ _ _ _ _ _ _ _ _ _ _ _ _ _ _ _ _ _ _ _ _ _ _ _ _ _ _ _ _ _ _ _ 
apache_beam/pipeline.py:612: in __exit__
    self.result = self.run()
apache_beam/pipeline.py:562: in run
    self._options).run(False)
apache_beam/pipeline.py:586: in run
    return self.runner.run_pipeline(self, self._options)
apache_beam/runners/dataflow/test_dataflow_runner.py:53: in run_pipeline
    self.result = super().run_pipeline(pipeline, options)
apache_beam/runners/dataflow/dataflow_runner.py:485: in run_pipeline
    self.dataflow_client.create_job(self.job), self)
apache_beam/utils/retry.py:275: in wrapper
    return fun(*args, **kwargs)
apache_beam/runners/dataflow/internal/apiclient.py:731: in create_job
    return self.submit_job_description(job)
apache_beam/utils/retry.py:275: in wrapper
    return fun(*args, **kwargs)
apache_beam/runners/dataflow/internal/apiclient.py:831: in submit_job_description
    response = self._client.projects_locations_jobs.Create(request)
apache_beam/runners/dataflow/internal/clients/dataflow/dataflow_v1b3_client.py:722: in Create
    return self._RunMethod(config, request, global_params=global_params)
../../build/gradleenv/2050596098/lib/python3.10/site-packages/apitools/base/py/base_api.py:731: in _RunMethod
    return self.ProcessHttpResponse(method_config, http_response, request)
../../build/gradleenv/2050596098/lib/python3.10/site-packages/apitools/base/py/base_api.py:737: in ProcessHttpResponse
    self.__ProcessHttpResponse(method_config, http_response, request))
_ _ _ _ _ _ _ _ _ _ _ _ _ _ _ _ _ _ _ _ _ _ _ _ _ _ _ _ _ _ _ _ _ _ _ _ _ _ _ _ 

self = <apache_beam.runners.dataflow.internal.clients.dataflow.dataflow_v1b3_client.DataflowV1b3.ProjectsLocationsJobsService object at 0x7f4796c44550>
method_config = <ApiMethodInfo
 relative_path: 'v1b3/projects/{projectId}/locations/{location}/jobs'
 method_id: 'dataflow.projects.lo...DataflowProjectsLocationsJobsCreateRequest'
 response_type_name: 'Job'
 request_field: 'job'
 supports_download: False>
http_response = Response(info={'vary': 'Origin, X-Origin, Referer', 'content-type': 'application/json; charset=UTF-8', 'date': 'Wed, 1...', request_url='https://dataflow.googleapis.com/v1b3/projects/apache-beam-testing/locations/us-central1/jobs?alt=json')
request = <DataflowProjectsLocationsJobsCreateRequest
 job: <Job
 clientRequestId: '20231213222250676668-7685'
 environment: <En...empFiles: []
 type: TypeValueValuesEnum(JOB_TYPE_BATCH, 1)>
 location: 'us-central1'
 projectId: 'apache-beam-testing'>

    def __ProcessHttpResponse(self, method_config, http_response, request):
        """Process the given http response."""
        if http_response.status_code not in (http_client.OK,
                                             http_client.CREATED,
                                             http_client.NO_CONTENT):
>           raise exceptions.HttpError.FromResponse(
                http_response, method_config=method_config, request=request)
E           apitools.base.py.exceptions.HttpBadRequestError: HttpError accessing <https://dataflow.googleapis.com/v1b3/projects/apache-beam-testing/locations/us-central1/jobs?alt=json>: response: <{'vary': 'Origin, X-Origin, Referer', 'content-type': 'application/json; charset=UTF-8', 'date': 'Wed, 13 Dec 2023 22:22:51 GMT', 'server': 'ESF', 'cache-control': 'private', 'x-xss-protection': '0', 'x-frame-options': 'SAMEORIGIN', 'x-content-type-options': 'nosniff', 'transfer-encoding': 'chunked', 'status': '400', 'content-length': '492', '-content-encoding': 'gzip'}>, content <{
E             "error": {
E               "code": 400,
E               "message": "(a90946ccaf624c2c): The workflow could not be created. Causes: (20910c04042cbb4c): Dataflow quota error for jobs-per-project quota. Project apache-beam-testing is running 300 jobs. Please check the quota usage via GCP Console. If it exceeds the limit, please wait for a workflow to finish or contact Google Cloud Support to request an increase in quota. If it does not, contact Google Cloud Support.",
E               "status": "FAILED_PRECONDITION"
E             }
E           }
E           >

../../build/gradleenv/2050596098/lib/python3.10/site-packages/apitools/base/py/base_api.py:603: HttpBadRequestError
------------------------------ Captured log call -------------------------------
INFO     apache_beam.runners.portability.stager:stager.py:322 Copying Beam SDK "<https://ci-beam.apache.org/job/beam_PostCommit_Python310/ws/src/sdks/python/build/apache_beam-2.54.0.dev0-cp310-cp310-manylinux_2_17_x86_64.manylinux2014_x86_64.whl"> to staging location.
INFO     apache_beam.runners.dataflow.dataflow_runner:dataflow_runner.py:395 Pipeline has additional dependencies to be installed in SDK worker container, consider using the SDK container image pre-building workflow to avoid repetitive installations. Learn more on https://cloud.google.com/dataflow/docs/guides/using-custom-containers#prebuild
INFO     root:environments.py:314 Using provided Python SDK container image: gcr.io/cloud-dataflow/v1beta3/beam_python3.10_sdk:beam-master-20231212
INFO     root:environments.py:321 Python SDK container image set to "gcr.io/cloud-dataflow/v1beta3/beam_python3.10_sdk:beam-master-20231212" for Docker environment
INFO     apache_beam.runners.portability.fn_api_runner.translations:translations.py:712 ==================== <function pack_combiners at 0x7f47ca794e50> ====================
INFO     apache_beam.runners.portability.fn_api_runner.translations:translations.py:712 ==================== <function sort_stages at 0x7f47ca795630> ====================
INFO     apache_beam.runners.dataflow.internal.apiclient:apiclient.py:673 Starting GCS upload to gs://temp-storage-for-end-to-end-tests/staging-it/beamapp-jenkins-1213222250-675572-50kulrj3.1702506170.675741/apache_beam-2.54.0.dev0-cp310-cp310-manylinux_2_17_x86_64.manylinux2014_x86_64.whl...
INFO     apache_beam.runners.dataflow.internal.apiclient:apiclient.py:683 Completed GCS upload to gs://temp-storage-for-end-to-end-tests/staging-it/beamapp-jenkins-1213222250-675572-50kulrj3.1702506170.675741/apache_beam-2.54.0.dev0-cp310-cp310-manylinux_2_17_x86_64.manylinux2014_x86_64.whl in 0 seconds.
INFO     apache_beam.runners.dataflow.internal.apiclient:apiclient.py:673 Starting GCS upload to gs://temp-storage-for-end-to-end-tests/staging-it/beamapp-jenkins-1213222250-675572-50kulrj3.1702506170.675741/pipeline.pb...
INFO     apache_beam.runners.dataflow.internal.apiclient:apiclient.py:683 Completed GCS upload to gs://temp-storage-for-end-to-end-tests/staging-it/beamapp-jenkins-1213222250-675572-50kulrj3.1702506170.675741/pipeline.pb in 0 seconds.
WARNING  apache_beam.options.pipeline_options:pipeline_options.py:339 Unknown pipeline options received: --sleep_secs=20,--kms_key_name=projects/apache-beam-testing/locations/global/keyRings/beam-it/cryptoKeys/test. Ignore if flags are used for internal purposes.
WARNING  apache_beam.options.pipeline_options:pipeline_options.py:339 Unknown pipeline options received: --sleep_secs=20,--kms_key_name=projects/apache-beam-testing/locations/global/keyRings/beam-it/cryptoKeys/test. Ignore if flags are used for internal purposes.
=============================== warnings summary ===============================
apache_beam/io/gcp/bigquery.py:2603
  <https://ci-beam.apache.org/job/beam_PostCommit_Python310/ws/src/sdks/python/apache_beam/io/gcp/bigquery.py>:2603: DeprecationWarning: invalid escape sequence '\#'
    """Read data from BigQuery.

apache_beam/io/gcp/bigquery_read_it_test.py::ReadTests::test_native_source
  <https://ci-beam.apache.org/job/beam_PostCommit_Python310/ws/src/sdks/python/apache_beam/io/gcp/bigquery_read_it_test.py>:170: BeamDeprecationWarning: BigQuerySource is deprecated since 2.25.0. Use ReadFromBigQuery instead.
    beam.io.BigQuerySource(query=self.query, use_standard_sql=True)))

apache_beam/io/gcp/bigquery_test.py::PubSubBigQueryIT::test_file_loads
apache_beam/io/gcp/bigquery_test.py::PubSubBigQueryIT::test_streaming_inserts
apache_beam/examples/complete/game/leader_board_it_test.py::LeaderBoardIT::test_leader_board_it
apache_beam/examples/complete/game/game_stats_it_test.py::GameStatsIT::test_game_stats_it
apache_beam/examples/complete/game/hourly_team_score_it_test.py::HourlyTeamScoreIT::test_hourly_team_score_it
  <https://ci-beam.apache.org/job/beam_PostCommit_Python310/ws/src/sdks/python/apache_beam/io/gcp/tests/utils.py>:63: PendingDeprecationWarning: Client.dataset is deprecated and will be removed in a future version. Use a string like 'my_project.my_dataset' or a cloud.google.bigquery.DatasetReference object, instead.
    dataset_ref = client.dataset(unique_dataset_name, project=project)

apache_beam/examples/dataframe/flight_delays_it_test.py::FlightDelaysTest::test_flight_delays
  <https://ci-beam.apache.org/job/beam_PostCommit_Python310/ws/src/sdks/python/apache_beam/examples/dataframe/flight_delays.py>:47: FutureWarning: The default value of numeric_only in DataFrame.mean is deprecated. In a future version, it will default to False. In addition, specifying 'numeric_only=None' is deprecated. Select only valid columns or specify the value of numeric_only to silence this warning.
    return airline_df[at_top_airports].mean()

apache_beam/examples/cookbook/bigquery_tornadoes_it_test.py::BigqueryTornadoesIT::test_bigquery_tornadoes_it
  <https://ci-beam.apache.org/job/beam_PostCommit_Python310/ws/src/sdks/python/apache_beam/io/gcp/tests/utils.py>:100: PendingDeprecationWarning: Client.dataset is deprecated and will be removed in a future version. Use a string like 'my_project.my_dataset' or a cloud.google.bigquery.DatasetReference object, instead.
    table_ref = client.dataset(dataset_id).table(table_id)

apache_beam/io/gcp/bigquery_read_it_test.py::ReadNewTypesTests::test_native_source
  <https://ci-beam.apache.org/job/beam_PostCommit_Python310/ws/src/sdks/python/apache_beam/io/gcp/bigquery_read_it_test.py>:706: BeamDeprecationWarning: BigQuerySource is deprecated since 2.25.0. Use ReadFromBigQuery instead.
    beam.io.BigQuerySource(query=self.query, use_standard_sql=True)))

-- Docs: https://docs.pytest.org/en/stable/how-to/capture-warnings.html
- generated xml file: <https://ci-beam.apache.org/job/beam_PostCommit_Python310/ws/src/sdks/python/pytest_postCommitIT-df-py310.xml> -
=========================== short test summary info ============================
FAILED apache_beam/io/gcp/bigquery_read_it_test.py::ReadTests::test_table_schema_retrieve_with_direct_read - apitools.base.py.exceptions.HttpBadRequestError: HttpError accessing <https://dataflow.googleapis.com/v1b3/projects/apache-beam-testing/locations/us-central1/jobs/2023-12-13_13_38_17-6910888801572441864?alt=json>: response: <{'vary': 'Origin, X-Origin, Referer', 'content-type': 'application/json; charset=UTF-8', 'date': 'Wed, 13 Dec 2023 21:48:21 GMT', 'server': 'ESF', 'cache-control': 'private', 'x-xss-protection': '0', 'x-frame-options': 'SAMEORIGIN', 'x-content-type-options': 'nosniff', 'transfer-encoding': 'chunked', 'status': '400', 'content-length': '315', '-content-encoding': 'gzip'}>, content <{
  "error": {
    "code": 400,
    "message": "(c3199b45b6ab2330): Workflow modification failed. Causes: (92501812a90edd13): Operation cancel not allowed for job 2023-12-13_13_38_17-6910888801572441864. Job is not yet ready for canceling. Please retry in a few minutes.",
    "status": "FAILED_PRECONDITION"
  }
}
>
FAILED apache_beam/io/gcp/datastore/v1new/datastore_write_it_test.py::DatastoreWriteIT::test_datastore_write_limit - apitools.base.py.exceptions.HttpBadRequestError: HttpError accessing <https://dataflow.googleapis.com/v1b3/projects/apache-beam-testing/locations/us-central1/jobs?alt=json>: response: <{'vary': 'Origin, X-Origin, Referer', 'content-type': 'application/json; charset=UTF-8', 'date': 'Wed, 13 Dec 2023 22:15:34 GMT', 'server': 'ESF', 'cache-control': 'private', 'x-xss-protection': '0', 'x-frame-options': 'SAMEORIGIN', 'x-content-type-options': 'nosniff', 'transfer-encoding': 'chunked', 'status': '400', 'content-length': '491', '-content-encoding': 'gzip'}>, content <{
  "error": {
    "code": 400,
    "message": "(f61fb56d192e09fc): The workflow could not be created. Causes: (4a4af1a3f161738): Dataflow quota error for jobs-per-project quota. Project apache-beam-testing is running 300 jobs. Please check the quota usage via GCP Console. If it exceeds the limit, please wait for a workflow to finish or contact Google Cloud Support to request an increase in quota. If it does not, contact Google Cloud Support.",
    "status": "FAILED_PRECONDITION"
  }
}
>
FAILED apache_beam/examples/dataframe/flight_delays_it_test.py::FlightDelaysTest::test_flight_delays - apitools.base.py.exceptions.HttpBadRequestError: HttpError accessing <https://dataflow.googleapis.com/v1b3/projects/apache-beam-testing/locations/us-central1/jobs/2023-12-13_14_09_22-18069238801416661924?alt=json>: response: <{'vary': 'Origin, X-Origin, Referer', 'content-type': 'application/json; charset=UTF-8', 'date': 'Wed, 13 Dec 2023 22:19:27 GMT', 'server': 'ESF', 'cache-control': 'private', 'x-xss-protection': '0', 'x-frame-options': 'SAMEORIGIN', 'x-content-type-options': 'nosniff', 'transfer-encoding': 'chunked', 'status': '400', 'content-length': '316', '-content-encoding': 'gzip'}>, content <{
  "error": {
    "code": 400,
    "message": "(587100587ee2520c): Workflow modification failed. Causes: (e23699043342cdd5): Operation cancel not allowed for job 2023-12-13_14_09_22-18069238801416661924. Job is not yet ready for canceling. Please retry in a few minutes.",
    "status": "FAILED_PRECONDITION"
  }
}
>
FAILED apache_beam/transforms/external_it_test.py::ExternalTransformIT::test_job_python_from_python_it - apitools.base.py.exceptions.HttpBadRequestError: HttpError accessing <https://dataflow.googleapis.com/v1b3/projects/apache-beam-testing/locations/us-central1/jobs/2023-12-13_14_09_37-3481339433901798323?alt=json>: response: <{'vary': 'Origin, X-Origin, Referer', 'content-type': 'application/json; charset=UTF-8', 'date': 'Wed, 13 Dec 2023 22:19:42 GMT', 'server': 'ESF', 'cache-control': 'private', 'x-xss-protection': '0', 'x-frame-options': 'SAMEORIGIN', 'x-content-type-options': 'nosniff', 'transfer-encoding': 'chunked', 'status': '400', 'content-length': '315', '-content-encoding': 'gzip'}>, content <{
  "error": {
    "code": 400,
    "message": "(afd51a636fed3e28): Workflow modification failed. Causes: (8e9b3656f1c7af6c): Operation cancel not allowed for job 2023-12-13_14_09_37-3481339433901798323. Job is not yet ready for canceling. Please retry in a few minutes.",
    "status": "FAILED_PRECONDITION"
  }
}
>
FAILED apache_beam/io/gcp/bigquery_read_it_test.py::ReadUsingStorageApiTests::test_iobase_source_with_query_and_filters - apitools.base.py.exceptions.HttpBadRequestError: HttpError accessing <https://dataflow.googleapis.com/v1b3/projects/apache-beam-testing/locations/us-central1/jobs?alt=json>: response: <{'vary': 'Origin, X-Origin, Referer', 'content-type': 'application/json; charset=UTF-8', 'date': 'Wed, 13 Dec 2023 22:22:51 GMT', 'server': 'ESF', 'cache-control': 'private', 'x-xss-protection': '0', 'x-frame-options': 'SAMEORIGIN', 'x-content-type-options': 'nosniff', 'transfer-encoding': 'chunked', 'status': '400', 'content-length': '492', '-content-encoding': 'gzip'}>, content <{
  "error": {
    "code": 400,
    "message": "(a90946ccaf624c2c): The workflow could not be created. Causes: (20910c04042cbb4c): Dataflow quota error for jobs-per-project quota. Project apache-beam-testing is running 300 jobs. Please check the quota usage via GCP Console. If it exceeds the limit, please wait for a workflow to finish or contact Google Cloud Support to request an increase in quota. If it does not, contact Google Cloud Support.",
    "status": "FAILED_PRECONDITION"
  }
}
>
====== 5 failed, 78 passed, 49 skipped, 10 warnings in 6673.04s (1:51:13) ======

> Task :sdks:python:test-suites:dataflow:py310:postCommitIT FAILED

FAILURE: Build failed with an exception.

* Where:
Script '<https://ci-beam.apache.org/job/beam_PostCommit_Python310/ws/src/sdks/python/test-suites/dataflow/common.gradle'> line: 139

* What went wrong:
Execution failed for task ':sdks:python:test-suites:dataflow:py310:postCommitIT'.
> Process 'command 'sh'' finished with non-zero exit value 1

* Try:
> Run with --stacktrace option to get the stack trace.
> Run with --info or --debug option to get more log output.
> Get more help at https://help.gradle.org.

Deprecated Gradle features were used in this build, making it incompatible with Gradle 9.0.

You can use '--warning-mode all' to show the individual deprecation warnings and determine if they come from your own scripts or plugins.

For more on this, please refer to https://docs.gradle.org/8.4/userguide/command_line_interface.html#sec:command_line_warnings in the Gradle documentation.

BUILD FAILED in 2h 1s
217 actionable tasks: 183 executed, 30 from cache, 4 up-to-date

Publishing build scan...
https://ge.apache.org/s/gdw2q6736dcyk

Build step 'Invoke Gradle script' changed build result to FAILURE
Build step 'Invoke Gradle script' marked build as failure

---------------------------------------------------------------------
To unsubscribe, e-mail: builds-unsubscribe@beam.apache.org
For additional commands, e-mail: builds-help@beam.apache.org


Build failed in Jenkins: beam_PostCommit_Python310 #1659

Posted by Apache Jenkins Server <je...@builds.apache.org>.
See <https://ci-beam.apache.org/job/beam_PostCommit_Python310/1659/display/redirect>

Changes:


------------------------------------------
[...truncated 12.60 MB...]
  File "<https://ci-beam.apache.org/job/beam_PostCommit_Python310/ws/src/sdks/python/apache_beam/runners/worker/data_plane.py",> line 686, in <lambda>
    self._target(*self._args, **self._kwargs)
    self._target(*self._args, **self._kwargs)
  File "<https://ci-beam.apache.org/job/beam_PostCommit_Python310/ws/src/sdks/python/apache_beam/runners/worker/sdk_worker.py",> line 265, in run
    target=lambda: self._read_inputs(elements_iterator),
  File "<https://ci-beam.apache.org/job/beam_PostCommit_Python310/ws/src/sdks/python/apache_beam/runners/worker/sdk_worker.py",> line 1049, in pull_responses
    for work_request in self._control_stub.Control(get_responses()):
  File "<https://ci-beam.apache.org/job/beam_PostCommit_Python310/ws/src/sdks/python/apache_beam/runners/worker/data_plane.py",> line 669, in _read_inputs
  File "<https://ci-beam.apache.org/job/beam_PostCommit_Python310/ws/src/build/gradleenv/-1720702907/lib/python3.10/site-packages/grpc/_channel.py",> line 540, in __next__
    for response in responses:
    for elements in elements_iterator:
  File "<https://ci-beam.apache.org/job/beam_PostCommit_Python310/ws/src/build/gradleenv/-1720702907/lib/python3.10/site-packages/grpc/_channel.py",> line 540, in __next__
  File "<https://ci-beam.apache.org/job/beam_PostCommit_Python310/ws/src/build/gradleenv/-1720702907/lib/python3.10/site-packages/grpc/_channel.py",> line 540, in __next__
    return self._next()
    return self._next()
  File "<https://ci-beam.apache.org/job/beam_PostCommit_Python310/ws/src/build/gradleenv/-1720702907/lib/python3.10/site-packages/grpc/_channel.py",> line 966, in _next
  File "<https://ci-beam.apache.org/job/beam_PostCommit_Python310/ws/src/build/gradleenv/-1720702907/lib/python3.10/site-packages/grpc/_channel.py",> line 966, in _next
    return self._next()
  File "<https://ci-beam.apache.org/job/beam_PostCommit_Python310/ws/src/build/gradleenv/-1720702907/lib/python3.10/site-packages/grpc/_channel.py",> line 966, in _next
    raise self
    raise self
grpc._channel._MultiThreadedRendezvous: <_MultiThreadedRendezvous of RPC that terminated with:
	status = StatusCode.UNAVAILABLE
	details = "Socket closed"
	debug_error_string = "UNKNOWN:Error received from peer ipv6:%5B::1%5D:38111 {created_time:"2023-12-13T15:28:01.849222797+00:00", grpc_status:14, grpc_message:"Socket closed"}"
>
    raise self
grpc._channel._MultiThreadedRendezvous: <_MultiThreadedRendezvous of RPC that terminated with:
	status = StatusCode.UNAVAILABLE
	details = "recvmsg:Connection reset by peer"
	debug_error_string = "UNKNOWN:Error received from peer ipv6:%5B::1%5D:40503 {created_time:"2023-12-13T15:28:01.84927112+00:00", grpc_status:14, grpc_message:"recvmsg:Connection reset by peer"}"
>
grpc._channel._MultiThreadedRendezvous: <_MultiThreadedRendezvous of RPC that terminated with:
	status = StatusCode.UNAVAILABLE
	details = "Socket closed"
	debug_error_string = "UNKNOWN:Error received from peer ipv6:%5B::1%5D:35687 {created_time:"2023-12-13T15:28:01.849223301+00:00", grpc_status:14, grpc_message:"Socket closed"}"
>

> Task :sdks:python:test-suites:dataflow:py310:postCommitIT

[gw5] PASSED apache_beam/io/gcp/bigquery_json_it_test.py::BigQueryJsonIT::test_query_read 
apache_beam/io/gcp/bigquery_json_it_test.py::BigQueryJsonIT::test_streaming_inserts 
[gw0] PASSED apache_beam/io/gcp/bigquery_read_it_test.py::ReadTests::test_table_schema_retrieve 
apache_beam/io/gcp/bigquery_read_it_test.py::ReadTests::test_table_schema_retrieve_specifying_only_table 
[gw2] PASSED apache_beam/ml/gcp/recommendations_ai_test_it.py::RecommendationAIIT::test_predict 
apache_beam/testing/test_stream_it_test.py::TestStreamIntegrationTests::test_basic_execution 
[gw2] SKIPPED apache_beam/testing/test_stream_it_test.py::TestStreamIntegrationTests::test_basic_execution 
apache_beam/testing/test_stream_it_test.py::TestStreamIntegrationTests::test_multiple_outputs 
[gw2] SKIPPED apache_beam/testing/test_stream_it_test.py::TestStreamIntegrationTests::test_multiple_outputs 
apache_beam/testing/test_stream_it_test.py::TestStreamIntegrationTests::test_multiple_outputs_with_watermark_advancement 
[gw2] SKIPPED apache_beam/testing/test_stream_it_test.py::TestStreamIntegrationTests::test_multiple_outputs_with_watermark_advancement 
apache_beam/io/gcp/bigquery_io_read_it_test.py::BigqueryIOReadIT::test_bigquery_read_1M_python 
[gw1] PASSED apache_beam/dataframe/io_it_test.py::ReadUsingReadGbqTests::test_ReadGbq_direct_read_with_project 
apache_beam/dataframe/io_it_test.py::ReadUsingReadGbqTests::test_ReadGbq_export_with_project 
[gw7] PASSED apache_beam/io/gcp/big_query_query_to_table_it_test.py::BigQueryQueryToTableIT::test_big_query_new_types_avro 
apache_beam/io/gcp/big_query_query_to_table_it_test.py::BigQueryQueryToTableIT::test_big_query_standard_sql 
[gw3] PASSED apache_beam/ml/inference/sklearn_inference_it_test.py::SklearnInference::test_sklearn_mnist_classification 
apache_beam/ml/inference/sklearn_inference_it_test.py::SklearnInference::test_sklearn_mnist_classification_large_model 
[gw1] PASSED apache_beam/dataframe/io_it_test.py::ReadUsingReadGbqTests::test_ReadGbq_export_with_project 
apache_beam/dataframe/io_it_test.py::ReadUsingReadGbqTests::test_ReadGbq_with_computation 
[gw4] PASSED apache_beam/io/gcp/bigquery_write_it_test.py::BigQueryWriteIntegrationTests::test_big_query_write_new_types 
apache_beam/io/gcp/bigquery_write_it_test.py::BigQueryWriteIntegrationTests::test_big_query_write_schema_autodetect 
[gw0] PASSED apache_beam/io/gcp/bigquery_read_it_test.py::ReadTests::test_table_schema_retrieve_specifying_only_table 
apache_beam/io/gcp/bigquery_read_it_test.py::ReadTests::test_table_schema_retrieve_with_direct_read 
[gw4] SKIPPED apache_beam/io/gcp/bigquery_write_it_test.py::BigQueryWriteIntegrationTests::test_big_query_write_schema_autodetect 
apache_beam/io/gcp/bigquery_write_it_test.py::BigQueryWriteIntegrationTests::test_big_query_write_without_schema 
[gw2] PASSED apache_beam/io/gcp/bigquery_io_read_it_test.py::BigqueryIOReadIT::test_bigquery_read_1M_python 
apache_beam/io/gcp/bigquery_io_read_it_test.py::BigqueryIOReadIT::test_bigquery_read_custom_1M_python 
[gw7] PASSED apache_beam/io/gcp/big_query_query_to_table_it_test.py::BigQueryQueryToTableIT::test_big_query_standard_sql 
apache_beam/examples/dataframe/taxiride_it_test.py::TaxirideIT::test_aggregation 
[gw3] PASSED apache_beam/ml/inference/sklearn_inference_it_test.py::SklearnInference::test_sklearn_mnist_classification_large_model 
apache_beam/ml/inference/sklearn_inference_it_test.py::SklearnInference::test_sklearn_regression 
[gw5] PASSED apache_beam/io/gcp/bigquery_json_it_test.py::BigQueryJsonIT::test_streaming_inserts 
apache_beam/examples/wordcount_it_test.py::WordCountIT::test_wordcount_impersonation_it 
[gw0] PASSED apache_beam/io/gcp/bigquery_read_it_test.py::ReadTests::test_table_schema_retrieve_with_direct_read 
apache_beam/io/gcp/bigquery_read_it_test.py::ReadUsingStorageApiTests::test_iobase_source 
[gw1] PASSED apache_beam/dataframe/io_it_test.py::ReadUsingReadGbqTests::test_ReadGbq_with_computation 
apache_beam/io/gcp/pubsub_integration_test.py::PubSubIntegrationTest::test_streaming_data_only 
[gw2] PASSED apache_beam/io/gcp/bigquery_io_read_it_test.py::BigqueryIOReadIT::test_bigquery_read_custom_1M_python 
apache_beam/io/gcp/gcsio_integration_test.py::GcsIOIntegrationTest::test_batch_copy_and_delete 
[gw2] PASSED apache_beam/io/gcp/gcsio_integration_test.py::GcsIOIntegrationTest::test_batch_copy_and_delete 
apache_beam/io/gcp/gcsio_integration_test.py::GcsIOIntegrationTest::test_copy 
[gw2] PASSED apache_beam/io/gcp/gcsio_integration_test.py::GcsIOIntegrationTest::test_copy 
apache_beam/examples/complete/autocomplete_test.py::AutocompleteTest::test_autocomplete_it 
[gw4] PASSED apache_beam/io/gcp/bigquery_write_it_test.py::BigQueryWriteIntegrationTests::test_big_query_write_without_schema 
apache_beam/ml/gcp/cloud_dlp_it_test.py::CloudDLPIT::test_deidentification 
[gw6] PASSED apache_beam/io/gcp/bigquery_test.py::PubSubBigQueryIT::test_file_loads 
apache_beam/io/gcp/bigquery_test.py::PubSubBigQueryIT::test_streaming_inserts 
[gw3] PASSED apache_beam/ml/inference/sklearn_inference_it_test.py::SklearnInference::test_sklearn_regression 
apache_beam/io/gcp/healthcare/dicomio_integration_test.py::DICOMIoIntegrationTest::test_dicom_search_instances 
[gw7] PASSED apache_beam/examples/dataframe/taxiride_it_test.py::TaxirideIT::test_aggregation 
apache_beam/examples/dataframe/taxiride_it_test.py::TaxirideIT::test_enrich 
[gw5] PASSED apache_beam/examples/wordcount_it_test.py::WordCountIT::test_wordcount_impersonation_it 
apache_beam/examples/wordcount_it_test.py::WordCountIT::test_wordcount_it 
[gw0] PASSED apache_beam/io/gcp/bigquery_read_it_test.py::ReadUsingStorageApiTests::test_iobase_source 
apache_beam/io/gcp/bigquery_read_it_test.py::ReadUsingStorageApiTests::test_iobase_source_with_column_selection 
[gw4] PASSED apache_beam/ml/gcp/cloud_dlp_it_test.py::CloudDLPIT::test_deidentification 
apache_beam/ml/gcp/cloud_dlp_it_test.py::CloudDLPIT::test_inspection 
[gw2] PASSED apache_beam/examples/complete/autocomplete_test.py::AutocompleteTest::test_autocomplete_it 
apache_beam/examples/complete/game/game_stats_it_test.py::GameStatsIT::test_game_stats_it 
[gw3] PASSED apache_beam/io/gcp/healthcare/dicomio_integration_test.py::DICOMIoIntegrationTest::test_dicom_search_instances 
apache_beam/io/gcp/healthcare/dicomio_integration_test.py::DICOMIoIntegrationTest::test_dicom_store_instance_from_gcs 
[gw5] PASSED apache_beam/examples/wordcount_it_test.py::WordCountIT::test_wordcount_it 
apache_beam/examples/streaming_wordcount_debugging_it_test.py::StreamingWordcountDebuggingIT::test_streaming_wordcount_debugging_it 
[gw5] SKIPPED apache_beam/examples/streaming_wordcount_debugging_it_test.py::StreamingWordcountDebuggingIT::test_streaming_wordcount_debugging_it 
apache_beam/examples/cookbook/datastore_wordcount_it_test.py::DatastoreWordCountIT::test_datastore_wordcount_it 
[gw0] PASSED apache_beam/io/gcp/bigquery_read_it_test.py::ReadUsingStorageApiTests::test_iobase_source_with_column_selection 
apache_beam/io/gcp/bigquery_read_it_test.py::ReadUsingStorageApiTests::test_iobase_source_with_column_selection_and_row_restriction 
[gw4] PASSED apache_beam/ml/gcp/cloud_dlp_it_test.py::CloudDLPIT::test_inspection 
apache_beam/examples/complete/game/leader_board_it_test.py::LeaderBoardIT::test_leader_board_it 
[gw1] PASSED apache_beam/io/gcp/pubsub_integration_test.py::PubSubIntegrationTest::test_streaming_data_only 
apache_beam/io/gcp/pubsub_integration_test.py::PubSubIntegrationTest::test_streaming_with_attributes 
[gw3] PASSED apache_beam/io/gcp/healthcare/dicomio_integration_test.py::DICOMIoIntegrationTest::test_dicom_store_instance_from_gcs 
apache_beam/examples/complete/juliaset/juliaset/juliaset_test_it.py::JuliaSetTestIT::test_run_example_with_setup_file <https://ci-beam.apache.org/job/beam_PostCommit_Python310/ws/src/build/gradleenv/2050596098/bin/python3.10>: No module named build
warning: sdist: standard file not found: should have one of README, README.rst, README.txt, README.md

warning: check: missing required meta-data: url

warning: check: missing meta-data: either (author and author_email) or (maintainer and maintainer_email) should be supplied


[gw5] PASSED apache_beam/examples/cookbook/datastore_wordcount_it_test.py::DatastoreWordCountIT::test_datastore_wordcount_it 
apache_beam/io/parquetio_it_test.py::TestParquetIT::test_parquetio_it 
[gw0] PASSED apache_beam/io/gcp/bigquery_read_it_test.py::ReadUsingStorageApiTests::test_iobase_source_with_column_selection_and_row_restriction 
apache_beam/io/gcp/bigquery_read_it_test.py::ReadUsingStorageApiTests::test_iobase_source_with_column_selection_and_row_restriction_rows 
[gw6] PASSED apache_beam/io/gcp/bigquery_test.py::PubSubBigQueryIT::test_streaming_inserts 
apache_beam/io/gcp/bigquery_test.py::BigQueryFileLoadsIntegrationTests::test_avro_file_load 
[gw2] PASSED apache_beam/examples/complete/game/game_stats_it_test.py::GameStatsIT::test_game_stats_it 
apache_beam/examples/complete/game/hourly_team_score_it_test.py::HourlyTeamScoreIT::test_hourly_team_score_it 
[gw3] PASSED apache_beam/examples/complete/juliaset/juliaset/juliaset_test_it.py::JuliaSetTestIT::test_run_example_with_setup_file 
apache_beam/io/fileio_test.py::MatchIntegrationTest::test_transform_on_gcs 
[gw5] PASSED apache_beam/io/parquetio_it_test.py::TestParquetIT::test_parquetio_it 
apache_beam/io/gcp/datastore/v1new/datastore_write_it_test.py::DatastoreWriteIT::test_datastore_write_limit 
[gw0] PASSED apache_beam/io/gcp/bigquery_read_it_test.py::ReadUsingStorageApiTests::test_iobase_source_with_column_selection_and_row_restriction_rows 
apache_beam/io/gcp/bigquery_read_it_test.py::ReadUsingStorageApiTests::test_iobase_source_with_native_datetime 
[gw1] PASSED apache_beam/io/gcp/pubsub_integration_test.py::PubSubIntegrationTest::test_streaming_with_attributes 
apache_beam/examples/streaming_wordcount_it_test.py::StreamingWordCountIT::test_streaming_wordcount_it 
[gw4] PASSED apache_beam/examples/complete/game/leader_board_it_test.py::LeaderBoardIT::test_leader_board_it 
apache_beam/examples/dataframe/flight_delays_it_test.py::FlightDelaysTest::test_flight_delays 
[gw6] PASSED apache_beam/io/gcp/bigquery_test.py::BigQueryFileLoadsIntegrationTests::test_avro_file_load 
apache_beam/examples/complete/game/user_score_it_test.py::UserScoreIT::test_user_score_it 
[gw7] PASSED apache_beam/examples/dataframe/taxiride_it_test.py::TaxirideIT::test_enrich 
apache_beam/examples/fastavro_it_test.py::FastavroIT::test_avro_it 
[gw3] PASSED apache_beam/io/fileio_test.py::MatchIntegrationTest::test_transform_on_gcs 
apache_beam/ml/gcp/visionml_test_it.py::VisionMlTestIT::test_text_detection_with_language_hint 
[gw0] PASSED apache_beam/io/gcp/bigquery_read_it_test.py::ReadUsingStorageApiTests::test_iobase_source_with_native_datetime 
apache_beam/io/gcp/bigquery_read_it_test.py::ReadUsingStorageApiTests::test_iobase_source_with_query 
[gw4] PASSED apache_beam/examples/dataframe/flight_delays_it_test.py::FlightDelaysTest::test_flight_delays 
apache_beam/ml/gcp/naturallanguageml_test_it.py::NaturalLanguageMlTestIT::test_analyzing_syntax 
[gw4] SKIPPED apache_beam/ml/gcp/naturallanguageml_test_it.py::NaturalLanguageMlTestIT::test_analyzing_syntax 
[gw3] PASSED apache_beam/ml/gcp/visionml_test_it.py::VisionMlTestIT::test_text_detection_with_language_hint 
apache_beam/transforms/external_it_test.py::ExternalTransformIT::test_job_python_from_python_it 
[gw0] PASSED apache_beam/io/gcp/bigquery_read_it_test.py::ReadUsingStorageApiTests::test_iobase_source_with_query 
apache_beam/io/gcp/bigquery_read_it_test.py::ReadUsingStorageApiTests::test_iobase_source_with_query_and_filters 
[gw2] PASSED apache_beam/examples/complete/game/hourly_team_score_it_test.py::HourlyTeamScoreIT::test_hourly_team_score_it 
apache_beam/examples/inference/tfx_bsl/tfx_bsl_inference_it_test.py::TFXRunInferenceTests::test_tfx_run_inference_mobilenetv2 
[gw2] SKIPPED apache_beam/examples/inference/tfx_bsl/tfx_bsl_inference_it_test.py::TFXRunInferenceTests::test_tfx_run_inference_mobilenetv2 
apache_beam/runners/dataflow/dataflow_exercise_metrics_pipeline_test.py::ExerciseMetricsPipelineTest::test_metrics_it 
[gw2] SKIPPED apache_beam/runners/dataflow/dataflow_exercise_metrics_pipeline_test.py::ExerciseMetricsPipelineTest::test_metrics_it 
[gw1] PASSED apache_beam/examples/streaming_wordcount_it_test.py::StreamingWordCountIT::test_streaming_wordcount_it 
apache_beam/ml/gcp/videointelligenceml_test_it.py::VideoIntelligenceMlTestIT::test_label_detection_with_video_context 
[gw1] SKIPPED apache_beam/ml/gcp/videointelligenceml_test_it.py::VideoIntelligenceMlTestIT::test_label_detection_with_video_context 
[gw7] PASSED apache_beam/examples/fastavro_it_test.py::FastavroIT::test_avro_it 
apache_beam/examples/cookbook/bigquery_tornadoes_it_test.py::BigqueryTornadoesIT::test_bigquery_tornadoes_it 
[gw3] PASSED apache_beam/transforms/external_it_test.py::ExternalTransformIT::test_job_python_from_python_it 
[gw0] PASSED apache_beam/io/gcp/bigquery_read_it_test.py::ReadUsingStorageApiTests::test_iobase_source_with_query_and_filters 
apache_beam/io/gcp/bigquery_read_it_test.py::ReadUsingStorageApiTests::test_iobase_source_with_row_restriction 
[gw6] PASSED apache_beam/examples/complete/game/user_score_it_test.py::UserScoreIT::test_user_score_it 
apache_beam/ml/inference/onnx_inference_it_test.py::OnnxInference::test_onnx_run_inference_roberta_sentiment_classification 
[gw6] SKIPPED apache_beam/ml/inference/onnx_inference_it_test.py::OnnxInference::test_onnx_run_inference_roberta_sentiment_classification 
[gw7] PASSED apache_beam/examples/cookbook/bigquery_tornadoes_it_test.py::BigqueryTornadoesIT::test_bigquery_tornadoes_it 
[gw0] PASSED apache_beam/io/gcp/bigquery_read_it_test.py::ReadUsingStorageApiTests::test_iobase_source_with_row_restriction 
apache_beam/io/gcp/bigquery_read_it_test.py::ReadUsingStorageApiTests::test_iobase_source_with_very_selective_filters 
[gw5] PASSED apache_beam/io/gcp/datastore/v1new/datastore_write_it_test.py::DatastoreWriteIT::test_datastore_write_limit 
apache_beam/ml/inference/base_test.py::RunInferenceBaseTest::test_run_inference_with_side_inputin_streaming 
[gw5] SKIPPED apache_beam/ml/inference/base_test.py::RunInferenceBaseTest::test_run_inference_with_side_inputin_streaming 
apache_beam/transforms/periodicsequence_it_test.py::PeriodicSequenceIT::test_periodicsequence_outputs_valid_watermarks_it 
[gw5] SKIPPED apache_beam/transforms/periodicsequence_it_test.py::PeriodicSequenceIT::test_periodicsequence_outputs_valid_watermarks_it 
[gw0] PASSED apache_beam/io/gcp/bigquery_read_it_test.py::ReadUsingStorageApiTests::test_iobase_source_with_very_selective_filters 
apache_beam/io/gcp/bigquery_read_it_test.py::ReadNewTypesTests::test_iobase_source 
[gw0] PASSED apache_beam/io/gcp/bigquery_read_it_test.py::ReadNewTypesTests::test_iobase_source 
apache_beam/io/gcp/bigquery_read_it_test.py::ReadNewTypesTests::test_native_source 
[gw0] PASSED apache_beam/io/gcp/bigquery_read_it_test.py::ReadNewTypesTests::test_native_source 
apache_beam/io/gcp/bigquery_read_it_test.py::ReadAllBQTests::test_read_queries 
[gw0] PASSED apache_beam/io/gcp/bigquery_read_it_test.py::ReadAllBQTests::test_read_queries 
apache_beam/io/gcp/bigquery_read_it_test.py::ReadInteractiveRunnerTests::test_read_in_interactive_runner 
[gw0] PASSED apache_beam/io/gcp/bigquery_read_it_test.py::ReadInteractiveRunnerTests::test_read_in_interactive_runner 

=============================== warnings summary ===============================
apache_beam/io/gcp/bigquery.py:2603
  <https://ci-beam.apache.org/job/beam_PostCommit_Python310/ws/src/sdks/python/apache_beam/io/gcp/bigquery.py>:2603: DeprecationWarning: invalid escape sequence '\#'
    """Read data from BigQuery.

apache_beam/io/gcp/bigquery_read_it_test.py::ReadTests::test_native_source
  <https://ci-beam.apache.org/job/beam_PostCommit_Python310/ws/src/sdks/python/apache_beam/io/gcp/bigquery_read_it_test.py>:170: BeamDeprecationWarning: BigQuerySource is deprecated since 2.25.0. Use ReadFromBigQuery instead.
    beam.io.BigQuerySource(query=self.query, use_standard_sql=True)))

apache_beam/io/gcp/bigquery_test.py::PubSubBigQueryIT::test_file_loads
apache_beam/io/gcp/bigquery_test.py::PubSubBigQueryIT::test_streaming_inserts
apache_beam/examples/complete/game/game_stats_it_test.py::GameStatsIT::test_game_stats_it
apache_beam/examples/complete/game/leader_board_it_test.py::LeaderBoardIT::test_leader_board_it
apache_beam/examples/complete/game/hourly_team_score_it_test.py::HourlyTeamScoreIT::test_hourly_team_score_it
  <https://ci-beam.apache.org/job/beam_PostCommit_Python310/ws/src/sdks/python/apache_beam/io/gcp/tests/utils.py>:63: PendingDeprecationWarning: Client.dataset is deprecated and will be removed in a future version. Use a string like 'my_project.my_dataset' or a cloud.google.bigquery.DatasetReference object, instead.
    dataset_ref = client.dataset(unique_dataset_name, project=project)

apache_beam/examples/dataframe/flight_delays_it_test.py::FlightDelaysTest::test_flight_delays
  <https://ci-beam.apache.org/job/beam_PostCommit_Python310/ws/src/sdks/python/apache_beam/examples/dataframe/flight_delays.py>:47: FutureWarning: The default value of numeric_only in DataFrame.mean is deprecated. In a future version, it will default to False. In addition, specifying 'numeric_only=None' is deprecated. Select only valid columns or specify the value of numeric_only to silence this warning.
    return airline_df[at_top_airports].mean()

apache_beam/examples/cookbook/bigquery_tornadoes_it_test.py::BigqueryTornadoesIT::test_bigquery_tornadoes_it
  <https://ci-beam.apache.org/job/beam_PostCommit_Python310/ws/src/sdks/python/apache_beam/io/gcp/tests/utils.py>:100: PendingDeprecationWarning: Client.dataset is deprecated and will be removed in a future version. Use a string like 'my_project.my_dataset' or a cloud.google.bigquery.DatasetReference object, instead.
    table_ref = client.dataset(dataset_id).table(table_id)

apache_beam/io/gcp/bigquery_read_it_test.py::ReadNewTypesTests::test_native_source
  <https://ci-beam.apache.org/job/beam_PostCommit_Python310/ws/src/sdks/python/apache_beam/io/gcp/bigquery_read_it_test.py>:706: BeamDeprecationWarning: BigQuerySource is deprecated since 2.25.0. Use ReadFromBigQuery instead.
    beam.io.BigQuerySource(query=self.query, use_standard_sql=True)))

-- Docs: https://docs.pytest.org/en/stable/how-to/capture-warnings.html
- generated xml file: <https://ci-beam.apache.org/job/beam_PostCommit_Python310/ws/src/sdks/python/pytest_postCommitIT-df-py310.xml> -
=========== 83 passed, 49 skipped, 10 warnings in 6084.59s (1:41:24) ===========

FAILURE: Build failed with an exception.

* Where:
Script '<https://ci-beam.apache.org/job/beam_PostCommit_Python310/ws/src/sdks/python/test-suites/portable/common.gradle'> line: 326

* What went wrong:
Execution failed for task ':sdks:python:test-suites:portable:py310:postCommitPy310IT'.
> Process 'command 'sh'' finished with non-zero exit value 1

* Try:
> Run with --stacktrace option to get the stack trace.
> Run with --info or --debug option to get more log output.
> Get more help at https://help.gradle.org.

Deprecated Gradle features were used in this build, making it incompatible with Gradle 9.0.

You can use '--warning-mode all' to show the individual deprecation warnings and determine if they come from your own scripts or plugins.

For more on this, please refer to https://docs.gradle.org/8.4/userguide/command_line_interface.html#sec:command_line_warnings in the Gradle documentation.

BUILD FAILED in 1h 47m 38s
217 actionable tasks: 152 executed, 61 from cache, 4 up-to-date

Publishing build scan...
https://ge.apache.org/s/jtamalzg427cg

Build step 'Invoke Gradle script' changed build result to FAILURE
Build step 'Invoke Gradle script' marked build as failure

---------------------------------------------------------------------
To unsubscribe, e-mail: builds-unsubscribe@beam.apache.org
For additional commands, e-mail: builds-help@beam.apache.org


Build failed in Jenkins: beam_PostCommit_Python310 #1658

Posted by Apache Jenkins Server <je...@builds.apache.org>.
See <https://ci-beam.apache.org/job/beam_PostCommit_Python310/1658/display/redirect?page=changes>

Changes:

[noreply] fix: optimize segment reader (#29694)


------------------------------------------
[...truncated 12.87 MB...]
ERROR:apache_beam.runners.worker.data_plane:Failed to read inputs in the data plane.
Traceback (most recent call last):
  File "<https://ci-beam.apache.org/job/beam_PostCommit_Python310/ws/src/sdks/python/apache_beam/runners/worker/data_plane.py",> line 669, in _read_inputs
    for elements in elements_iterator:
  File "<https://ci-beam.apache.org/job/beam_PostCommit_Python310/ws/src/build/gradleenv/-1720702907/lib/python3.10/site-packages/grpc/_channel.py",> line 540, in __next__
    return self._next()
  File "<https://ci-beam.apache.org/job/beam_PostCommit_Python310/ws/src/build/gradleenv/-1720702907/lib/python3.10/site-packages/grpc/_channel.py",> line 966, in _next
    raise self
grpc._channel._MultiThreadedRendezvous: <_MultiThreadedRendezvous of RPC that terminated with:
	status = StatusCode.UNAVAILABLE
	details = "recvmsg:Connection reset by peer"
	debug_error_string = "UNKNOWN:Error received from peer ipv6:%5B::1%5D:43073 {created_time:"2023-12-13T09:28:35.382863528+00:00", grpc_status:14, grpc_message:"recvmsg:Connection reset by peer"}"
>
  File "/usr/lib/python3.10/threading.py", line 946, in run
    self.run()
Exception in thread read_grpc_client_inputs:
    self._target(*self._args, **self._kwargs)
Traceback (most recent call last):
  File "/usr/lib/python3.10/threading.py", line 946, in run
  File "/usr/lib/python3.10/threading.py", line 1009, in _bootstrap_inner
  File "<https://ci-beam.apache.org/job/beam_PostCommit_Python310/ws/src/sdks/python/apache_beam/runners/worker/sdk_worker.py",> line 265, in run
    self._target(*self._args, **self._kwargs)
    self.run()
    for work_request in self._control_stub.Control(get_responses()):
  File "/usr/lib/python3.10/threading.py", line 946, in run
  File "<https://ci-beam.apache.org/job/beam_PostCommit_Python310/ws/src/sdks/python/apache_beam/runners/worker/sdk_worker.py",> line 1042, in pull_responses
  File "<https://ci-beam.apache.org/job/beam_PostCommit_Python310/ws/src/build/gradleenv/-1720702907/lib/python3.10/site-packages/grpc/_channel.py",> line 540, in __next__
    self._target(*self._args, **self._kwargs)
  File "<https://ci-beam.apache.org/job/beam_PostCommit_Python310/ws/src/sdks/python/apache_beam/runners/worker/data_plane.py",> line 686, in <lambda>
    return self._next()
    for response in responses:
  File "<https://ci-beam.apache.org/job/beam_PostCommit_Python310/ws/src/build/gradleenv/-1720702907/lib/python3.10/site-packages/grpc/_channel.py",> line 540, in __next__
  File "<https://ci-beam.apache.org/job/beam_PostCommit_Python310/ws/src/build/gradleenv/-1720702907/lib/python3.10/site-packages/grpc/_channel.py",> line 966, in _next
    target=lambda: self._read_inputs(elements_iterator),
  File "<https://ci-beam.apache.org/job/beam_PostCommit_Python310/ws/src/sdks/python/apache_beam/runners/worker/data_plane.py",> line 669, in _read_inputs
    raise self
    return self._next()
grpc._channel._MultiThreadedRendezvous: <_MultiThreadedRendezvous of RPC that terminated with:
	status = StatusCode.UNAVAILABLE
	details = "recvmsg:Connection reset by peer"
	debug_error_string = "UNKNOWN:Error received from peer ipv6:%5B::1%5D:42315 {grpc_message:"recvmsg:Connection reset by peer", grpc_status:14, created_time:"2023-12-13T09:28:35.382880423+00:00"}"
>
  File "<https://ci-beam.apache.org/job/beam_PostCommit_Python310/ws/src/build/gradleenv/-1720702907/lib/python3.10/site-packages/grpc/_channel.py",> line 966, in _next
    for elements in elements_iterator:
  File "<https://ci-beam.apache.org/job/beam_PostCommit_Python310/ws/src/build/gradleenv/-1720702907/lib/python3.10/site-packages/grpc/_channel.py",> line 540, in __next__
    raise self
    return self._next()
grpc._channel._MultiThreadedRendezvous: <_MultiThreadedRendezvous of RPC that terminated with:
	status = StatusCode.UNAVAILABLE
	details = "Socket closed"
	debug_error_string = "UNKNOWN:Error received from peer ipv6:%5B::1%5D:41285 {grpc_message:"Socket closed", grpc_status:14, created_time:"2023-12-13T09:28:35.382879365+00:00"}"
>
  File "<https://ci-beam.apache.org/job/beam_PostCommit_Python310/ws/src/build/gradleenv/-1720702907/lib/python3.10/site-packages/grpc/_channel.py",> line 966, in _next
    raise self
grpc._channel._MultiThreadedRendezvous: <_MultiThreadedRendezvous of RPC that terminated with:
	status = StatusCode.UNAVAILABLE
	details = "recvmsg:Connection reset by peer"
	debug_error_string = "UNKNOWN:Error received from peer ipv6:%5B::1%5D:43073 {created_time:"2023-12-13T09:28:35.382863528+00:00", grpc_status:14, grpc_message:"recvmsg:Connection reset by peer"}"
>

> Task :sdks:python:test-suites:dataflow:py310:postCommitIT

[gw2] PASSED apache_beam/io/gcp/bigquery_read_it_test.py::ReadTests::test_table_schema_retrieve_specifying_only_table 
apache_beam/io/gcp/bigquery_read_it_test.py::ReadTests::test_table_schema_retrieve_with_direct_read 
[gw5] PASSED apache_beam/dataframe/io_it_test.py::ReadUsingReadGbqTests::test_ReadGbq_export_with_project 
apache_beam/dataframe/io_it_test.py::ReadUsingReadGbqTests::test_ReadGbq_with_computation 
[gw7] PASSED apache_beam/io/gcp/bigquery_write_it_test.py::BigQueryWriteIntegrationTests::test_big_query_write_new_types 
apache_beam/io/gcp/bigquery_write_it_test.py::BigQueryWriteIntegrationTests::test_big_query_write_schema_autodetect 
[gw7] SKIPPED apache_beam/io/gcp/bigquery_write_it_test.py::BigQueryWriteIntegrationTests::test_big_query_write_schema_autodetect 
apache_beam/io/gcp/bigquery_write_it_test.py::BigQueryWriteIntegrationTests::test_big_query_write_without_schema 
[gw6] PASSED apache_beam/ml/inference/sklearn_inference_it_test.py::SklearnInference::test_sklearn_mnist_classification_large_model 
apache_beam/ml/inference/sklearn_inference_it_test.py::SklearnInference::test_sklearn_regression 
[gw4] PASSED apache_beam/io/gcp/big_query_query_to_table_it_test.py::BigQueryQueryToTableIT::test_big_query_standard_sql 
apache_beam/examples/dataframe/taxiride_it_test.py::TaxirideIT::test_aggregation 
[gw0] PASSED apache_beam/io/gcp/bigquery_json_it_test.py::BigQueryJsonIT::test_streaming_inserts 
apache_beam/examples/wordcount_it_test.py::WordCountIT::test_wordcount_impersonation_it 
[gw2] PASSED apache_beam/io/gcp/bigquery_read_it_test.py::ReadTests::test_table_schema_retrieve_with_direct_read 
apache_beam/io/gcp/bigquery_read_it_test.py::ReadUsingStorageApiTests::test_iobase_source 
[gw5] PASSED apache_beam/dataframe/io_it_test.py::ReadUsingReadGbqTests::test_ReadGbq_with_computation 
apache_beam/io/gcp/bigquery_io_read_it_test.py::BigqueryIOReadIT::test_bigquery_read_1M_python 
[gw1] PASSED apache_beam/io/gcp/pubsub_integration_test.py::PubSubIntegrationTest::test_streaming_data_only 
apache_beam/io/gcp/pubsub_integration_test.py::PubSubIntegrationTest::test_streaming_with_attributes 
[gw7] PASSED apache_beam/io/gcp/bigquery_write_it_test.py::BigQueryWriteIntegrationTests::test_big_query_write_without_schema 
apache_beam/examples/fastavro_it_test.py::FastavroIT::test_avro_it 
[gw6] PASSED apache_beam/ml/inference/sklearn_inference_it_test.py::SklearnInference::test_sklearn_regression 
apache_beam/ml/gcp/cloud_dlp_it_test.py::CloudDLPIT::test_deidentification 
[gw3] PASSED apache_beam/io/gcp/bigquery_test.py::PubSubBigQueryIT::test_file_loads 
apache_beam/io/gcp/bigquery_test.py::PubSubBigQueryIT::test_streaming_inserts 
[gw0] PASSED apache_beam/examples/wordcount_it_test.py::WordCountIT::test_wordcount_impersonation_it 
apache_beam/examples/wordcount_it_test.py::WordCountIT::test_wordcount_it 
[gw2] PASSED apache_beam/io/gcp/bigquery_read_it_test.py::ReadUsingStorageApiTests::test_iobase_source 
apache_beam/io/gcp/bigquery_read_it_test.py::ReadUsingStorageApiTests::test_iobase_source_with_column_selection 
[gw5] PASSED apache_beam/io/gcp/bigquery_io_read_it_test.py::BigqueryIOReadIT::test_bigquery_read_1M_python 
apache_beam/io/gcp/bigquery_io_read_it_test.py::BigqueryIOReadIT::test_bigquery_read_custom_1M_python 
[gw4] PASSED apache_beam/examples/dataframe/taxiride_it_test.py::TaxirideIT::test_aggregation 
apache_beam/examples/dataframe/taxiride_it_test.py::TaxirideIT::test_enrich 
[gw6] PASSED apache_beam/ml/gcp/cloud_dlp_it_test.py::CloudDLPIT::test_deidentification 
apache_beam/ml/gcp/cloud_dlp_it_test.py::CloudDLPIT::test_inspection 
[gw0] PASSED apache_beam/examples/wordcount_it_test.py::WordCountIT::test_wordcount_it 
apache_beam/examples/complete/autocomplete_test.py::AutocompleteTest::test_autocomplete_it 
[gw2] PASSED apache_beam/io/gcp/bigquery_read_it_test.py::ReadUsingStorageApiTests::test_iobase_source_with_column_selection 
apache_beam/io/gcp/bigquery_read_it_test.py::ReadUsingStorageApiTests::test_iobase_source_with_column_selection_and_row_restriction 
[gw5] PASSED apache_beam/io/gcp/bigquery_io_read_it_test.py::BigqueryIOReadIT::test_bigquery_read_custom_1M_python 
apache_beam/examples/complete/game/game_stats_it_test.py::GameStatsIT::test_game_stats_it 
[gw6] PASSED apache_beam/ml/gcp/cloud_dlp_it_test.py::CloudDLPIT::test_inspection 
apache_beam/examples/complete/game/leader_board_it_test.py::LeaderBoardIT::test_leader_board_it 
[gw1] PASSED apache_beam/io/gcp/pubsub_integration_test.py::PubSubIntegrationTest::test_streaming_with_attributes 
apache_beam/io/gcp/healthcare/dicomio_integration_test.py::DICOMIoIntegrationTest::test_dicom_search_instances 
[gw7] PASSED apache_beam/examples/fastavro_it_test.py::FastavroIT::test_avro_it 
apache_beam/examples/streaming_wordcount_debugging_it_test.py::StreamingWordcountDebuggingIT::test_streaming_wordcount_debugging_it 
[gw7] SKIPPED apache_beam/examples/streaming_wordcount_debugging_it_test.py::StreamingWordcountDebuggingIT::test_streaming_wordcount_debugging_it 
apache_beam/examples/complete/game/hourly_team_score_it_test.py::HourlyTeamScoreIT::test_hourly_team_score_it 
[gw0] PASSED apache_beam/examples/complete/autocomplete_test.py::AutocompleteTest::test_autocomplete_it 
apache_beam/examples/complete/juliaset/juliaset/juliaset_test_it.py::JuliaSetTestIT::test_run_example_with_setup_file <https://ci-beam.apache.org/job/beam_PostCommit_Python310/ws/src/build/gradleenv/2050596098/bin/python3.10>: No module named build
warning: sdist: standard file not found: should have one of README, README.rst, README.txt, README.md

warning: check: missing required meta-data: url

warning: check: missing meta-data: either (author and author_email) or (maintainer and maintainer_email) should be supplied


[gw2] PASSED apache_beam/io/gcp/bigquery_read_it_test.py::ReadUsingStorageApiTests::test_iobase_source_with_column_selection_and_row_restriction 
apache_beam/io/gcp/bigquery_read_it_test.py::ReadUsingStorageApiTests::test_iobase_source_with_column_selection_and_row_restriction_rows 
[gw1] PASSED apache_beam/io/gcp/healthcare/dicomio_integration_test.py::DICOMIoIntegrationTest::test_dicom_search_instances 
apache_beam/io/gcp/healthcare/dicomio_integration_test.py::DICOMIoIntegrationTest::test_dicom_store_instance_from_gcs 
[gw3] PASSED apache_beam/io/gcp/bigquery_test.py::PubSubBigQueryIT::test_streaming_inserts 
apache_beam/io/gcp/bigquery_test.py::BigQueryFileLoadsIntegrationTests::test_avro_file_load 
[gw2] PASSED apache_beam/io/gcp/bigquery_read_it_test.py::ReadUsingStorageApiTests::test_iobase_source_with_column_selection_and_row_restriction_rows 
apache_beam/io/gcp/bigquery_read_it_test.py::ReadUsingStorageApiTests::test_iobase_source_with_native_datetime 
[gw0] PASSED apache_beam/examples/complete/juliaset/juliaset/juliaset_test_it.py::JuliaSetTestIT::test_run_example_with_setup_file 
apache_beam/examples/inference/tfx_bsl/tfx_bsl_inference_it_test.py::TFXRunInferenceTests::test_tfx_run_inference_mobilenetv2 
[gw0] SKIPPED apache_beam/examples/inference/tfx_bsl/tfx_bsl_inference_it_test.py::TFXRunInferenceTests::test_tfx_run_inference_mobilenetv2 
apache_beam/ml/gcp/visionml_test_it.py::VisionMlTestIT::test_text_detection_with_language_hint 
[gw1] PASSED apache_beam/io/gcp/healthcare/dicomio_integration_test.py::DICOMIoIntegrationTest::test_dicom_store_instance_from_gcs 
apache_beam/io/gcp/datastore/v1new/datastore_write_it_test.py::DatastoreWriteIT::test_datastore_write_limit 
[gw6] PASSED apache_beam/examples/complete/game/leader_board_it_test.py::LeaderBoardIT::test_leader_board_it 
apache_beam/examples/dataframe/flight_delays_it_test.py::FlightDelaysTest::test_flight_delays 
[gw3] PASSED apache_beam/io/gcp/bigquery_test.py::BigQueryFileLoadsIntegrationTests::test_avro_file_load 
apache_beam/examples/complete/game/user_score_it_test.py::UserScoreIT::test_user_score_it 
[gw5] PASSED apache_beam/examples/complete/game/game_stats_it_test.py::GameStatsIT::test_game_stats_it 
apache_beam/examples/cookbook/bigquery_tornadoes_it_test.py::BigqueryTornadoesIT::test_bigquery_tornadoes_it 
[gw2] PASSED apache_beam/io/gcp/bigquery_read_it_test.py::ReadUsingStorageApiTests::test_iobase_source_with_native_datetime 
apache_beam/io/gcp/bigquery_read_it_test.py::ReadUsingStorageApiTests::test_iobase_source_with_query 
[gw4] PASSED apache_beam/examples/dataframe/taxiride_it_test.py::TaxirideIT::test_enrich 
apache_beam/examples/streaming_wordcount_it_test.py::StreamingWordCountIT::test_streaming_wordcount_it 
[gw0] PASSED apache_beam/ml/gcp/visionml_test_it.py::VisionMlTestIT::test_text_detection_with_language_hint 
apache_beam/runners/dataflow/dataflow_exercise_metrics_pipeline_test.py::ExerciseMetricsPipelineTest::test_metrics_it 
[gw0] SKIPPED apache_beam/runners/dataflow/dataflow_exercise_metrics_pipeline_test.py::ExerciseMetricsPipelineTest::test_metrics_it 
apache_beam/transforms/external_it_test.py::ExternalTransformIT::test_job_python_from_python_it 
[gw7] PASSED apache_beam/examples/complete/game/hourly_team_score_it_test.py::HourlyTeamScoreIT::test_hourly_team_score_it 
apache_beam/ml/gcp/naturallanguageml_test_it.py::NaturalLanguageMlTestIT::test_analyzing_syntax 
[gw7] SKIPPED apache_beam/ml/gcp/naturallanguageml_test_it.py::NaturalLanguageMlTestIT::test_analyzing_syntax 
apache_beam/ml/gcp/videointelligenceml_test_it.py::VideoIntelligenceMlTestIT::test_label_detection_with_video_context 
[gw7] SKIPPED apache_beam/ml/gcp/videointelligenceml_test_it.py::VideoIntelligenceMlTestIT::test_label_detection_with_video_context 
[gw6] PASSED apache_beam/examples/dataframe/flight_delays_it_test.py::FlightDelaysTest::test_flight_delays 
apache_beam/io/parquetio_it_test.py::TestParquetIT::test_parquetio_it 
[gw5] PASSED apache_beam/examples/cookbook/bigquery_tornadoes_it_test.py::BigqueryTornadoesIT::test_bigquery_tornadoes_it 
apache_beam/io/fileio_test.py::MatchIntegrationTest::test_transform_on_gcs 
[gw2] PASSED apache_beam/io/gcp/bigquery_read_it_test.py::ReadUsingStorageApiTests::test_iobase_source_with_query 
apache_beam/io/gcp/bigquery_read_it_test.py::ReadUsingStorageApiTests::test_iobase_source_with_query_and_filters 
[gw0] PASSED apache_beam/transforms/external_it_test.py::ExternalTransformIT::test_job_python_from_python_it 
[gw6] PASSED apache_beam/io/parquetio_it_test.py::TestParquetIT::test_parquetio_it 
[gw5] PASSED apache_beam/io/fileio_test.py::MatchIntegrationTest::test_transform_on_gcs 
[gw2] PASSED apache_beam/io/gcp/bigquery_read_it_test.py::ReadUsingStorageApiTests::test_iobase_source_with_query_and_filters 
apache_beam/io/gcp/bigquery_read_it_test.py::ReadUsingStorageApiTests::test_iobase_source_with_row_restriction 
[gw3] PASSED apache_beam/examples/complete/game/user_score_it_test.py::UserScoreIT::test_user_score_it 
apache_beam/ml/inference/onnx_inference_it_test.py::OnnxInference::test_onnx_run_inference_roberta_sentiment_classification 
[gw3] SKIPPED apache_beam/ml/inference/onnx_inference_it_test.py::OnnxInference::test_onnx_run_inference_roberta_sentiment_classification 
[gw4] PASSED apache_beam/examples/streaming_wordcount_it_test.py::StreamingWordCountIT::test_streaming_wordcount_it 
apache_beam/examples/cookbook/datastore_wordcount_it_test.py::DatastoreWordCountIT::test_datastore_wordcount_it 
[gw2] PASSED apache_beam/io/gcp/bigquery_read_it_test.py::ReadUsingStorageApiTests::test_iobase_source_with_row_restriction 
apache_beam/io/gcp/bigquery_read_it_test.py::ReadUsingStorageApiTests::test_iobase_source_with_very_selective_filters 
[gw4] PASSED apache_beam/examples/cookbook/datastore_wordcount_it_test.py::DatastoreWordCountIT::test_datastore_wordcount_it 
[gw2] PASSED apache_beam/io/gcp/bigquery_read_it_test.py::ReadUsingStorageApiTests::test_iobase_source_with_very_selective_filters 
apache_beam/io/gcp/bigquery_read_it_test.py::ReadNewTypesTests::test_iobase_source 
[gw1] PASSED apache_beam/io/gcp/datastore/v1new/datastore_write_it_test.py::DatastoreWriteIT::test_datastore_write_limit 
apache_beam/ml/inference/base_test.py::RunInferenceBaseTest::test_run_inference_with_side_inputin_streaming 
[gw1] SKIPPED apache_beam/ml/inference/base_test.py::RunInferenceBaseTest::test_run_inference_with_side_inputin_streaming 
apache_beam/transforms/periodicsequence_it_test.py::PeriodicSequenceIT::test_periodicsequence_outputs_valid_watermarks_it 
[gw1] SKIPPED apache_beam/transforms/periodicsequence_it_test.py::PeriodicSequenceIT::test_periodicsequence_outputs_valid_watermarks_it 
[gw2] PASSED apache_beam/io/gcp/bigquery_read_it_test.py::ReadNewTypesTests::test_iobase_source 
apache_beam/io/gcp/bigquery_read_it_test.py::ReadNewTypesTests::test_native_source 
[gw2] PASSED apache_beam/io/gcp/bigquery_read_it_test.py::ReadNewTypesTests::test_native_source 
apache_beam/io/gcp/bigquery_read_it_test.py::ReadAllBQTests::test_read_queries 
[gw2] PASSED apache_beam/io/gcp/bigquery_read_it_test.py::ReadAllBQTests::test_read_queries 
apache_beam/io/gcp/bigquery_read_it_test.py::ReadInteractiveRunnerTests::test_read_in_interactive_runner 
[gw2] PASSED apache_beam/io/gcp/bigquery_read_it_test.py::ReadInteractiveRunnerTests::test_read_in_interactive_runner 

=============================== warnings summary ===============================
apache_beam/io/gcp/bigquery.py:2603
  <https://ci-beam.apache.org/job/beam_PostCommit_Python310/ws/src/sdks/python/apache_beam/io/gcp/bigquery.py>:2603: DeprecationWarning: invalid escape sequence '\#'
    """Read data from BigQuery.

apache_beam/io/gcp/bigquery_read_it_test.py::ReadTests::test_native_source
  <https://ci-beam.apache.org/job/beam_PostCommit_Python310/ws/src/sdks/python/apache_beam/io/gcp/bigquery_read_it_test.py>:170: BeamDeprecationWarning: BigQuerySource is deprecated since 2.25.0. Use ReadFromBigQuery instead.
    beam.io.BigQuerySource(query=self.query, use_standard_sql=True)))

apache_beam/io/gcp/bigquery_test.py::PubSubBigQueryIT::test_file_loads
apache_beam/io/gcp/bigquery_test.py::PubSubBigQueryIT::test_streaming_inserts
apache_beam/examples/complete/game/leader_board_it_test.py::LeaderBoardIT::test_leader_board_it
apache_beam/examples/complete/game/game_stats_it_test.py::GameStatsIT::test_game_stats_it
apache_beam/examples/complete/game/hourly_team_score_it_test.py::HourlyTeamScoreIT::test_hourly_team_score_it
  <https://ci-beam.apache.org/job/beam_PostCommit_Python310/ws/src/sdks/python/apache_beam/io/gcp/tests/utils.py>:63: PendingDeprecationWarning: Client.dataset is deprecated and will be removed in a future version. Use a string like 'my_project.my_dataset' or a cloud.google.bigquery.DatasetReference object, instead.
    dataset_ref = client.dataset(unique_dataset_name, project=project)

apache_beam/examples/dataframe/flight_delays_it_test.py::FlightDelaysTest::test_flight_delays
  <https://ci-beam.apache.org/job/beam_PostCommit_Python310/ws/src/sdks/python/apache_beam/examples/dataframe/flight_delays.py>:47: FutureWarning: The default value of numeric_only in DataFrame.mean is deprecated. In a future version, it will default to False. In addition, specifying 'numeric_only=None' is deprecated. Select only valid columns or specify the value of numeric_only to silence this warning.
    return airline_df[at_top_airports].mean()

apache_beam/examples/cookbook/bigquery_tornadoes_it_test.py::BigqueryTornadoesIT::test_bigquery_tornadoes_it
  <https://ci-beam.apache.org/job/beam_PostCommit_Python310/ws/src/sdks/python/apache_beam/io/gcp/tests/utils.py>:100: PendingDeprecationWarning: Client.dataset is deprecated and will be removed in a future version. Use a string like 'my_project.my_dataset' or a cloud.google.bigquery.DatasetReference object, instead.
    table_ref = client.dataset(dataset_id).table(table_id)

apache_beam/io/gcp/bigquery_read_it_test.py::ReadNewTypesTests::test_native_source
  <https://ci-beam.apache.org/job/beam_PostCommit_Python310/ws/src/sdks/python/apache_beam/io/gcp/bigquery_read_it_test.py>:706: BeamDeprecationWarning: BigQuerySource is deprecated since 2.25.0. Use ReadFromBigQuery instead.
    beam.io.BigQuerySource(query=self.query, use_standard_sql=True)))

-- Docs: https://docs.pytest.org/en/stable/how-to/capture-warnings.html
- generated xml file: <https://ci-beam.apache.org/job/beam_PostCommit_Python310/ws/src/sdks/python/pytest_postCommitIT-df-py310.xml> -
=========== 83 passed, 49 skipped, 10 warnings in 5785.22s (1:36:25) ===========

FAILURE: Build failed with an exception.

* Where:
Script '<https://ci-beam.apache.org/job/beam_PostCommit_Python310/ws/src/sdks/python/test-suites/portable/common.gradle'> line: 326

* What went wrong:
Execution failed for task ':sdks:python:test-suites:portable:py310:postCommitPy310IT'.
> Process 'command 'sh'' finished with non-zero exit value 1

* Try:
> Run with --stacktrace option to get the stack trace.
> Run with --info or --debug option to get more log output.
> Get more help at https://help.gradle.org.

Deprecated Gradle features were used in this build, making it incompatible with Gradle 9.0.

You can use '--warning-mode all' to show the individual deprecation warnings and determine if they come from your own scripts or plugins.

For more on this, please refer to https://docs.gradle.org/8.4/userguide/command_line_interface.html#sec:command_line_warnings in the Gradle documentation.

BUILD FAILED in 1h 42m 39s
217 actionable tasks: 152 executed, 61 from cache, 4 up-to-date

Publishing build scan...
https://ge.apache.org/s/am3vt6lh4mpqy

Build step 'Invoke Gradle script' changed build result to FAILURE
Build step 'Invoke Gradle script' marked build as failure

---------------------------------------------------------------------
To unsubscribe, e-mail: builds-unsubscribe@beam.apache.org
For additional commands, e-mail: builds-help@beam.apache.org


Build failed in Jenkins: beam_PostCommit_Python310 #1657

Posted by Apache Jenkins Server <je...@builds.apache.org>.
See <https://ci-beam.apache.org/job/beam_PostCommit_Python310/1657/display/redirect>

Changes:


------------------------------------------
[...truncated 5.39 MB...]
  seconds: 1702438034
  nanos: 986005306
}
message: "No more requests from control plane"
log_location: "/usr/local/lib/python3.10/site-packages/apache_beam/runners/worker/sdk_worker.py:277"
thread: "MainThread"

INFO:root:severity: INFO
timestamp {
  seconds: 1702438034
  nanos: 986130475
}
message: "SDK Harness waiting for in-flight requests to complete"
log_location: "/usr/local/lib/python3.10/site-packages/apache_beam/runners/worker/sdk_worker.py:278"
thread: "MainThread"

INFO:root:severity: INFO
timestamp {
  seconds: 1702438034
  nanos: 986195802
}
message: "Closing all cached grpc data channels."
log_location: "/usr/local/lib/python3.10/site-packages/apache_beam/runners/worker/data_plane.py:820"
thread: "MainThread"

INFO:root:severity: INFO
timestamp {
  seconds: 1702438034
  nanos: 986255168
}
message: "Closing all cached gRPC state handlers."
log_location: "/usr/local/lib/python3.10/site-packages/apache_beam/runners/worker/sdk_worker.py:911"
thread: "MainThread"

INFO:root:severity: INFO
timestamp {
  seconds: 1702438034
  nanos: 986422061
}
message: "Done consuming work."
log_location: "/usr/local/lib/python3.10/site-packages/apache_beam/runners/worker/sdk_worker.py:290"
thread: "MainThread"

INFO:root:severity: INFO
timestamp {
  seconds: 1702438034
  nanos: 986475467
}
message: "Python sdk harness exiting."
log_location: "/usr/local/lib/python3.10/site-packages/apache_beam/runners/worker/sdk_worker_main.py:213"
thread: "MainThread"

INFO:apache_beam.runners.portability.local_job_service:Completed job in 25.956921577453613 seconds with state DONE.
INFO:root:Completed job in 25.956921577453613 seconds with state DONE.
INFO:apache_beam.runners.portability.portable_runner:Job state changed to DONE

> Task :sdks:python:test-suites:portable:py310:portableWordCountSparkRunnerBatch
INFO:apache_beam.runners.worker.worker_pool_main:Listening for workers at localhost:43703
INFO:apache_beam.runners.portability.fn_api_runner.translations:==================== <function pack_combiners at 0x7f6a2f410a60> ====================
INFO:apache_beam.runners.portability.fn_api_runner.translations:==================== <function lift_combiners at 0x7f6a2f410af0> ====================
INFO:apache_beam.runners.portability.fn_api_runner.translations:==================== <function sort_stages at 0x7f6a2f411240> ====================
INFO:apache_beam.utils.subprocess_server:Starting service with ('java' '-jar' '<https://ci-beam.apache.org/job/beam_PostCommit_Python310/ws/src/runners/spark/3/job-server/build/libs/beam-runners-spark-3-job-server-2.53.0-SNAPSHOT.jar'> '--spark-master-url' 'local[4]' '--artifacts-dir' '/tmp/beam-tempn2j7iro9/artifacts0vp9p3u6' '--job-port' '40939' '--artifact-port' '0' '--expansion-port' '0')
INFO:apache_beam.utils.subprocess_server:23/12/13 03:27:25 WARN software.amazon.awssdk.regions.internal.util.EC2MetadataUtils: Unable to retrieve the requested metadata.
INFO:apache_beam.utils.subprocess_server:23/12/13 03:27:25 INFO org.apache.beam.runners.jobsubmission.JobServerDriver: ArtifactStagingService started on localhost:35267
INFO:apache_beam.utils.subprocess_server:23/12/13 03:27:25 INFO org.apache.beam.runners.jobsubmission.JobServerDriver: Java ExpansionService started on localhost:34215
INFO:apache_beam.utils.subprocess_server:23/12/13 03:27:25 INFO org.apache.beam.runners.jobsubmission.JobServerDriver: JobService started on localhost:40939
INFO:apache_beam.utils.subprocess_server:23/12/13 03:27:25 INFO org.apache.beam.runners.jobsubmission.JobServerDriver: Job server now running, terminate with Ctrl+C
INFO:apache_beam.utils.subprocess_server:23/12/13 03:27:25 INFO org.apache.beam.runners.fnexecution.artifact.ArtifactStagingService: Staging artifacts for job_42713174-7468-4edc-8e6d-e47901091278.
INFO:apache_beam.utils.subprocess_server:23/12/13 03:27:25 INFO org.apache.beam.runners.fnexecution.artifact.ArtifactStagingService: Resolving artifacts for job_42713174-7468-4edc-8e6d-e47901091278.0:ref_Environment_default_environment_1.
INFO:apache_beam.utils.subprocess_server:23/12/13 03:27:25 INFO org.apache.beam.runners.fnexecution.artifact.ArtifactStagingService: Getting 1 artifacts for job_42713174-7468-4edc-8e6d-e47901091278.null.
INFO:apache_beam.utils.subprocess_server:23/12/13 03:27:25 INFO org.apache.beam.runners.fnexecution.artifact.ArtifactStagingService: Artifacts fully staged for job_42713174-7468-4edc-8e6d-e47901091278.
INFO:apache_beam.utils.subprocess_server:23/12/13 03:27:26 INFO org.apache.beam.runners.spark.SparkJobInvoker: Invoking job BeamApp-jenkins-1213032726-7fd2c55e_ec9f687e-b391-4fd9-95b2-2a80401237b6
INFO:apache_beam.utils.subprocess_server:23/12/13 03:27:26 INFO org.apache.beam.runners.jobsubmission.JobInvocation: Starting job invocation BeamApp-jenkins-1213032726-7fd2c55e_ec9f687e-b391-4fd9-95b2-2a80401237b6
INFO:apache_beam.runners.portability.portable_runner:Environment "LOOPBACK" has started a component necessary for the execution. Be sure to run the pipeline using
  with Pipeline() as p:
    p.apply(..)
This ensures that the pipeline finishes before this program exits.
INFO:apache_beam.runners.portability.portable_runner:Job state changed to STOPPED
INFO:apache_beam.runners.portability.portable_runner:Job state changed to STARTING
INFO:apache_beam.runners.portability.portable_runner:Job state changed to RUNNING
INFO:apache_beam.utils.subprocess_server:23/12/13 03:27:26 INFO org.apache.beam.runners.spark.translation.SparkContextFactory: Creating a brand new Spark Context.
INFO:apache_beam.utils.subprocess_server:23/12/13 03:27:26 WARN org.apache.hadoop.util.NativeCodeLoader: Unable to load native-hadoop library for your platform... using builtin-java classes where applicable
INFO:apache_beam.utils.subprocess_server:23/12/13 03:27:27 INFO org.sparkproject.jetty.util.log: Logging initialized @4796ms to org.sparkproject.jetty.util.log.Slf4jLog
INFO:apache_beam.utils.subprocess_server:23/12/13 03:27:27 INFO org.sparkproject.jetty.server.Server: jetty-9.4.44.v20210927; built: 2021-09-27T23:02:44.612Z; git: 8da83308eeca865e495e53ef315a249d63ba9332; jvm 1.8.0_392-8u392-ga-1~20.04-b08
INFO:apache_beam.utils.subprocess_server:23/12/13 03:27:27 INFO org.sparkproject.jetty.server.Server: Started @4897ms
INFO:apache_beam.utils.subprocess_server:23/12/13 03:27:27 INFO org.sparkproject.jetty.server.AbstractConnector: Started ServerConnector@5a829d2e{HTTP/1.1, (http/1.1)}{127.0.0.1:4040}
INFO:apache_beam.utils.subprocess_server:23/12/13 03:27:27 INFO org.sparkproject.jetty.server.handler.ContextHandler: Started o.s.j.s.ServletContextHandler@3257f0a1{/jobs,null,AVAILABLE,@Spark}
INFO:apache_beam.utils.subprocess_server:23/12/13 03:27:27 INFO org.sparkproject.jetty.server.handler.ContextHandler: Started o.s.j.s.ServletContextHandler@3318c9da{/jobs/json,null,AVAILABLE,@Spark}
INFO:apache_beam.utils.subprocess_server:23/12/13 03:27:27 INFO org.sparkproject.jetty.server.handler.ContextHandler: Started o.s.j.s.ServletContextHandler@25f2bb0e{/jobs/job,null,AVAILABLE,@Spark}
INFO:apache_beam.utils.subprocess_server:23/12/13 03:27:27 INFO org.sparkproject.jetty.server.handler.ContextHandler: Started o.s.j.s.ServletContextHandler@f5f33b0{/jobs/job/json,null,AVAILABLE,@Spark}
INFO:apache_beam.utils.subprocess_server:23/12/13 03:27:27 INFO org.sparkproject.jetty.server.handler.ContextHandler: Started o.s.j.s.ServletContextHandler@6e9c935a{/stages,null,AVAILABLE,@Spark}
INFO:apache_beam.utils.subprocess_server:23/12/13 03:27:27 INFO org.sparkproject.jetty.server.handler.ContextHandler: Started o.s.j.s.ServletContextHandler@262cfaea{/stages/json,null,AVAILABLE,@Spark}
INFO:apache_beam.utils.subprocess_server:23/12/13 03:27:27 INFO org.sparkproject.jetty.server.handler.ContextHandler: Started o.s.j.s.ServletContextHandler@3de8c767{/stages/stage,null,AVAILABLE,@Spark}
INFO:apache_beam.utils.subprocess_server:23/12/13 03:27:27 INFO org.sparkproject.jetty.server.handler.ContextHandler: Started o.s.j.s.ServletContextHandler@aab8e8{/stages/stage/json,null,AVAILABLE,@Spark}
INFO:apache_beam.utils.subprocess_server:23/12/13 03:27:27 INFO org.sparkproject.jetty.server.handler.ContextHandler: Started o.s.j.s.ServletContextHandler@1320130c{/stages/pool,null,AVAILABLE,@Spark}
INFO:apache_beam.utils.subprocess_server:23/12/13 03:27:27 INFO org.sparkproject.jetty.server.handler.ContextHandler: Started o.s.j.s.ServletContextHandler@292dca71{/stages/pool/json,null,AVAILABLE,@Spark}
INFO:apache_beam.utils.subprocess_server:23/12/13 03:27:27 INFO org.sparkproject.jetty.server.handler.ContextHandler: Started o.s.j.s.ServletContextHandler@501f91b1{/storage,null,AVAILABLE,@Spark}
INFO:apache_beam.utils.subprocess_server:23/12/13 03:27:27 INFO org.sparkproject.jetty.server.handler.ContextHandler: Started o.s.j.s.ServletContextHandler@41626de1{/storage/json,null,AVAILABLE,@Spark}
INFO:apache_beam.utils.subprocess_server:23/12/13 03:27:27 INFO org.sparkproject.jetty.server.handler.ContextHandler: Started o.s.j.s.ServletContextHandler@c9c49db{/storage/rdd,null,AVAILABLE,@Spark}
INFO:apache_beam.utils.subprocess_server:23/12/13 03:27:27 INFO org.sparkproject.jetty.server.handler.ContextHandler: Started o.s.j.s.ServletContextHandler@2cc705e{/storage/rdd/json,null,AVAILABLE,@Spark}
INFO:apache_beam.utils.subprocess_server:23/12/13 03:27:27 INFO org.sparkproject.jetty.server.handler.ContextHandler: Started o.s.j.s.ServletContextHandler@5a57dac9{/environment,null,AVAILABLE,@Spark}
INFO:apache_beam.utils.subprocess_server:23/12/13 03:27:27 INFO org.sparkproject.jetty.server.handler.ContextHandler: Started o.s.j.s.ServletContextHandler@73b55a94{/environment/json,null,AVAILABLE,@Spark}
INFO:apache_beam.utils.subprocess_server:23/12/13 03:27:27 INFO org.sparkproject.jetty.server.handler.ContextHandler: Started o.s.j.s.ServletContextHandler@7f2bb8a1{/executors,null,AVAILABLE,@Spark}
INFO:apache_beam.utils.subprocess_server:23/12/13 03:27:27 INFO org.sparkproject.jetty.server.handler.ContextHandler: Started o.s.j.s.ServletContextHandler@607f4f55{/executors/json,null,AVAILABLE,@Spark}
INFO:apache_beam.utils.subprocess_server:23/12/13 03:27:27 INFO org.sparkproject.jetty.server.handler.ContextHandler: Started o.s.j.s.ServletContextHandler@2cd7a6bb{/executors/threadDump,null,AVAILABLE,@Spark}
INFO:apache_beam.utils.subprocess_server:23/12/13 03:27:27 INFO org.sparkproject.jetty.server.handler.ContextHandler: Started o.s.j.s.ServletContextHandler@3190d02a{/executors/threadDump/json,null,AVAILABLE,@Spark}
INFO:apache_beam.utils.subprocess_server:23/12/13 03:27:27 INFO org.sparkproject.jetty.server.handler.ContextHandler: Started o.s.j.s.ServletContextHandler@71e23797{/static,null,AVAILABLE,@Spark}
INFO:apache_beam.utils.subprocess_server:23/12/13 03:27:27 INFO org.sparkproject.jetty.server.handler.ContextHandler: Started o.s.j.s.ServletContextHandler@6f74c1cb{/,null,AVAILABLE,@Spark}
INFO:apache_beam.utils.subprocess_server:23/12/13 03:27:27 INFO org.sparkproject.jetty.server.handler.ContextHandler: Started o.s.j.s.ServletContextHandler@183fa7d1{/api,null,AVAILABLE,@Spark}
INFO:apache_beam.utils.subprocess_server:23/12/13 03:27:27 INFO org.sparkproject.jetty.server.handler.ContextHandler: Started o.s.j.s.ServletContextHandler@22c70985{/jobs/job/kill,null,AVAILABLE,@Spark}
INFO:apache_beam.utils.subprocess_server:23/12/13 03:27:27 INFO org.sparkproject.jetty.server.handler.ContextHandler: Started o.s.j.s.ServletContextHandler@6b7e6e70{/stages/stage/kill,null,AVAILABLE,@Spark}
INFO:apache_beam.utils.subprocess_server:23/12/13 03:27:28 INFO org.sparkproject.jetty.server.handler.ContextHandler: Started o.s.j.s.ServletContextHandler@6d5daf0e{/metrics/json,null,AVAILABLE,@Spark}
INFO:apache_beam.utils.subprocess_server:23/12/13 03:27:28 INFO org.apache.beam.runners.spark.metrics.MetricsAccumulator: Instantiated metrics accumulator: MetricQueryResults()
INFO:apache_beam.utils.subprocess_server:23/12/13 03:27:28 WARN software.amazon.awssdk.regions.internal.util.EC2MetadataUtils: Unable to retrieve the requested metadata.
INFO:apache_beam.utils.subprocess_server:23/12/13 03:27:28 INFO org.apache.beam.runners.spark.SparkPipelineRunner: Running job BeamApp-jenkins-1213032726-7fd2c55e_ec9f687e-b391-4fd9-95b2-2a80401237b6 on Spark master local[4]
INFO:apache_beam.runners.worker.statecache:Creating state cache with size 104857600
INFO:apache_beam.runners.worker.sdk_worker:Creating insecure control channel for localhost:33673.
INFO:apache_beam.runners.worker.sdk_worker:Control channel established.
INFO:apache_beam.runners.worker.sdk_worker:Initializing SDKHarness with unbounded number of workers.
INFO:apache_beam.utils.subprocess_server:23/12/13 03:27:30 INFO org.apache.beam.runners.fnexecution.control.FnApiControlClientPoolService: Beam Fn Control client connected with id 1-1
INFO:apache_beam.utils.subprocess_server:23/12/13 03:27:30 INFO org.apache.beam.runners.fnexecution.control.FnApiControlClientPoolService: getProcessBundleDescriptor request with id 1-2
INFO:apache_beam.runners.worker.sdk_worker:Creating insecure state channel for localhost:45281.
INFO:apache_beam.runners.worker.sdk_worker:State channel established.
INFO:apache_beam.runners.worker.data_plane:Creating client data channel for localhost:45053
INFO:apache_beam.utils.subprocess_server:23/12/13 03:27:30 INFO org.apache.beam.runners.fnexecution.data.GrpcDataService: Beam Fn Data client connected.
INFO:apache_beam.utils.subprocess_server:23/12/13 03:27:30 INFO org.apache.beam.runners.fnexecution.control.FnApiControlClientPoolService: getProcessBundleDescriptor request with id 1-3
INFO:apache_beam.utils.subprocess_server:23/12/13 03:27:30 INFO org.apache.beam.runners.fnexecution.control.FnApiControlClientPoolService: getProcessBundleDescriptor request with id 1-4
INFO:apache_beam.utils.subprocess_server:23/12/13 03:27:30 INFO org.apache.beam.runners.fnexecution.control.FnApiControlClientPoolService: getProcessBundleDescriptor request with id 1-5
INFO:apache_beam.utils.subprocess_server:23/12/13 03:27:30 INFO org.apache.beam.runners.fnexecution.control.FnApiControlClientPoolService: getProcessBundleDescriptor request with id 1-9
INFO:apache_beam.utils.subprocess_server:23/12/13 03:27:30 INFO org.apache.beam.runners.fnexecution.control.FnApiControlClientPoolService: getProcessBundleDescriptor request with id 1-8
INFO:apache_beam.utils.subprocess_server:23/12/13 03:27:30 INFO org.apache.beam.runners.fnexecution.control.FnApiControlClientPoolService: getProcessBundleDescriptor request with id 1-7
INFO:apache_beam.utils.subprocess_server:23/12/13 03:27:30 INFO org.apache.beam.runners.fnexecution.control.FnApiControlClientPoolService: getProcessBundleDescriptor request with id 1-6
INFO:apache_beam.utils.subprocess_server:23/12/13 03:27:30 INFO org.apache.beam.runners.fnexecution.control.FnApiControlClientPoolService: getProcessBundleDescriptor request with id 1-10
INFO:apache_beam.utils.subprocess_server:23/12/13 03:27:30 INFO org.apache.beam.runners.fnexecution.control.FnApiControlClientPoolService: getProcessBundleDescriptor request with id 1-11
INFO:apache_beam.utils.subprocess_server:23/12/13 03:27:30 INFO org.apache.beam.runners.fnexecution.control.FnApiControlClientPoolService: getProcessBundleDescriptor request with id 1-12
INFO:apache_beam.utils.subprocess_server:23/12/13 03:27:30 INFO org.apache.beam.runners.fnexecution.control.FnApiControlClientPoolService: getProcessBundleDescriptor request with id 1-13
INFO:apache_beam.utils.subprocess_server:23/12/13 03:27:31 INFO org.apache.beam.runners.fnexecution.control.FnApiControlClientPoolService: getProcessBundleDescriptor request with id 1-14
INFO:apache_beam.utils.subprocess_server:23/12/13 03:27:31 INFO org.apache.beam.runners.fnexecution.control.FnApiControlClientPoolService: getProcessBundleDescriptor request with id 1-15
INFO:apache_beam.utils.subprocess_server:23/12/13 03:27:31 INFO org.apache.beam.runners.spark.SparkPipelineRunner: Job BeamApp-jenkins-1213032726-7fd2c55e_ec9f687e-b391-4fd9-95b2-2a80401237b6: Pipeline translated successfully. Computing outputs
INFO:apache_beam.utils.subprocess_server:23/12/13 03:27:31 INFO org.apache.beam.runners.fnexecution.control.FnApiControlClientPoolService: getProcessBundleDescriptor request with id 1-16
INFO:apache_beam.io.filebasedsink:Starting finalize_write threads with num_shards: 4 (skipped: 0), batches: 4, num_threads: 4
INFO:apache_beam.io.filebasedsink:Renamed 4 shards in 0.01 seconds.
INFO:apache_beam.utils.subprocess_server:23/12/13 03:27:31 INFO org.apache.beam.runners.spark.SparkPipelineRunner: Job BeamApp-jenkins-1213032726-7fd2c55e_ec9f687e-b391-4fd9-95b2-2a80401237b6 finished.
INFO:apache_beam.utils.subprocess_server:23/12/13 03:27:31 INFO org.sparkproject.jetty.server.AbstractConnector: Stopped Spark@5a829d2e{HTTP/1.1, (http/1.1)}{127.0.0.1:4040}
INFO:apache_beam.runners.portability.portable_runner:Job state changed to DONE
Exception in thread read_state:
Traceback (most recent call last):
  File "/usr/lib/python3.10/threading.py", line 1009, in _bootstrap_inner
Exception in thread run_worker_1-1:
Traceback (most recent call last):
  File "/usr/lib/python3.10/threading.py", line 1009, in _bootstrap_inner
    self.run()
    self.run()
  File "/usr/lib/python3.10/threading.py", line 946, in run
  File "/usr/lib/python3.10/threading.py", line 946, in run
ERROR:apache_beam.runners.worker.data_plane:Failed to read inputs in the data plane.
Traceback (most recent call last):
  File "<https://ci-beam.apache.org/job/beam_PostCommit_Python310/ws/src/sdks/python/apache_beam/runners/worker/data_plane.py",> line 669, in _read_inputs
    for elements in elements_iterator:
  File "<https://ci-beam.apache.org/job/beam_PostCommit_Python310/ws/src/build/gradleenv/-1720702907/lib/python3.10/site-packages/grpc/_channel.py",> line 540, in __next__
    return self._next()
  File "<https://ci-beam.apache.org/job/beam_PostCommit_Python310/ws/src/build/gradleenv/-1720702907/lib/python3.10/site-packages/grpc/_channel.py",> line 966, in _next
    raise self
grpc._channel._MultiThreadedRendezvous: <_MultiThreadedRendezvous of RPC that terminated with:
	status = StatusCode.UNAVAILABLE
	details = "Socket closed"
	debug_error_string = "UNKNOWN:Error received from peer ipv6:%5B::1%5D:45053 {created_time:"2023-12-13T03:27:31.80794518+00:00", grpc_status:14, grpc_message:"Socket closed"}"
>
    self._target(*self._args, **self._kwargs)
    self._target(*self._args, **self._kwargs)
Exception in thread read_grpc_client_inputs:
  File "<https://ci-beam.apache.org/job/beam_PostCommit_Python310/ws/src/sdks/python/apache_beam/runners/worker/sdk_worker.py",> line 265, in run
Traceback (most recent call last):
  File "<https://ci-beam.apache.org/job/beam_PostCommit_Python310/ws/src/sdks/python/apache_beam/runners/worker/sdk_worker.py",> line 1042, in pull_responses
  File "/usr/lib/python3.10/threading.py", line 1009, in _bootstrap_inner
    for work_request in self._control_stub.Control(get_responses()):
    for response in responses:
  File "<https://ci-beam.apache.org/job/beam_PostCommit_Python310/ws/src/build/gradleenv/-1720702907/lib/python3.10/site-packages/grpc/_channel.py",> line 540, in __next__
  File "<https://ci-beam.apache.org/job/beam_PostCommit_Python310/ws/src/build/gradleenv/-1720702907/lib/python3.10/site-packages/grpc/_channel.py",> line 540, in __next__
    self.run()
  File "/usr/lib/python3.10/threading.py", line 946, in run
    return self._next()
    return self._next()
  File "<https://ci-beam.apache.org/job/beam_PostCommit_Python310/ws/src/build/gradleenv/-1720702907/lib/python3.10/site-packages/grpc/_channel.py",> line 966, in _next
  File "<https://ci-beam.apache.org/job/beam_PostCommit_Python310/ws/src/build/gradleenv/-1720702907/lib/python3.10/site-packages/grpc/_channel.py",> line 966, in _next
    self._target(*self._args, **self._kwargs)
    raise self
  File "<https://ci-beam.apache.org/job/beam_PostCommit_Python310/ws/src/sdks/python/apache_beam/runners/worker/data_plane.py",> line 686, in <lambda>
grpc._channel._MultiThreadedRendezvous: <_MultiThreadedRendezvous of RPC that terminated with:
	status = StatusCode.UNAVAILABLE
	details = "recvmsg:Connection reset by peer"
	debug_error_string = "UNKNOWN:Error received from peer ipv6:%5B::1%5D:33673 {created_time:"2023-12-13T03:27:31.807979112+00:00", grpc_status:14, grpc_message:"recvmsg:Connection reset by peer"}"
>
    raise self
grpc._channel._MultiThreadedRendezvous: <_MultiThreadedRendezvous of RPC that terminated with:
	status = StatusCode.UNAVAILABLE
	details = "Socket closed"
	debug_error_string = "UNKNOWN:Error received from peer ipv6:%5B::1%5D:45281 {created_time:"2023-12-13T03:27:31.80797155+00:00", grpc_status:14, grpc_message:"Socket closed"}"
>
    target=lambda: self._read_inputs(elements_iterator),
  File "<https://ci-beam.apache.org/job/beam_PostCommit_Python310/ws/src/sdks/python/apache_beam/runners/worker/data_plane.py",> line 669, in _read_inputs
    for elements in elements_iterator:
  File "<https://ci-beam.apache.org/job/beam_PostCommit_Python310/ws/src/build/gradleenv/-1720702907/lib/python3.10/site-packages/grpc/_channel.py",> line 540, in __next__
    return self._next()
  File "<https://ci-beam.apache.org/job/beam_PostCommit_Python310/ws/src/build/gradleenv/-1720702907/lib/python3.10/site-packages/grpc/_channel.py",> line 966, in _next
    raise self
grpc._channel._MultiThreadedRendezvous: <_MultiThreadedRendezvous of RPC that terminated with:
	status = StatusCode.UNAVAILABLE
	details = "Socket closed"
	debug_error_string = "UNKNOWN:Error received from peer ipv6:%5B::1%5D:45053 {created_time:"2023-12-13T03:27:31.80794518+00:00", grpc_status:14, grpc_message:"Socket closed"}"
>

> Task :sdks:python:test-suites:dataflow:py310:postCommitIT
<https://ci-beam.apache.org/job/beam_PostCommit_Python310/ws/src/build/gradleenv/2050596098/bin/python3.10>: No module named build
warning: sdist: standard file not found: should have one of README, README.rst, README.txt, README.md

warning: check: missing required meta-data: url

warning: check: missing meta-data: either (author and author_email) or (maintainer and maintainer_email) should be supplied


FAILURE: Build failed with an exception.

* Where:
Script '<https://ci-beam.apache.org/job/beam_PostCommit_Python310/ws/src/sdks/python/test-suites/portable/common.gradle'> line: 326

* What went wrong:
Execution failed for task ':sdks:python:test-suites:portable:py310:postCommitPy310IT'.
> Process 'command 'sh'' finished with non-zero exit value 1

* Try:
> Run with --stacktrace option to get the stack trace.
> Run with --info or --debug option to get more log output.
> Get more help at https://help.gradle.org.

Deprecated Gradle features were used in this build, making it incompatible with Gradle 9.0.

You can use '--warning-mode all' to show the individual deprecation warnings and determine if they come from your own scripts or plugins.

For more on this, please refer to https://docs.gradle.org/8.4/userguide/command_line_interface.html#sec:command_line_warnings in the Gradle documentation.

BUILD FAILED in 1h 44m 30s
217 actionable tasks: 152 executed, 61 from cache, 4 up-to-date

Publishing build scan...
https://ge.apache.org/s/yqjbowc3d3s7u

Build step 'Invoke Gradle script' changed build result to FAILURE
Build step 'Invoke Gradle script' marked build as failure

---------------------------------------------------------------------
To unsubscribe, e-mail: builds-unsubscribe@beam.apache.org
For additional commands, e-mail: builds-help@beam.apache.org