You are viewing a plain text version of this content. The canonical link for it is here.
Posted to builds@hbase.apache.org by Apache Jenkins Server <je...@builds.apache.org> on 2013/08/12 01:19:01 UTC

Build failed in Jenkins: hbase-0.95-on-hadoop2 #235

See <https://builds.apache.org/job/hbase-0.95-on-hadoop2/235/changes>

Changes:

[nkeywal] HBASE-8693  DataType: provide extensible type API (Nick Dimiduck)

[nkeywal] HBASE-8201  OrderedBytes: an ordered encoding strategy  (Nick Dimiduck)

[nkeywal] HBASE-9091  Update ByteRange to maintain consumer's position - 2 (Nick Dimiduck)

[nkeywal] HBASE-9091  Update ByteRange to maintain consumer's position (Nick Dimiduck)

------------------------------------------
[...truncated 2882 lines...]
[INFO] Exclude: **/*.svg
[INFO] Exclude: **/META-INF/services/**
[INFO] Exclude: **/html5shiv.js
[INFO] Exclude: **/jquery.min.js
[INFO] Exclude: **/*.vm
[INFO] Exclude: **/control
[INFO] Exclude: **/conffile
[INFO] Exclude: docs/*
[INFO] Exclude: logs/*
[INFO] Exclude: **/src/main/site/resources/css/freebsd_docbook.css
[INFO] Exclude: .git/**
[INFO] Exclude: .svn/**
[INFO] Exclude: **/.settings/**
[INFO]                                                                         
[INFO] ------------------------------------------------------------------------
[INFO] Building HBase - Common 0.95.2-SNAPSHOT
[INFO] ------------------------------------------------------------------------
[INFO] 
[INFO] --- maven-antrun-plugin:1.6:run (generate) @ hbase-common ---
[INFO] Executing tasks

main:
[INFO] Executed tasks
[INFO] 
[INFO] --- build-helper-maven-plugin:1.5:add-source (versionInfo-source) @ hbase-common ---
[INFO] Source directory: <https://builds.apache.org/job/hbase-0.95-on-hadoop2/ws/0.95-on-hadoop2/hbase-common/target/generated-sources/java> added.
[INFO] 
[INFO] --- maven-remote-resources-plugin:1.4:process (default) @ hbase-common ---
[INFO] 
[INFO] --- maven-resources-plugin:2.6:resources (default-resources) @ hbase-common ---
[INFO] Using 'UTF-8' encoding to copy filtered resources.
[INFO] Copying 1 resource
[INFO] Copying 3 resources
[INFO] 
[INFO] --- maven-antrun-plugin:1.6:run (default) @ hbase-common ---
[INFO] Executing tasks

main:
    [mkdir] Created dir: <https://builds.apache.org/job/hbase-0.95-on-hadoop2/ws/0.95-on-hadoop2/hbase-common/target/nativelib>
     [exec] tar: hadoop-snappy-nativelibs.tar: Cannot open: No such file or directory
     [exec] tar: Error is not recoverable: exiting now
     [exec] Result: 2
[INFO] Executed tasks
[INFO] 
[INFO] --- maven-compiler-plugin:2.5.1:compile (default-compile) @ hbase-common ---
[INFO] Compiling 119 source files to <https://builds.apache.org/job/hbase-0.95-on-hadoop2/ws/0.95-on-hadoop2/hbase-common/target/classes>
[WARNING] <https://builds.apache.org/job/hbase-0.95-on-hadoop2/ws/0.95-on-hadoop2/hbase-common/src/main/java/org/apache/hadoop/hbase/util/Bytes.java>:[51,15] sun.misc.Unsafe is Sun proprietary API and may be removed in a future release
[WARNING] <https://builds.apache.org/job/hbase-0.95-on-hadoop2/ws/0.95-on-hadoop2/hbase-common/src/main/java/org/apache/hadoop/hbase/util/Bytes.java>:[1084,19] sun.misc.Unsafe is Sun proprietary API and may be removed in a future release
[WARNING] <https://builds.apache.org/job/hbase-0.95-on-hadoop2/ws/0.95-on-hadoop2/hbase-common/src/main/java/org/apache/hadoop/hbase/util/Bytes.java>:[1090,21] sun.misc.Unsafe is Sun proprietary API and may be removed in a future release
[WARNING] <https://builds.apache.org/job/hbase-0.95-on-hadoop2/ws/0.95-on-hadoop2/hbase-common/src/main/java/org/apache/hadoop/hbase/util/Bytes.java>:[1095,28] sun.misc.Unsafe is Sun proprietary API and may be removed in a future release
[INFO] 
[INFO] --- maven-dependency-plugin:2.1:build-classpath (create-mrapp-generated-classpath) @ hbase-common ---
[INFO] Wrote classpath file '<https://builds.apache.org/job/hbase-0.95-on-hadoop2/ws/0.95-on-hadoop2/hbase-common/target/test-classes/mrapp-generated-classpath'.>
[INFO] 
[INFO] --- maven-resources-plugin:2.6:testResources (default-testResources) @ hbase-common ---
[INFO] Using 'UTF-8' encoding to copy filtered resources.
[INFO] skip non existing resourceDirectory <https://builds.apache.org/job/hbase-0.95-on-hadoop2/ws/0.95-on-hadoop2/hbase-common/src/test/resources>
[INFO] Copying 3 resources
[INFO] 
[INFO] --- maven-compiler-plugin:2.5.1:testCompile (default-testCompile) @ hbase-common ---
[INFO] Compiling 39 source files to <https://builds.apache.org/job/hbase-0.95-on-hadoop2/ws/0.95-on-hadoop2/hbase-common/target/test-classes>
[INFO] 
[INFO] --- maven-surefire-plugin:2.12-TRUNK-HBASE-2:test (default-test) @ hbase-common ---
[INFO] Surefire report directory: <https://builds.apache.org/job/hbase-0.95-on-hadoop2/ws/0.95-on-hadoop2/hbase-common/target/surefire-reports>
[INFO] Using configured provider org.apache.maven.surefire.junitcore.JUnitCoreProvider

-------------------------------------------------------
 T E S T S
-------------------------------------------------------
Running org.apache.hadoop.hbase.TestHBaseConfiguration
Tests run: 1, Failures: 0, Errors: 0, Skipped: 0, Time elapsed: 0.445 sec
Running org.apache.hadoop.hbase.TestKeyValue
Tests run: 16, Failures: 0, Errors: 0, Skipped: 0, Time elapsed: 0.161 sec
Running org.apache.hadoop.hbase.util.TestCoprocessorClassLoader
Tests run: 3, Failures: 0, Errors: 0, Skipped: 0, Time elapsed: 1.006 sec
Running org.apache.hadoop.hbase.util.TestLoadTestKVGenerator
Tests run: 3, Failures: 0, Errors: 0, Skipped: 0, Time elapsed: 0.635 sec
Running org.apache.hadoop.hbase.util.TestBase64
Tests run: 1, Failures: 0, Errors: 0, Skipped: 0, Time elapsed: 0.017 sec
Running org.apache.hadoop.hbase.util.TestKeyLocker
Tests run: 1, Failures: 0, Errors: 0, Skipped: 0, Time elapsed: 0.01 sec
Running org.apache.hadoop.hbase.util.TestThreads
Tests run: 1, Failures: 0, Errors: 0, Skipped: 0, Time elapsed: 3.012 sec
Running org.apache.hadoop.hbase.util.TestOrder
Tests run: 2, Failures: 0, Errors: 0, Skipped: 0, Time elapsed: 0.017 sec
Running org.apache.hadoop.hbase.util.TestBytes
Tests run: 27, Failures: 0, Errors: 0, Skipped: 0, Time elapsed: 1.442 sec
Running org.apache.hadoop.hbase.util.TestOrderedBytes
Tests run: 17, Failures: 0, Errors: 0, Skipped: 0, Time elapsed: 0.212 sec
Running org.apache.hadoop.hbase.util.TestDynamicClassLoader
Tests run: 2, Failures: 0, Errors: 0, Skipped: 0, Time elapsed: 0.093 sec
Running org.apache.hadoop.hbase.util.TestPositionedByteRange
Tests run: 1, Failures: 0, Errors: 0, Skipped: 0, Time elapsed: 0.008 sec
Running org.apache.hadoop.hbase.util.TestSimpleByteRange
Tests run: 2, Failures: 0, Errors: 0, Skipped: 0, Time elapsed: 0.022 sec
Running org.apache.hadoop.hbase.util.TestEnvironmentEdgeManager
Tests run: 2, Failures: 0, Errors: 0, Skipped: 0, Time elapsed: 0.203 sec
Running org.apache.hadoop.hbase.util.TestDrainBarrier
Tests run: 6, Failures: 0, Errors: 0, Skipped: 0, Time elapsed: 1.052 sec
Running org.apache.hadoop.hbase.types.TestOrderedBlob
Tests run: 1, Failures: 0, Errors: 0, Skipped: 0, Time elapsed: 0.01 sec
Running org.apache.hadoop.hbase.types.TestRawString
Tests run: 1, Failures: 0, Errors: 0, Skipped: 0, Time elapsed: 0.009 sec
Running org.apache.hadoop.hbase.types.TestStruct
Tests run: 2, Failures: 0, Errors: 0, Skipped: 0, Time elapsed: 0.021 sec
Running org.apache.hadoop.hbase.types.TestTerminatedWrapper
Tests run: 6, Failures: 0, Errors: 0, Skipped: 0, Time elapsed: 0.049 sec
Running org.apache.hadoop.hbase.types.TestFixedLengthWrapper
Tests run: 4, Failures: 0, Errors: 0, Skipped: 0, Time elapsed: 0.035 sec
Running org.apache.hadoop.hbase.types.TestOrderedBlobVar
Tests run: 1, Failures: 0, Errors: 0, Skipped: 0, Time elapsed: 0.011 sec
Running org.apache.hadoop.hbase.types.TestOrderedString
Tests run: 1, Failures: 0, Errors: 0, Skipped: 0, Time elapsed: 0.01 sec
Running org.apache.hadoop.hbase.types.TestUnion2
Tests run: 2, Failures: 0, Errors: 0, Skipped: 0, Time elapsed: 0.019 sec
Running org.apache.hadoop.hbase.TestCompoundConfiguration
Tests run: 6, Failures: 0, Errors: 0, Skipped: 0, Time elapsed: 0.139 sec
Running org.apache.hadoop.hbase.codec.TestCellCodec
Tests run: 3, Failures: 0, Errors: 0, Skipped: 0, Time elapsed: 0.033 sec
Running org.apache.hadoop.hbase.codec.TestKeyValueCodec
Tests run: 3, Failures: 0, Errors: 0, Skipped: 0, Time elapsed: 0.03 sec
Running org.apache.hadoop.hbase.TestClassFinder
Tests run: 11, Failures: 0, Errors: 0, Skipped: 0, Time elapsed: 10.449 sec

Results :

Tests run: 126, Failures: 0, Errors: 0, Skipped: 0

[INFO] 
[INFO] --- maven-surefire-plugin:2.12-TRUNK-HBASE-2:test (secondPartTestsExecution) @ hbase-common ---
[INFO] Tests are skipped.
[INFO] 
[INFO] --- maven-source-plugin:2.2.1:jar-no-fork (attach-sources) @ hbase-common ---
[INFO] Building jar: <https://builds.apache.org/job/hbase-0.95-on-hadoop2/ws/0.95-on-hadoop2/hbase-common/target/hbase-common-0.95.2-SNAPSHOT-sources.jar>
[INFO] 
[INFO] --- maven-jar-plugin:2.4:test-jar (default) @ hbase-common ---
[INFO] Building jar: <https://builds.apache.org/job/hbase-0.95-on-hadoop2/ws/0.95-on-hadoop2/hbase-common/target/hbase-common-0.95.2-SNAPSHOT-tests.jar>
[INFO] 
[INFO] --- maven-jar-plugin:2.4:jar (default-jar) @ hbase-common ---
[INFO] Building jar: <https://builds.apache.org/job/hbase-0.95-on-hadoop2/ws/0.95-on-hadoop2/hbase-common/target/hbase-common-0.95.2-SNAPSHOT.jar>
[INFO] 
[INFO] --- apache-rat-plugin:0.8:check (default) @ hbase-common ---
[INFO] Exclude: **/*.versionsBackup
[INFO] Exclude: **/*.log
[INFO] Exclude: **/.*
[INFO] Exclude: **/*.tgz
[INFO] Exclude: **/*.orig
[INFO] Exclude: **/8e8ab58dcf39412da19833fcd8f687ac
[INFO] Exclude: **/a6a6562b777440fd9c34885428f5cb61.21e75333ada3d5bafb34bb918f29576c
[INFO] Exclude: **/.git/**
[INFO] Exclude: **/.idea/**
[INFO] Exclude: **/*.iml
[INFO] Exclude: **/target/**
[INFO] Exclude: **/CHANGES.txt
[INFO] Exclude: **/generated/**
[INFO] Exclude: **/gen-*/**
[INFO] Exclude: **/conf/*
[INFO] Exclude: **/*.avpr
[INFO] Exclude: **/*.svg
[INFO] Exclude: **/META-INF/services/**
[INFO] Exclude: **/html5shiv.js
[INFO] Exclude: **/jquery.min.js
[INFO] Exclude: **/*.vm
[INFO] Exclude: **/control
[INFO] Exclude: **/conffile
[INFO] Exclude: docs/*
[INFO] Exclude: logs/*
[INFO] Exclude: **/src/main/site/resources/css/freebsd_docbook.css
[INFO] Exclude: .git/**
[INFO] Exclude: .svn/**
[INFO] Exclude: **/.settings/**
[INFO]                                                                         
[INFO] ------------------------------------------------------------------------
[INFO] Skipping HBase
[INFO] This project has been banned from the build due to previous failures.
[INFO] ------------------------------------------------------------------------
[INFO] ------------------------------------------------------------------------
[INFO] Reactor Summary:
[INFO] 
[INFO] HBase ............................................. SUCCESS [17.612s]
[INFO] HBase - Common .................................... FAILURE [22.732s]
[INFO] HBase - Protocol .................................. SKIPPED
[INFO] HBase - Client .................................... SKIPPED
[INFO] HBase - Hadoop Compatibility ...................... SKIPPED
[INFO] HBase - Hadoop Two Compatibility .................. SKIPPED
[INFO] HBase - Prefix Tree ............................... SKIPPED
[INFO] HBase - Server .................................... SKIPPED
[INFO] HBase - Integration Tests ......................... SKIPPED
[INFO] HBase - Examples .................................. SKIPPED
[INFO] HBase - Assembly .................................. SKIPPED
[INFO] ------------------------------------------------------------------------
[INFO] BUILD FAILURE
[INFO] ------------------------------------------------------------------------
[INFO] Total time: 45.381s
[INFO] Finished at: Sun Aug 11 23:18:53 UTC 2013
[INFO] Final Memory: 37M/174M
[INFO] ------------------------------------------------------------------------
[ERROR] Failed to execute goal org.apache.rat:apache-rat-plugin:0.8:check (default) on project hbase-common: Too many unapproved licenses: 1 -> [Help 1]
[ERROR] 
[ERROR] To see the full stack trace of the errors, re-run Maven with the -e switch.
[ERROR] Re-run Maven using the -X switch to enable full debug logging.
[ERROR] 
[ERROR] For more information about the errors and possible solutions, please read the following articles:
[ERROR] [Help 1] http://cwiki.apache.org/confluence/display/MAVEN/MojoFailureException
[ERROR] 
[ERROR] After correcting the problems, you can resume the build with the command
[ERROR]   mvn <goals> -rf :hbase-common
Build step 'Invoke top-level Maven targets' marked build as failure
Performing Post build task...
Match found for :.* : True
Logical operation result is TRUE
Running script  :   ZOMBIE_TESTS_COUNT=`jps | grep surefirebooter | wc -l`
  if [[ $ZOMBIE_TESTS_COUNT != 0 ]] ; then
    #It seems sometimes the tests are not dying immediately. Let's give them 10s
    echo "Suspicious java process found - waiting 10s to see if there are just slow to stop"
    sleep 10
    ZOMBIE_TESTS_COUNT=`jps | grep surefirebooter | wc -l`
    if [[ $ZOMBIE_TESTS_COUNT != 0 ]] ; then
      echo "There are $ZOMBIE_TESTS_COUNT zombie tests, they should have been killed by surefire but survived"
      echo "************ BEGIN zombies jstack extract"
      ZB_STACK=`jps | grep surefirebooter | cut -d ' ' -f 1 | xargs -n 1 jstack | grep ".test" | grep "\.java"`
      jps | grep surefirebooter | cut -d ' ' -f 1 | xargs -n 1 jstack
      echo "************ END  zombies jstack extract"
      JIRA_COMMENT="$JIRA_COMMENT

     {color:red}-1 core zombie tests{color}.  There are ${ZOMBIE_TESTS_COUNT} zombie test(s): ${ZB_STACK}"
      BAD=1
      jps | grep surefirebooter | cut -d ' ' -f 1 | xargs kill -9
    else
      echo "We're ok: there is no zombie test, but some tests took some time to stop"
    fi
  else
    echo "We're ok: there is no zombie test"
  fi
[hbase-0.95-on-hadoop2] $ /bin/bash -xe /tmp/hudson1089036633001634509.sh
++ jps
++ grep surefirebooter
++ wc -l
+ ZOMBIE_TESTS_COUNT=0
+ [[ 0 != 0 ]]
+ echo 'We'\''re ok: there is no zombie test'
We're ok: there is no zombie test
POST BUILD TASK : SUCCESS
END OF POST BUILD TASK : 0
Archiving artifacts
Recording test results
Updating HBASE-9091
Updating HBASE-8201
Updating HBASE-8693

Jenkins build is back to normal : hbase-0.95-on-hadoop2 #236

Posted by Apache Jenkins Server <je...@builds.apache.org>.
See <https://builds.apache.org/job/hbase-0.95-on-hadoop2/236/changes>