You are viewing a plain text version of this content. The canonical link for it is here.
Posted to dev@airavata.apache.org by Apache Jenkins Server <je...@builds.apache.org> on 2011/10/23 23:39:53 UTC
Jenkins build is still unstable: Airavata #139
See <https://builds.apache.org/job/Airavata/changes>
Build failed in Jenkins: Airavata #144
Posted by Apache Jenkins Server <je...@builds.apache.org>.
See <https://builds.apache.org/job/Airavata/144/changes>
Changes:
[patanachai] Airavata-170 fix build error
[patanachai]
[lahiru] fixing minor issue with output data saving.
[patanachai] AIRAVATA-138 fix build error
[patanachai] Airavata-170 fix build error
------------------------------------------
[...truncated 2393 lines...]
[INFO] --- maven-resources-plugin:2.4.3:testResources (default-testResources) @ ws-messenger-distribution ---
[INFO] [INFO] No sources to compile
[INFO] --- maven-compiler-plugin:2.0.2:testCompile (default-testCompile) @ ws-messenger-distribution ---
[INFO] [INFO] Tests are skipped.
[INFO] --- maven-surefire-plugin:2.7.2:test (default-test) @ ws-messenger-distribution ---
[INFO] [WARNING] JAR will be empty - no content was marked for inclusion!
[INFO] Building jar: <https://builds.apache.org/job/Airavata/ws/modules/ws-messenger/distribution/target/ws-messenger-distribution-0.0.1-SNAPSHOT.jar>
[INFO] --- maven-jar-plugin:2.3.1:jar (default-jar) @ ws-messenger-distribution ---
[INFO]
[INFO] --- maven-dependency-plugin:2.0-alpha-4:unpack (unpack-axis2) @ ws-messenger-distribution ---
[INFO] Configured Artifact: org.apache.axis2:axis2-webapp:1.5.1:war
[INFO] Expanding: /home/jenkins/.m2/repository/org/apache/axis2/axis2-webapp/1.5.1/axis2-webapp-1.5.1.war into <https://builds.apache.org/job/Airavata/ws/modules/ws-messenger/distribution/target/axis2-1.5.1>
[INFO]
[INFO] --- maven-assembly-plugin:2.2-beta-5:single (distribution-package) @ ws-messenger-distribution ---
[INFO] Reading assembly descriptor: src/main/assembly/bin-assembly.xml
[WARNING] The following patterns were never triggered in this artifact inclusion filter:
o 'mysql:mysql-connector-java'
[INFO] Building zip: <https://builds.apache.org/job/Airavata/ws/modules/ws-messenger/distribution/target/airavata-ws-messenger-0.0.1-SNAPSHOT-bin.zip>
[INFO] Installing <https://builds.apache.org/job/Airavata/ws/modules/ws-messenger/distribution/target/ws-messenger-distribution-0.0.1-SNAPSHOT.jar> to /home/jenkins/.m2/repository/org/apache/airavata/ws-messenger-distribution/0.0.1-SNAPSHOT/ws-messenger-distribution-0.0.1-SNAPSHOT.jar
[INFO] [INFO] Installing <https://builds.apache.org/job/Airavata/ws/modules/ws-messenger/distribution/pom.xml> to /home/jenkins/.m2/repository/org/apache/airavata/ws-messenger-distribution/0.0.1-SNAPSHOT/ws-messenger-distribution-0.0.1-SNAPSHOT.pom
[INFO] Installing <https://builds.apache.org/job/Airavata/ws/modules/ws-messenger/distribution/target/airavata-ws-messenger-0.0.1-SNAPSHOT-bin.zip> to /home/jenkins/.m2/repository/org/apache/airavata/ws-messenger-distribution/0.0.1-SNAPSHOT/ws-messenger-distribution-0.0.1-SNAPSHOT-bin.zip
[INFO] --- maven-install-plugin:2.3.1:install (default-install) @ ws-messenger-distribution ---
[JENKINS] Archiving <https://builds.apache.org/job/Airavata/ws/modules/ws-messenger/distribution/pom.xml> to /home/hudson/hudson/jobs/Airavata/modules/org.apache.airavata$ws-messenger-distribution/builds/2011-10-24_20-00-59/archive/org.apache.airavata/ws-messenger-distribution/0.0.1-SNAPSHOT/ws-messenger-distribution-0.0.1-SNAPSHOT.pom
[JENKINS] Archiving <https://builds.apache.org/job/Airavata/ws/modules/ws-messenger/distribution/target/ws-messenger-distribution-0.0.1-SNAPSHOT.jar> to /home/hudson/hudson/jobs/Airavata/modules/org.apache.airavata$ws-messenger-distribution/builds/2011-10-24_20-00-59/archive/org.apache.airavata/ws-messenger-distribution/0.0.1-SNAPSHOT/ws-messenger-distribution-0.0.1-SNAPSHOT.jar
[JENKINS] Archiving <https://builds.apache.org/job/Airavata/ws/modules/ws-messenger/distribution/target/airavata-ws-messenger-0.0.1-SNAPSHOT-bin.zip> to /home/hudson/hudson/jobs/Airavata/modules/org.apache.airavata$ws-messenger-distribution/builds/2011-10-24_20-00-59/archive/org.apache.airavata/ws-messenger-distribution/0.0.1-SNAPSHOT/ws-messenger-distribution-0.0.1-SNAPSHOT-bin.zip
[INFO]
[INFO] ------------------------------------------------------------------------
[INFO] Building Airavata XBaya 0.0.1-SNAPSHOT
[INFO] ------------------------------------------------------------------------
[WARNING] The POM for lead-security:cryptix32:jar:versionless is invalid, transitive dependencies (if any) will not be available, enable debug logging for more details
[WARNING] The POM for lead-security:jce:jar:jdk13-131 is invalid, transitive dependencies (if any) will not be available, enable debug logging for more details
[WARNING] The POM for lead-security:cryptix-asn1:jar:versionless is invalid, transitive dependencies (if any) will not be available, enable debug logging for more details
[WARNING] The POM for lead-security:puretls:jar:0.9b4-1 is invalid, transitive dependencies (if any) will not be available, enable debug logging for more details
[WARNING] The POM for lead-security:cog-jglobus:jar:1.4 is invalid, transitive dependencies (if any) will not be available, enable debug logging for more details
[INFO]
[INFO] --- maven-clean-plugin:2.4.1:clean (default-clean) @ xbaya-gui ---
[INFO] [INFO] Using 'UTF-8' encoding to copy filtered resources.
[INFO] Copying 24 resources
[INFO] --- maven-resources-plugin:2.4.3:resources (default-resources) @ xbaya-gui ---
[INFO]
[INFO] --- maven-dependency-plugin:2.1:copy-dependencies (copy-dependencies) @ xbaya-gui ---
[INFO] Copying MapReduce.Service.Client-1.0.jar to <https://builds.apache.org/job/Airavata/ws/modules/xbaya-gui/target/lib/MapReduce.Service.Client-1.0.jar>
[INFO] Copying asm-3.1.jar to <https://builds.apache.org/job/Airavata/ws/modules/xbaya-gui/target/lib/asm-3.1.jar>
[INFO] Copying atomixmiser-0.9.4.jar to <https://builds.apache.org/job/Airavata/ws/modules/xbaya-gui/target/lib/atomixmiser-0.9.4.jar>
[INFO] Copying aws-java-sdk-1.1.8.jar to <https://builds.apache.org/job/Airavata/ws/modules/xbaya-gui/target/lib/aws-java-sdk-1.1.8.jar>
[INFO] Copying metadata-extractor-2.4.0-beta-1.jar to <https://builds.apache.org/job/Airavata/ws/modules/xbaya-gui/target/lib/metadata-extractor-2.4.0-beta-1.jar>
[INFO] Copying commons-beanutils-1.7.0.jar to <https://builds.apache.org/job/Airavata/ws/modules/xbaya-gui/target/lib/commons-beanutils-1.7.0.jar>
[INFO] Copying commons-beanutils-core-1.8.0.jar to <https://builds.apache.org/job/Airavata/ws/modules/xbaya-gui/target/lib/commons-beanutils-core-1.8.0.jar>
[INFO] Copying commons-codec-1.3.jar to <https://builds.apache.org/job/Airavata/ws/modules/xbaya-gui/target/lib/commons-codec-1.3.jar>
[INFO] Copying commons-collections-3.2.1.jar to <https://builds.apache.org/job/Airavata/ws/modules/xbaya-gui/target/lib/commons-collections-3.2.1.jar>
[INFO] Copying commons-configuration-1.6.jar to <https://builds.apache.org/job/Airavata/ws/modules/xbaya-gui/target/lib/commons-configuration-1.6.jar>
[INFO] Copying commons-dbcp-1.2.2.jar to <https://builds.apache.org/job/Airavata/ws/modules/xbaya-gui/target/lib/commons-dbcp-1.2.2.jar>
[INFO] Copying commons-digester-1.8.jar to <https://builds.apache.org/job/Airavata/ws/modules/xbaya-gui/target/lib/commons-digester-1.8.jar>
[INFO] Copying commons-fileupload-1.2.jar to <https://builds.apache.org/job/Airavata/ws/modules/xbaya-gui/target/lib/commons-fileupload-1.2.jar>
[INFO] Copying commons-httpclient-3.1.jar to <https://builds.apache.org/job/Airavata/ws/modules/xbaya-gui/target/lib/commons-httpclient-3.1.jar>
[INFO] Copying commons-io-1.4.jar to <https://builds.apache.org/job/Airavata/ws/modules/xbaya-gui/target/lib/commons-io-1.4.jar>
[INFO] Copying commons-lang-2.4.jar to <https://builds.apache.org/job/Airavata/ws/modules/xbaya-gui/target/lib/commons-lang-2.4.jar>
[INFO] Copying commons-logging-1.0.4.jar to <https://builds.apache.org/job/Airavata/ws/modules/xbaya-gui/target/lib/commons-logging-1.0.4.jar>
[INFO] Copying commons-pool-1.3.jar to <https://builds.apache.org/job/Airavata/ws/modules/xbaya-gui/target/lib/commons-pool-1.3.jar>
[INFO] Copying concurrent-1.3.4.jar to <https://builds.apache.org/job/Airavata/ws/modules/xbaya-gui/target/lib/concurrent-1.3.4.jar>
[INFO] Copying boilerpipe-1.1.0.jar to <https://builds.apache.org/job/Airavata/ws/modules/xbaya-gui/target/lib/boilerpipe-1.1.0.jar>
[INFO] Copying dom4j-1.6.1.jar to <https://builds.apache.org/job/Airavata/ws/modules/xbaya-gui/target/lib/dom4j-1.6.1.jar>
[INFO] Copying yfilter-1.0.jar to <https://builds.apache.org/job/Airavata/ws/modules/xbaya-gui/target/lib/yfilter-1.0.jar>
[INFO] Copying netcdf-4.2-min.jar to <https://builds.apache.org/job/Airavata/ws/modules/xbaya-gui/target/lib/netcdf-4.2-min.jar>
[INFO] Copying gfac-schema-utils-0.4.3.jar to <https://builds.apache.org/job/Airavata/ws/modules/xbaya-gui/target/lib/gfac-schema-utils-0.4.3.jar>
[INFO] Copying transfer-api-client-0.10.jar to <https://builds.apache.org/job/Airavata/ws/modules/xbaya-gui/target/lib/transfer-api-client-0.10.jar>
[INFO] Copying gpel_client-1.0.7-BETA.jar to <https://builds.apache.org/job/Airavata/ws/modules/xbaya-gui/target/lib/gpel_client-1.0.7-BETA.jar>
[INFO] Copying activation-1.1.jar to <https://builds.apache.org/job/Airavata/ws/modules/xbaya-gui/target/lib/activation-1.1.jar>
[INFO] Copying jcr-2.0.jar to <https://builds.apache.org/job/Airavata/ws/modules/xbaya-gui/target/lib/jcr-2.0.jar>
[INFO] Copying mail-1.4.jar to <https://builds.apache.org/job/Airavata/ws/modules/xbaya-gui/target/lib/mail-1.4.jar>
[INFO] Copying servlet-api-2.3.jar to <https://builds.apache.org/job/Airavata/ws/modules/xbaya-gui/target/lib/servlet-api-2.3.jar>
[INFO] Copying jaxen-1.1.1.jar to <https://builds.apache.org/job/Airavata/ws/modules/xbaya-gui/target/lib/jaxen-1.1.1.jar>
[INFO] Copying jdom-1.0.jar to <https://builds.apache.org/job/Airavata/ws/modules/xbaya-gui/target/lib/jdom-1.0.jar>
[INFO] Copying junit-4.7.jar to <https://builds.apache.org/job/Airavata/ws/modules/xbaya-gui/target/lib/junit-4.7.jar>
[INFO] Copying jython-2.5.1.jar to <https://builds.apache.org/job/Airavata/ws/modules/xbaya-gui/target/lib/jython-2.5.1.jar>
[INFO] Copying cog-jglobus-1.4.jar to <https://builds.apache.org/job/Airavata/ws/modules/xbaya-gui/target/lib/cog-jglobus-1.4.jar>
[INFO] Copying cryptix-asn1-versionless.jar to <https://builds.apache.org/job/Airavata/ws/modules/xbaya-gui/target/lib/cryptix-asn1-versionless.jar>
[INFO] Copying cryptix32-versionless.jar to <https://builds.apache.org/job/Airavata/ws/modules/xbaya-gui/target/lib/cryptix32-versionless.jar>
[INFO] Copying jce-jdk13-131.jar to <https://builds.apache.org/job/Airavata/ws/modules/xbaya-gui/target/lib/jce-jdk13-131.jar>
[INFO] Copying puretls-0.9b4-1.jar to <https://builds.apache.org/job/Airavata/ws/modules/xbaya-gui/target/lib/puretls-0.9b4-1.jar>
[INFO] Copying log4j-1.2.16.jar to <https://builds.apache.org/job/Airavata/ws/modules/xbaya-gui/target/lib/log4j-1.2.16.jar>
[INFO] Copying jets3t-0.8.0.jar to <https://builds.apache.org/job/Airavata/ws/modules/xbaya-gui/target/lib/jets3t-0.8.0.jar>
[INFO] Copying common-utils-0.0.1-SNAPSHOT.jar to <https://builds.apache.org/job/Airavata/ws/modules/xbaya-gui/target/lib/common-utils-0.0.1-SNAPSHOT.jar>
[INFO] Copying gfac-schema-utils-0.0.1-SNAPSHOT.jar to <https://builds.apache.org/job/Airavata/ws/modules/xbaya-gui/target/lib/gfac-schema-utils-0.0.1-SNAPSHOT.jar>
[INFO] Copying messagebroker-0.0.1-SNAPSHOT.aar to <https://builds.apache.org/job/Airavata/ws/modules/xbaya-gui/target/lib/messagebroker-0.0.1-SNAPSHOT.aar>
[INFO] Copying messenger-client-0.0.1-SNAPSHOT.jar to <https://builds.apache.org/job/Airavata/ws/modules/xbaya-gui/target/lib/messenger-client-0.0.1-SNAPSHOT.jar>
[INFO] Copying messenger-commons-0.0.1-SNAPSHOT.jar to <https://builds.apache.org/job/Airavata/ws/modules/xbaya-gui/target/lib/messenger-commons-0.0.1-SNAPSHOT.jar>
[INFO] Copying registry-api-0.0.1-SNAPSHOT.jar to <https://builds.apache.org/job/Airavata/ws/modules/xbaya-gui/target/lib/registry-api-0.0.1-SNAPSHOT.jar>
[INFO] Copying workflow-execution-context-0.0.1-SNAPSHOT.jar to <https://builds.apache.org/job/Airavata/ws/modules/xbaya-gui/target/lib/workflow-execution-context-0.0.1-SNAPSHOT.jar>
[INFO] Copying workflowtracking-0.0.1-SNAPSHOT.jar to <https://builds.apache.org/job/Airavata/ws/modules/xbaya-gui/target/lib/workflowtracking-0.0.1-SNAPSHOT.jar>
[INFO] Copying ant-1.7.0.jar to <https://builds.apache.org/job/Airavata/ws/modules/xbaya-gui/target/lib/ant-1.7.0.jar>
[INFO] Copying ant-launcher-1.7.0.jar to <https://builds.apache.org/job/Airavata/ws/modules/xbaya-gui/target/lib/ant-launcher-1.7.0.jar>
[INFO] Copying axis2-1.5.1.jar to <https://builds.apache.org/job/Airavata/ws/modules/xbaya-gui/target/lib/axis2-1.5.1.jar>
[INFO] Copying axis2-adb-1.5.1.jar to <https://builds.apache.org/job/Airavata/ws/modules/xbaya-gui/target/lib/axis2-adb-1.5.1.jar>
[INFO] Copying axis2-kernel-1.5.1.jar to <https://builds.apache.org/job/Airavata/ws/modules/xbaya-gui/target/lib/axis2-kernel-1.5.1.jar>
[INFO] Copying axis2-transport-http-1.5.1.jar to <https://builds.apache.org/job/Airavata/ws/modules/xbaya-gui/target/lib/axis2-transport-http-1.5.1.jar>
[INFO] Copying axis2-transport-local-1.5.1.jar to <https://builds.apache.org/job/Airavata/ws/modules/xbaya-gui/target/lib/axis2-transport-local-1.5.1.jar>
[INFO] Copying commons-compress-1.1.jar to <https://builds.apache.org/job/Airavata/ws/modules/xbaya-gui/target/lib/commons-compress-1.1.jar>
[INFO] Copying derby-10.5.3.0_1.jar to <https://builds.apache.org/job/Airavata/ws/modules/xbaya-gui/target/lib/derby-10.5.3.0_1.jar>
[INFO] Copying geronimo-activation_1.1_spec-1.0.1.jar to <https://builds.apache.org/job/Airavata/ws/modules/xbaya-gui/target/lib/geronimo-activation_1.1_spec-1.0.1.jar>
[INFO] Copying geronimo-javamail_1.4_spec-1.2.jar to <https://builds.apache.org/job/Airavata/ws/modules/xbaya-gui/target/lib/geronimo-javamail_1.4_spec-1.2.jar>
[INFO] Copying geronimo-jta_1.1_spec-1.1.jar to <https://builds.apache.org/job/Airavata/ws/modules/xbaya-gui/target/lib/geronimo-jta_1.1_spec-1.1.jar>
[INFO] Copying geronimo-stax-api_1.0_spec-1.0.1.jar to <https://builds.apache.org/job/Airavata/ws/modules/xbaya-gui/target/lib/geronimo-stax-api_1.0_spec-1.0.1.jar>
[INFO] Copying geronimo-ws-metadata_2.0_spec-1.1.2.jar to <https://builds.apache.org/job/Airavata/ws/modules/xbaya-gui/target/lib/geronimo-ws-metadata_2.0_spec-1.1.2.jar>
[INFO] Copying httpcore-4.0.jar to <https://builds.apache.org/job/Airavata/ws/modules/xbaya-gui/target/lib/httpcore-4.0.jar>
[INFO] Copying jackrabbit-api-2.2.7.jar to <https://builds.apache.org/job/Airavata/ws/modules/xbaya-gui/target/lib/jackrabbit-api-2.2.7.jar>
[INFO] Copying jackrabbit-core-2.2.7.jar to <https://builds.apache.org/job/Airavata/ws/modules/xbaya-gui/target/lib/jackrabbit-core-2.2.7.jar>
[INFO] Copying jackrabbit-jcr-commons-2.2.7.jar to <https://builds.apache.org/job/Airavata/ws/modules/xbaya-gui/target/lib/jackrabbit-jcr-commons-2.2.7.jar>
[INFO] Copying jackrabbit-jcr-rmi-2.2.7.jar to <https://builds.apache.org/job/Airavata/ws/modules/xbaya-gui/target/lib/jackrabbit-jcr-rmi-2.2.7.jar>
[INFO] Copying jackrabbit-spi-2.2.7.jar to <https://builds.apache.org/job/Airavata/ws/modules/xbaya-gui/target/lib/jackrabbit-spi-2.2.7.jar>
[INFO] Copying jackrabbit-spi-commons-2.2.7.jar to <https://builds.apache.org/job/Airavata/ws/modules/xbaya-gui/target/lib/jackrabbit-spi-commons-2.2.7.jar>
[INFO] Copying lucene-core-2.4.1.jar to <https://builds.apache.org/job/Airavata/ws/modules/xbaya-gui/target/lib/lucene-core-2.4.1.jar>
[INFO] Copying neethi-2.0.4.jar to <https://builds.apache.org/job/Airavata/ws/modules/xbaya-gui/target/lib/neethi-2.0.4.jar>
[INFO] Copying fontbox-1.3.1.jar to <https://builds.apache.org/job/Airavata/ws/modules/xbaya-gui/target/lib/fontbox-1.3.1.jar>
[INFO] Copying jempbox-1.3.1.jar to <https://builds.apache.org/job/Airavata/ws/modules/xbaya-gui/target/lib/jempbox-1.3.1.jar>
[INFO] Copying pdfbox-1.3.1.jar to <https://builds.apache.org/job/Airavata/ws/modules/xbaya-gui/target/lib/pdfbox-1.3.1.jar>
[INFO] Copying poi-3.7.jar to <https://builds.apache.org/job/Airavata/ws/modules/xbaya-gui/target/lib/poi-3.7.jar>
[INFO] Copying poi-ooxml-3.7.jar to <https://builds.apache.org/job/Airavata/ws/modules/xbaya-gui/target/lib/poi-ooxml-3.7.jar>
[INFO] Copying poi-ooxml-schemas-3.7.jar to <https://builds.apache.org/job/Airavata/ws/modules/xbaya-gui/target/lib/poi-ooxml-schemas-3.7.jar>
[INFO] Copying poi-scratchpad-3.7.jar to <https://builds.apache.org/job/Airavata/ws/modules/xbaya-gui/target/lib/poi-scratchpad-3.7.jar>
[INFO] Copying tika-core-0.8.jar to <https://builds.apache.org/job/Airavata/ws/modules/xbaya-gui/target/lib/tika-core-0.8.jar>
[INFO] Copying tika-parsers-0.8.jar to <https://builds.apache.org/job/Airavata/ws/modules/xbaya-gui/target/lib/tika-parsers-0.8.jar>
[INFO] Copying woden-api-1.0M8.jar to <https://builds.apache.org/job/Airavata/ws/modules/xbaya-gui/target/lib/woden-api-1.0M8.jar>
[INFO] Copying woden-impl-dom-1.0M8.jar to <https://builds.apache.org/job/Airavata/ws/modules/xbaya-gui/target/lib/woden-impl-dom-1.0M8.jar>
[INFO] Copying axiom-api-1.2.8.jar to <https://builds.apache.org/job/Airavata/ws/modules/xbaya-gui/target/lib/axiom-api-1.2.8.jar>
[INFO] Copying axiom-dom-1.2.8.jar to <https://builds.apache.org/job/Airavata/ws/modules/xbaya-gui/target/lib/axiom-dom-1.2.8.jar>
[INFO] Copying axiom-impl-1.2.8.jar to <https://builds.apache.org/job/Airavata/ws/modules/xbaya-gui/target/lib/axiom-impl-1.2.8.jar>
[INFO] Copying XmlSchema-1.4.2.jar to <https://builds.apache.org/job/Airavata/ws/modules/xbaya-gui/target/lib/XmlSchema-1.4.2.jar>
[INFO] Copying xmlbeans-2.4.0.jar to <https://builds.apache.org/job/Airavata/ws/modules/xbaya-gui/target/lib/xmlbeans-2.4.0.jar>
[INFO] Copying bcmail-jdk15-1.45.jar to <https://builds.apache.org/job/Airavata/ws/modules/xbaya-gui/target/lib/bcmail-jdk15-1.45.jar>
[INFO] Copying bcprov-jdk15-1.45.jar to <https://builds.apache.org/job/Airavata/ws/modules/xbaya-gui/target/lib/bcprov-jdk15-1.45.jar>
[INFO] Copying tagsoup-1.2.jar to <https://builds.apache.org/job/Airavata/ws/modules/xbaya-gui/target/lib/tagsoup-1.2.jar>
[INFO] Copying wstx-asl-3.2.4.jar to <https://builds.apache.org/job/Airavata/ws/modules/xbaya-gui/target/lib/wstx-asl-3.2.4.jar>
[INFO] Copying jcl-over-slf4j-1.6.1.jar to <https://builds.apache.org/job/Airavata/ws/modules/xbaya-gui/target/lib/jcl-over-slf4j-1.6.1.jar>
[INFO] Copying slf4j-api-1.6.1.jar to <https://builds.apache.org/job/Airavata/ws/modules/xbaya-gui/target/lib/slf4j-api-1.6.1.jar>
[INFO] Copying slf4j-log4j12-1.6.1.jar to <https://builds.apache.org/job/Airavata/ws/modules/xbaya-gui/target/lib/slf4j-log4j12-1.6.1.jar>
[INFO] Copying slf4j-simple-1.6.1.jar to <https://builds.apache.org/job/Airavata/ws/modules/xbaya-gui/target/lib/slf4j-simple-1.6.1.jar>
[INFO] Copying rome-0.9.jar to <https://builds.apache.org/job/Airavata/ws/modules/xbaya-gui/target/lib/rome-0.9.jar>
[INFO] Copying stax-api-1.0.1.jar to <https://builds.apache.org/job/Airavata/ws/modules/xbaya-gui/target/lib/stax-api-1.0.1.jar>
[INFO] Copying layout-1.0.4.jar to <https://builds.apache.org/job/Airavata/ws/modules/xbaya-gui/target/lib/layout-1.0.4.jar>
[INFO] Copying wsdl4j-1.6.2.jar to <https://builds.apache.org/job/Airavata/ws/modules/xbaya-gui/target/lib/wsdl4j-1.6.2.jar>
[INFO] Copying wsmg-1.76.7.jar to <https://builds.apache.org/job/Airavata/ws/modules/xbaya-gui/target/lib/wsmg-1.76.7.jar>
[INFO] Copying xalan-2.7.0.jar to <https://builds.apache.org/job/Airavata/ws/modules/xbaya-gui/target/lib/xalan-2.7.0.jar>
[INFO] Copying pegasuswebservice-1.0.jar to <https://builds.apache.org/job/Airavata/ws/modules/xbaya-gui/target/lib/pegasuswebservice-1.0.jar>
[INFO] Copying xercesImpl-2.9.1.jar to <https://builds.apache.org/job/Airavata/ws/modules/xbaya-gui/target/lib/xercesImpl-2.9.1.jar>
[INFO] Copying xmlParserAPIs-2.6.0.jar to <https://builds.apache.org/job/Airavata/ws/modules/xbaya-gui/target/lib/xmlParserAPIs-2.6.0.jar>
[INFO] Copying xml-apis-1.3.04.jar to <https://builds.apache.org/job/Airavata/ws/modules/xbaya-gui/target/lib/xml-apis-1.3.04.jar>
[INFO] Copying xbean-2.5.0.jar to <https://builds.apache.org/job/Airavata/ws/modules/xbaya-gui/target/lib/xbean-2.5.0.jar>
[INFO] Copying xpp3-1.1.4c.jar to <https://builds.apache.org/job/Airavata/ws/modules/xbaya-gui/target/lib/xpp3-1.1.4c.jar>
[INFO] Copying xpp3_xpath-1.1.4c.jar to <https://builds.apache.org/job/Airavata/ws/modules/xbaya-gui/target/lib/xpp3_xpath-1.1.4c.jar>
[INFO] Copying xpp5-1.2.6.jar to <https://builds.apache.org/job/Airavata/ws/modules/xbaya-gui/target/lib/xpp5-1.2.6.jar>
[INFO] Copying xpp5_xpath-1.2.6.jar to <https://builds.apache.org/job/Airavata/ws/modules/xbaya-gui/target/lib/xpp5_xpath-1.2.6.jar>
[INFO] Copying xsul-2.10.5_d.jar to <https://builds.apache.org/job/Airavata/ws/modules/xbaya-gui/target/lib/xsul-2.10.5_d.jar>
[INFO] Copying xsul5-2007-02-27-1.jar to <https://builds.apache.org/job/Airavata/ws/modules/xbaya-gui/target/lib/xsul5-2007-02-27-1.jar>
[INFO] Copying xutil-0.2.jar to <https://builds.apache.org/job/Airavata/ws/modules/xbaya-gui/target/lib/xutil-0.2.jar>
[INFO]
[INFO] --- maven-compiler-plugin:2.3.2:compile (default-compile) @ xbaya-gui ---
[INFO] Compiling 472 source files to <https://builds.apache.org/job/Airavata/ws/modules/xbaya-gui/target/classes>
[INFO] -------------------------------------------------------------
[ERROR] COMPILATION ERROR :
[INFO] -------------------------------------------------------------
[ERROR] <https://builds.apache.org/job/Airavata/ws/modules/xbaya-gui/src/main/java/org/apache/airavata/xbaya/component/registry/JCRComponentRegistry.java>:[87,10] exception javax.jcr.PathNotFoundException is never thrown in body of corresponding try statement
[ERROR] <https://builds.apache.org/job/Airavata/ws/modules/xbaya-gui/src/main/java/org/apache/airavata/xbaya/component/registry/JCRComponentRegistry.java>:[81,86] unreported exception org.apache.airavata.registry.api.exception.RegistryException; must be caught or declared to be thrown
[ERROR] <https://builds.apache.org/job/Airavata/ws/modules/xbaya-gui/src/main/java/org/apache/airavata/xbaya/component/registry/JCRComponentRegistry.java>:[128,45] unreported exception org.apache.airavata.registry.api.exception.RegistryException; must be caught or declared to be thrown
[ERROR] <https://builds.apache.org/job/Airavata/ws/modules/xbaya-gui/src/main/java/org/apache/airavata/xbaya/component/registry/JCRComponentRegistry.java>:[133,42] unreported exception org.apache.airavata.registry.api.exception.RegistryException; must be caught or declared to be thrown
[ERROR] <https://builds.apache.org/job/Airavata/ws/modules/xbaya-gui/src/main/java/org/apache/airavata/xbaya/component/registry/JCRComponentRegistry.java>:[138,51] unreported exception org.apache.airavata.registry.api.exception.RegistryException; must be caught or declared to be thrown
[ERROR] <https://builds.apache.org/job/Airavata/ws/modules/xbaya-gui/src/main/java/org/apache/airavata/xbaya/component/registry/JCRComponentRegistry.java>:[143,48] unreported exception org.apache.airavata.registry.api.exception.RegistryException; must be caught or declared to be thrown
[ERROR] <https://builds.apache.org/job/Airavata/ws/modules/xbaya-gui/src/main/java/org/apache/airavata/xbaya/component/registry/JCRComponentRegistry.java>:[157,48] unreported exception org.apache.airavata.registry.api.exception.RegistryException; must be caught or declared to be thrown
[INFO] 7 errors
[INFO] -------------------------------------------------------------
[JENKINS] Archiving <https://builds.apache.org/job/Airavata/ws/modules/xbaya-gui/pom.xml> to /home/hudson/hudson/jobs/Airavata/modules/org.apache.airavata$xbaya-gui/builds/2011-10-24_20-00-59/archive/org.apache.airavata/xbaya-gui/0.0.1-SNAPSHOT/xbaya-gui-0.0.1-SNAPSHOT.pom
[INFO] ------------------------------------------------------------------------
[INFO] Reactor Summary:
[INFO]
[INFO] Airavata .......................................... SUCCESS [9.144s]
[INFO] Airavata Commons .................................. SUCCESS [0.318s]
[INFO] Airavata GFac Schema Utilities .................... SUCCESS [8.252s]
[INFO] Airavata Registry API ............................. SUCCESS [2.797s]
[INFO] Airavata-WS-Messenger ............................. SUCCESS [0.291s]
[INFO] Messenger Commons ................................. SUCCESS [3.015s]
[INFO] Messenger Client .................................. SUCCESS [3.053s]
[INFO] Airavata Workflow Tracking ........................ SUCCESS [6.249s]
[INFO] GFac-Core ......................................... SUCCESS [46.980s]
[INFO] Message Broker .................................... SUCCESS [8.081s]
[INFO] Airavata Common Utilities ......................... SUCCESS [2.231s]
[INFO] Airavata Workflow Execution Context ............... SUCCESS [3.996s]
[INFO] GFac-Axis2-Interface .............................. SUCCESS [9.096s]
[INFO] MessageBox ........................................ SUCCESS [3.068s]
[INFO] distribution ...................................... SUCCESS [9.224s]
[INFO] Airavata XBaya .................................... FAILURE [6.931s]
[INFO] Simple Math Service ............................... SKIPPED
[INFO] distribution ...................................... SKIPPED
[INFO] ------------------------------------------------------------------------
[INFO] BUILD FAILURE
[INFO] ------------------------------------------------------------------------
[INFO] Total time: 11:27.879s
[INFO] Finished at: Mon Oct 24 20:12:37 UTC 2011
[INFO] Final Memory: 116M/311M
[INFO] ------------------------------------------------------------------------
mavenExecutionResult exceptions not empty
message : Failed to execute goal org.apache.maven.plugins:maven-compiler-plugin:2.3.2:compile (default-compile) on project xbaya-gui: Compilation failure
cause : Compilation failure
Stack trace :
org.apache.maven.lifecycle.LifecycleExecutionException: Failed to execute goal org.apache.maven.plugins:maven-compiler-plugin:2.3.2:compile (default-compile) on project xbaya-gui: Compilation failure
at org.apache.maven.lifecycle.internal.MojoExecutor.execute(MojoExecutor.java:213)
at org.apache.maven.lifecycle.internal.MojoExecutor.execute(MojoExecutor.java:153)
at org.apache.maven.lifecycle.internal.MojoExecutor.execute(MojoExecutor.java:145)
at org.apache.maven.lifecycle.internal.LifecycleModuleBuilder.buildProject(LifecycleModuleBuilder.java:84)
at org.apache.maven.lifecycle.internal.LifecycleModuleBuilder.buildProject(LifecycleModuleBuilder.java:59)
at org.apache.maven.lifecycle.internal.LifecycleStarter.singleThreadedBuild(LifecycleStarter.java:183)
at org.apache.maven.lifecycle.internal.LifecycleStarter.execute(LifecycleStarter.java:161)
at org.apache.maven.DefaultMaven.doExecute(DefaultMaven.java:319)
at org.apache.maven.DefaultMaven.execute(DefaultMaven.java:156)
at org.jvnet.hudson.maven3.launcher.Maven3Launcher.main(Maven3Launcher.java:79)
at sun.reflect.NativeMethodAccessorImpl.invoke0(Native Method)
at sun.reflect.NativeMethodAccessorImpl.invoke(NativeMethodAccessorImpl.java:39)
at sun.reflect.DelegatingMethodAccessorImpl.invoke(DelegatingMethodAccessorImpl.java:25)
at java.lang.reflect.Method.invoke(Method.java:597)
at org.codehaus.plexus.classworlds.launcher.Launcher.launchStandard(Launcher.java:329)
at org.codehaus.plexus.classworlds.launcher.Launcher.launch(Launcher.java:239)
at org.jvnet.hudson.maven3.agent.Maven3Main.launch(Maven3Main.java:158)
at hudson.maven.Maven3Builder.call(Maven3Builder.java:122)
at hudson.maven.Maven3Builder.call(Maven3Builder.java:74)
at hudson.remoting.UserRequest.perform(UserRequest.java:118)
at hudson.remoting.UserRequest.perform(UserRequest.java:48)
at hudson.remoting.Request$2.run(Request.java:287)
at java.util.concurrent.Executors$RunnableAdapter.call(Executors.java:441)
at java.util.concurrent.FutureTask$Sync.innerRun(FutureTask.java:303)
at java.util.concurrent.FutureTask.run(FutureTask.java:138)
at java.util.concurrent.ThreadPoolExecutor$Worker.runTask(ThreadPoolExecutor.java:886)
at java.util.concurrent.ThreadPoolExecutor$Worker.run(ThreadPoolExecutor.java:908)
at java.lang.Thread.run(Thread.java:662)
Caused by: org.apache.maven.plugin.CompilationFailureException: Compilation failure
at org.apache.maven.plugin.AbstractCompilerMojo.execute(AbstractCompilerMojo.java:656)
at org.apache.maven.plugin.CompilerMojo.execute(CompilerMojo.java:128)
at org.apache.maven.plugin.DefaultBuildPluginManager.executeMojo(DefaultBuildPluginManager.java:101)
at org.apache.maven.lifecycle.internal.MojoExecutor.execute(MojoExecutor.java:209)
... 27 more
Maven failed with error.
Sending e-mails to: airavata-dev@incubator.apache.org
Sending e-mails to: airavata-dev@incubator.apache.org patanachai.t@gmail.com
Sending e-mails to: airavata-dev@incubator.apache.org
channel stopped
Build failed in Jenkins: Airavata #143
Posted by Apache Jenkins Server <je...@builds.apache.org>.
See <https://builds.apache.org/job/Airavata/143/changes>
Changes:
[lahiru] fixing build error https://issues.apache.org/jira/browse/AIRAVATA-164.
[patanachai] AIRAVATA-138 pom.xml with JUnit test dependency
[patanachai] AIRAVATA-138 simple test case
[patanachai] AIRAVATA-170 change XMLBeans generated objects
[lahiru] Applying the patch for the issue AIRAVATA-169
Thanks Heshan for the contribution
------------------------------------------
[...truncated 1496 lines...]
A modules/commons/gfac-schema/src/main/resources/datatype.properties
A modules/commons/gfac-schema/pom.xml
A modules/workflow-interpreter
A modules/workflow-interpreter/src
A modules/workflow-interpreter/src/main
A modules/workflow-interpreter/src/main/resources
A modules/workflow-interpreter/src/main/resources/WorkflowInterpretor.wsdl
A modules/workflow-interpreter/src/main/resources/services.xml
A modules/workflow-interpreter/pom.xml
A modules/workflow-interpreter/client
A pom.xml
At revision 1188293
Parsing POMs
Modules changed, recalculating dependency graph
[Airavata] $ /home/hudson/tools/java/latest1.6/bin/java -cp /home/hudson/hudson-slave/maven3-agent.jar:/home/hudson/tools/maven/latest3/boot/plexus-classworlds-2.4.jar org.jvnet.hudson.maven3.agent.Maven3Main /home/hudson/tools/maven/latest3 /home/hudson/hudson-slave/slave.jar /home/hudson/hudson-slave/maven3-interceptor.jar 45477
<===[JENKINS REMOTING CAPACITY]===channel started
> Executing Maven: -B -f <https://builds.apache.org/job/Airavata/ws/pom.xml> clean install
[INFO] Scanning for projects...
[WARNING]
[WARNING] Some problems were encountered while building the effective model for org.apache.airavata:gfac-core:jar:0.0.1-SNAPSHOT
[WARNING] 'build.plugins.plugin.version' for org.apache.maven.plugins:maven-surefire-plugin is missing. @ line 139, column 21
[WARNING]
[WARNING] Some problems were encountered while building the effective model for org.apache.airavata:messenger-commons:jar:0.0.1-SNAPSHOT
[WARNING] 'build.plugins.plugin.version' for org.apache.maven.plugins:maven-surefire-plugin is missing. @ org.apache.airavata:ws-messenger:0.0.1-SNAPSHOT, <https://builds.apache.org/job/Airavata/ws/modules/ws-messenger/pom.xml,> line 117, column 21
[WARNING]
[WARNING] Some problems were encountered while building the effective model for org.apache.airavata:messenger-client:jar:0.0.1-SNAPSHOT
[WARNING] 'build.plugins.plugin.version' for org.apache.maven.plugins:maven-surefire-plugin is missing. @ org.apache.airavata:ws-messenger:0.0.1-SNAPSHOT, <https://builds.apache.org/job/Airavata/ws/modules/ws-messenger/pom.xml,> line 117, column 21
[WARNING]
[WARNING] Some problems were encountered while building the effective model for org.apache.airavata:messagebox:jar:0.0.1-SNAPSHOT
[WARNING] 'build.plugins.plugin.version' for org.apache.maven.plugins:maven-surefire-plugin is missing. @ org.apache.airavata:ws-messenger:0.0.1-SNAPSHOT, <https://builds.apache.org/job/Airavata/ws/modules/ws-messenger/pom.xml,> line 117, column 21
[WARNING]
[WARNING] Some problems were encountered while building the effective model for org.apache.airavata:messagebroker:jar:0.0.1-SNAPSHOT
[WARNING] 'build.plugins.plugin.version' for org.apache.maven.plugins:maven-surefire-plugin is missing. @ org.apache.airavata:ws-messenger:0.0.1-SNAPSHOT, <https://builds.apache.org/job/Airavata/ws/modules/ws-messenger/pom.xml,> line 117, column 21
[WARNING] 'build.plugins.plugin.version' for org.apache.maven.plugins:maven-jar-plugin is missing. @ line 19, column 21
[WARNING]
[WARNING] Some problems were encountered while building the effective model for org.apache.airavata:ws-messenger-distribution:jar:0.0.1-SNAPSHOT
[WARNING] 'build.plugins.plugin.version' for org.apache.maven.plugins:maven-surefire-plugin is missing. @ org.apache.airavata:ws-messenger:0.0.1-SNAPSHOT, <https://builds.apache.org/job/Airavata/ws/modules/ws-messenger/pom.xml,> line 117, column 21
[WARNING] The expression ${version} is deprecated. Please use ${project.version} instead.
[WARNING]
[WARNING] Some problems were encountered while building the effective model for org.apache.airavata:ws-messenger:pom:0.0.1-SNAPSHOT
[WARNING] 'build.plugins.plugin.version' for org.apache.maven.plugins:maven-surefire-plugin is missing. @ line 117, column 21
[WARNING]
[WARNING] Some problems were encountered while building the effective model for org.apache.airavata:xbaya-gui:jar:0.0.1-SNAPSHOT
[WARNING] 'dependencies.dependency.(groupId:artifactId:type:classifier)' must be unique: org.apache.airavata:common-utils:jar -> duplicate declaration of version ${airavata.version} @ line 381, column 21
[WARNING] 'dependencies.dependency.(groupId:artifactId:type:classifier)' must be unique: log4j:log4j:jar -> duplicate declaration of version (?) @ line 410, column 21
[WARNING] 'build.plugins.plugin.version' for org.codehaus.mojo.webstart:webstart-maven-plugin is missing. @ line 120, column 21
[WARNING] 'build.plugins.plugin.version' for org.apache.maven.plugins:maven-compiler-plugin is missing. @ line 81, column 21
[WARNING] 'build.plugins.plugin.version' for org.apache.maven.plugins:maven-jar-plugin is missing. @ line 89, column 21
[WARNING]
[WARNING] Some problems were encountered while building the effective model for org.apache.airavata:workflowtracking:jar:0.0.1-SNAPSHOT
[WARNING] 'build.plugins.plugin.version' for org.apache.maven.plugins:maven-surefire-plugin is missing. @ line 85, column 21
[WARNING] The expression ${pom.version} is deprecated. Please use ${project.version} instead.
[WARNING]
[WARNING] Some problems were encountered while building the effective model for org.apache.airavata:gfac-schema-utils:jar:0.0.1-SNAPSHOT
[WARNING] 'build.plugins.plugin.version' for org.apache.maven.plugins:maven-surefire-plugin is missing. @ org.apache.airavata:commons:0.0.1-SNAPSHOT, <https://builds.apache.org/job/Airavata/ws/modules/commons/pom.xml,> line 31, column 21
[WARNING] 'build.plugins.plugin.version' for org.codehaus.mojo:build-helper-maven-plugin is missing. @ line 100, column 21
[WARNING] The expression ${artifactId} is deprecated. Please use ${project.artifactId} instead.
[WARNING] The expression ${version} is deprecated. Please use ${project.version} instead.
[WARNING]
[WARNING] Some problems were encountered while building the effective model for org.apache.airavata:common-utils:jar:0.0.1-SNAPSHOT
[WARNING] 'build.plugins.plugin.version' for org.apache.maven.plugins:maven-surefire-plugin is missing. @ org.apache.airavata:commons:0.0.1-SNAPSHOT, <https://builds.apache.org/job/Airavata/ws/modules/commons/pom.xml,> line 31, column 21
[WARNING]
[WARNING] Some problems were encountered while building the effective model for org.apache.airavata:registry-api:jar:0.0.1-SNAPSHOT
[WARNING] 'build.plugins.plugin.version' for org.apache.maven.plugins:maven-surefire-plugin is missing. @ org.apache.airavata:commons:0.0.1-SNAPSHOT, <https://builds.apache.org/job/Airavata/ws/modules/commons/pom.xml,> line 31, column 21
[WARNING]
[WARNING] Some problems were encountered while building the effective model for org.apache.airavata:workflow-execution-context:jar:0.0.1-SNAPSHOT
[WARNING] 'build.plugins.plugin.version' for org.apache.maven.plugins:maven-surefire-plugin is missing. @ org.apache.airavata:commons:0.0.1-SNAPSHOT, <https://builds.apache.org/job/Airavata/ws/modules/commons/pom.xml,> line 31, column 21
[WARNING] 'build.plugins.plugin.version' for org.codehaus.mojo:build-helper-maven-plugin is missing. @ line 85, column 12
[WARNING] The expression ${artifactId} is deprecated. Please use ${project.artifactId} instead.
[WARNING] The expression ${version} is deprecated. Please use ${project.version} instead.
[WARNING]
[WARNING] Some problems were encountered while building the effective model for org.apache.airavata:commons:pom:0.0.1-SNAPSHOT
[WARNING] 'build.plugins.plugin.version' for org.apache.maven.plugins:maven-surefire-plugin is missing. @ line 31, column 21
[WARNING]
[WARNING] Some problems were encountered while building the effective model for org.apache.airavata:simple-math-service:jar:0.0.1-SNAPSHOT
[WARNING] 'build.plugins.plugin.version' for org.apache.maven.plugins:maven-compiler-plugin is missing. @ line 45, column 12
[WARNING]
[WARNING] Some problems were encountered while building the effective model for org.apache.airavata:distribution:jar:0.0.1-SNAPSHOT
[WARNING] 'dependencies.dependency.(groupId:artifactId:type:classifier)' must be unique: lead-security:cryptix32:jar -> duplicate declaration of version versionless @ line 208, column 21
[WARNING] 'dependencies.dependency.(groupId:artifactId:type:classifier)' must be unique: xsul:xsul:jar -> version (?) vs 2.10.5_d @ line 247, column 21
[WARNING] The expression ${version} is deprecated. Please use ${project.version} instead.
[WARNING]
[WARNING] It is highly recommended to fix these problems because they threaten the stability of your build.
[WARNING]
[WARNING] For this reason, future Maven versions might no longer support building such malformed projects.
[WARNING]
[INFO] ------------------------------------------------------------------------
[INFO] Reactor Build Order:
[INFO]
[INFO] Airavata
[INFO] Airavata Commons
[INFO] Airavata GFac Schema Utilities
[INFO] Airavata Registry API
[INFO] Airavata-WS-Messenger
[INFO] Messenger Commons
[INFO] Messenger Client
[INFO] Airavata Workflow Tracking
[INFO] GFac-Core
[INFO] Message Broker
[INFO] Airavata Common Utilities
[INFO] Airavata Workflow Execution Context
[INFO] GFac-Axis2-Interface
[INFO] MessageBox
[INFO] distribution
[INFO] Airavata XBaya
[INFO] Simple Math Service
[INFO] distribution
[INFO]
[INFO] ------------------------------------------------------------------------
[INFO] Building Airavata 0.0.1-SNAPSHOT
[INFO] ------------------------------------------------------------------------
[INFO]
[INFO] --- maven-clean-plugin:2.4.1:clean (default-clean) @ airavata ---
[INFO]
[INFO] --- maven-install-plugin:2.3.1:install (default-install) @ airavata ---
[INFO] Installing <https://builds.apache.org/job/Airavata/ws/pom.xml> to /home/hudson/.m2/repository/org/apache/airavata/airavata/0.0.1-SNAPSHOT/airavata-0.0.1-SNAPSHOT.pom
[JENKINS] Archiving <https://builds.apache.org/job/Airavata/ws/pom.xml> to /home/hudson/hudson/jobs/Airavata/modules/org.apache.airavata$airavata/builds/2011-10-24_19-02-42/archive/org.apache.airavata/airavata/0.0.1-SNAPSHOT/airavata-0.0.1-SNAPSHOT.pom
[INFO]
[INFO] ------------------------------------------------------------------------
[INFO] Building Airavata Commons 0.0.1-SNAPSHOT
[INFO] ------------------------------------------------------------------------
[INFO]
[INFO] --- maven-clean-plugin:2.4.1:clean (default-clean) @ commons ---
[INFO] [INFO] Installing <https://builds.apache.org/job/Airavata/ws/modules/commons/pom.xml> to /home/hudson/.m2/repository/org/apache/airavata/commons/0.0.1-SNAPSHOT/commons-0.0.1-SNAPSHOT.pom
[INFO] --- maven-install-plugin:2.3.1:install (default-install) @ commons ---
[JENKINS] Archiving <https://builds.apache.org/job/Airavata/ws/modules/commons/pom.xml> to /home/hudson/hudson/jobs/Airavata/modules/org.apache.airavata$commons/builds/2011-10-24_19-02-42/archive/org.apache.airavata/commons/0.0.1-SNAPSHOT/commons-0.0.1-SNAPSHOT.pom
[INFO]
[INFO] ------------------------------------------------------------------------
[INFO] Building Airavata GFac Schema Utilities 0.0.1-SNAPSHOT
[INFO] ------------------------------------------------------------------------
[INFO]
[INFO] --- maven-clean-plugin:2.4.1:clean (default-clean) @ gfac-schema-utils ---
[INFO]
[INFO] --- build-helper-maven-plugin:1.7:add-source (add-source) @ gfac-schema-utils ---
[INFO] Source directory: <https://builds.apache.org/job/Airavata/ws/modules/commons/gfac-schema/target/generated-sources/xmlbeans> added.
[INFO]
[INFO] --- xmlbeans-maven-plugin:2.3.3:xmlbeans (default) @ gfac-schema-utils ---
[INFO]
[INFO] --- maven-resources-plugin:2.4.3:resources (default-resources) @ gfac-schema-utils ---
[INFO] Using 'UTF-8' encoding to copy filtered resources.
[INFO] Copying 1 resource
[INFO] Copying 179 resources
[INFO]
[INFO] --- maven-compiler-plugin:2.0.2:compile (default-compile) @ gfac-schema-utils ---
[INFO] Compiling 20 source files to <https://builds.apache.org/job/Airavata/ws/modules/commons/gfac-schema/target/classes>
[INFO] Using 'UTF-8' encoding to copy filtered resources.
[INFO] [INFO] skip non existing resourceDirectory <https://builds.apache.org/job/Airavata/ws/modules/commons/gfac-schema/src/test/resources>
[INFO] --- maven-resources-plugin:2.4.3:testResources (default-testResources) @ gfac-schema-utils ---
[INFO] [INFO] No sources to compile
[INFO] --- maven-compiler-plugin:2.0.2:testCompile (default-testCompile) @ gfac-schema-utils ---
[INFO]
[INFO] --- maven-surefire-plugin:2.7.2:test (default-test) @ gfac-schema-utils ---
[INFO] Tests are skipped.
[INFO]
[INFO] --- maven-jar-plugin:2.3.1:jar (default-jar) @ gfac-schema-utils ---
[INFO] Building jar: <https://builds.apache.org/job/Airavata/ws/modules/commons/gfac-schema/target/gfac-schema-utils-0.0.1-SNAPSHOT.jar>
[INFO] [INFO] Installing <https://builds.apache.org/job/Airavata/ws/modules/commons/gfac-schema/target/gfac-schema-utils-0.0.1-SNAPSHOT.jar> to /home/hudson/.m2/repository/org/apache/airavata/gfac-schema-utils/0.0.1-SNAPSHOT/gfac-schema-utils-0.0.1-SNAPSHOT.jar
[INFO] Installing <https://builds.apache.org/job/Airavata/ws/modules/commons/gfac-schema/pom.xml> to /home/hudson/.m2/repository/org/apache/airavata/gfac-schema-utils/0.0.1-SNAPSHOT/gfac-schema-utils-0.0.1-SNAPSHOT.pom
[INFO] --- maven-install-plugin:2.3.1:install (default-install) @ gfac-schema-utils ---
[JENKINS] Archiving <https://builds.apache.org/job/Airavata/ws/modules/commons/gfac-schema/pom.xml> to /home/hudson/hudson/jobs/Airavata/modules/org.apache.airavata$gfac-schema-utils/builds/2011-10-24_19-02-42/archive/org.apache.airavata/gfac-schema-utils/0.0.1-SNAPSHOT/gfac-schema-utils-0.0.1-SNAPSHOT.pom
[JENKINS] Archiving <https://builds.apache.org/job/Airavata/ws/modules/commons/gfac-schema/target/gfac-schema-utils-0.0.1-SNAPSHOT.jar> to /home/hudson/hudson/jobs/Airavata/modules/org.apache.airavata$gfac-schema-utils/builds/2011-10-24_19-02-42/archive/org.apache.airavata/gfac-schema-utils/0.0.1-SNAPSHOT/gfac-schema-utils-0.0.1-SNAPSHOT.jar
[INFO]
[INFO] ------------------------------------------------------------------------
[INFO] Building Airavata Registry API 0.0.1-SNAPSHOT
[INFO] ------------------------------------------------------------------------
[INFO]
[INFO] --- maven-clean-plugin:2.4.1:clean (default-clean) @ registry-api ---
[INFO] [INFO] Using 'UTF-8' encoding to copy filtered resources.
[INFO] skip non existing resourceDirectory <https://builds.apache.org/job/Airavata/ws/modules/commons/registry-api/src/main/resources>
[INFO] --- maven-resources-plugin:2.4.3:resources (default-resources) @ registry-api ---
[INFO]
[INFO] Compiling 15 source files to <https://builds.apache.org/job/Airavata/ws/modules/commons/registry-api/target/classes>
[INFO] --- maven-compiler-plugin:2.0.2:compile (default-compile) @ registry-api ---
[JENKINS] Archiving <https://builds.apache.org/job/Airavata/ws/modules/commons/registry-api/pom.xml> to /home/hudson/hudson/jobs/Airavata/modules/org.apache.airavata$registry-api/builds/2011-10-24_19-02-42/archive/org.apache.airavata/registry-api/0.0.1-SNAPSHOT/registry-api-0.0.1-SNAPSHOT.pom
[INFO] ------------------------------------------------------------------------
[INFO] Reactor Summary:
[INFO]
[INFO] Airavata .......................................... SUCCESS [9.592s]
[INFO] Airavata Commons .................................. SUCCESS [0.334s]
[INFO] Airavata GFac Schema Utilities .................... SUCCESS [11.652s]
[INFO] Airavata Registry API ............................. FAILURE [1.956s]
[INFO] Airavata-WS-Messenger ............................. SKIPPED
[INFO] Messenger Commons ................................. SKIPPED
[INFO] Messenger Client .................................. SKIPPED
[INFO] Airavata Workflow Tracking ........................ SKIPPED
[INFO] GFac-Core ......................................... SKIPPED
[INFO] Message Broker .................................... SKIPPED
[INFO] Airavata Common Utilities ......................... SKIPPED
[INFO] Airavata Workflow Execution Context ............... SKIPPED
[INFO] GFac-Axis2-Interface .............................. SKIPPED
[INFO] MessageBox ........................................ SKIPPED
[INFO] distribution ...................................... SKIPPED
[INFO] Airavata XBaya .................................... SKIPPED
[INFO] Simple Math Service ............................... SKIPPED
[INFO] distribution ...................................... SKIPPED
[INFO] ------------------------------------------------------------------------
[INFO] BUILD FAILURE
[INFO] ------------------------------------------------------------------------
[INFO] Total time: 28.737s
[INFO] Finished at: Mon Oct 24 19:03:23 UTC 2011
[INFO] Final Memory: 21M/151M
[INFO] ------------------------------------------------------------------------
Waiting for Jenkins to finish collecting data
mavenExecutionResult exceptions not empty
message : Failed to execute goal org.apache.maven.plugins:maven-compiler-plugin:2.0.2:compile (default-compile) on project registry-api: Compilation failure
cause : Compilation failure
Stack trace :
org.apache.maven.lifecycle.LifecycleExecutionException: Failed to execute goal org.apache.maven.plugins:maven-compiler-plugin:2.0.2:compile (default-compile) on project registry-api: Compilation failure
at org.apache.maven.lifecycle.internal.MojoExecutor.execute(MojoExecutor.java:213)
at org.apache.maven.lifecycle.internal.MojoExecutor.execute(MojoExecutor.java:153)
at org.apache.maven.lifecycle.internal.MojoExecutor.execute(MojoExecutor.java:145)
at org.apache.maven.lifecycle.internal.LifecycleModuleBuilder.buildProject(LifecycleModuleBuilder.java:84)
at org.apache.maven.lifecycle.internal.LifecycleModuleBuilder.buildProject(LifecycleModuleBuilder.java:59)
at org.apache.maven.lifecycle.internal.LifecycleStarter.singleThreadedBuild(LifecycleStarter.java:183)
at org.apache.maven.lifecycle.internal.LifecycleStarter.execute(LifecycleStarter.java:161)
at org.apache.maven.DefaultMaven.doExecute(DefaultMaven.java:319)
at org.apache.maven.DefaultMaven.execute(DefaultMaven.java:156)
at org.jvnet.hudson.maven3.launcher.Maven3Launcher.main(Maven3Launcher.java:79)
at sun.reflect.NativeMethodAccessorImpl.invoke0(Native Method)
at sun.reflect.NativeMethodAccessorImpl.invoke(NativeMethodAccessorImpl.java:39)
at sun.reflect.DelegatingMethodAccessorImpl.invoke(DelegatingMethodAccessorImpl.java:25)
at java.lang.reflect.Method.invoke(Method.java:597)
at org.codehaus.plexus.classworlds.launcher.Launcher.launchStandard(Launcher.java:329)
at org.codehaus.plexus.classworlds.launcher.Launcher.launch(Launcher.java:239)
at org.jvnet.hudson.maven3.agent.Maven3Main.launch(Maven3Main.java:158)
at hudson.maven.Maven3Builder.call(Maven3Builder.java:122)
at hudson.maven.Maven3Builder.call(Maven3Builder.java:74)
at hudson.remoting.UserRequest.perform(UserRequest.java:118)
at hudson.remoting.UserRequest.perform(UserRequest.java:48)
at hudson.remoting.Request$2.run(Request.java:287)
at java.util.concurrent.Executors$RunnableAdapter.call(Executors.java:441)
at java.util.concurrent.FutureTask$Sync.innerRun(FutureTask.java:303)
at java.util.concurrent.FutureTask.run(FutureTask.java:138)
at java.util.concurrent.ThreadPoolExecutor$Worker.runTask(ThreadPoolExecutor.java:886)
at java.util.concurrent.ThreadPoolExecutor$Worker.run(ThreadPoolExecutor.java:908)
at java.lang.Thread.run(Thread.java:662)
Caused by: org.apache.maven.plugin.CompilationFailureException: Compilation failure
at org.apache.maven.plugin.AbstractCompilerMojo.execute(AbstractCompilerMojo.java:516)
at org.apache.maven.plugin.CompilerMojo.execute(CompilerMojo.java:114)
at org.apache.maven.plugin.DefaultBuildPluginManager.executeMojo(DefaultBuildPluginManager.java:101)
at org.apache.maven.lifecycle.internal.MojoExecutor.execute(MojoExecutor.java:209)
... 27 more
Sending e-mails to: airavata-dev@incubator.apache.org
channel stopped
Build failed in Jenkins: Airavata #142
Posted by Apache Jenkins Server <je...@builds.apache.org>.
See <https://builds.apache.org/job/Airavata/142/changes>
Changes:
[patanachai] AIRAVATA-170 change throw out exception and implementation to XMLBean object
[lahiru] Applying the patch for the issue AIRAVATA-167
Thanks Heshan for the contribution
[lahiru] Applying the patch for the issue AIRAVATA-168
Thanks Heshan for the contribution
------------------------------------------
[...truncated 1501 lines...]
Discovered a new module org.apache.airavata:gfac-axis2-interface GFac-Axis2-Interface
Discovered a new module org.apache.airavata:ws-messenger Airavata-WS-Messenger
Discovered a new module org.apache.airavata:messenger-commons Messenger Commons
Discovered a new module org.apache.airavata:messenger-client Messenger Client
Discovered a new module org.apache.airavata:messagebox MessageBox
Discovered a new module org.apache.airavata:messagebroker Message Broker
Discovered a new module org.apache.airavata:xbaya-gui Airavata XBaya
Discovered a new module org.apache.airavata:commons Airavata Commons
Discovered a new module org.apache.airavata:workflowtracking Airavata Workflow Tracking
Discovered a new module org.apache.airavata:gfac-schema-utils Airavata GFac Schema Utilities
Discovered a new module org.apache.airavata:common-utils Airavata Common Utilities
Discovered a new module org.apache.airavata:registry-api Airavata Registry API
Discovered a new module org.apache.airavata:workflow-execution-context Airavata Workflow Execution Context
Modules changed, recalculating dependency graph
[Airavata] $ /home/hudson/tools/java/latest1.6/bin/java -cp /home/jenkins/jenkins-slave/maven3-agent.jar:/home/hudson/tools/maven/latest3/boot/plexus-classworlds-2.4.jar org.jvnet.hudson.maven3.agent.Maven3Main /home/hudson/tools/maven/latest3 /home/jenkins/jenkins-slave/slave.jar /home/jenkins/jenkins-slave/maven3-interceptor.jar 35501
<===[JENKINS REMOTING CAPACITY]===>channel started
Executing Maven: -B -f <https://builds.apache.org/job/Airavata/ws/pom.xml> clean install
[INFO] Scanning for projects...
[WARNING]
[WARNING] Some problems were encountered while building the effective model for org.apache.airavata:gfac-core:jar:0.0.1-SNAPSHOT
[WARNING] 'build.plugins.plugin.version' for org.apache.maven.plugins:maven-surefire-plugin is missing. @ line 139, column 21
[WARNING]
[WARNING] Some problems were encountered while building the effective model for org.apache.airavata:messenger-commons:jar:0.0.1-SNAPSHOT
[WARNING] 'build.plugins.plugin.version' for org.apache.maven.plugins:maven-surefire-plugin is missing. @ org.apache.airavata:ws-messenger:0.0.1-SNAPSHOT, <https://builds.apache.org/job/Airavata/ws/modules/ws-messenger/pom.xml,> line 117, column 21
[WARNING]
[WARNING] Some problems were encountered while building the effective model for org.apache.airavata:messenger-client:jar:0.0.1-SNAPSHOT
[WARNING] 'build.plugins.plugin.version' for org.apache.maven.plugins:maven-surefire-plugin is missing. @ org.apache.airavata:ws-messenger:0.0.1-SNAPSHOT, <https://builds.apache.org/job/Airavata/ws/modules/ws-messenger/pom.xml,> line 117, column 21
[WARNING]
[WARNING] Some problems were encountered while building the effective model for org.apache.airavata:messagebox:jar:0.0.1-SNAPSHOT
[WARNING] 'build.plugins.plugin.version' for org.apache.maven.plugins:maven-surefire-plugin is missing. @ org.apache.airavata:ws-messenger:0.0.1-SNAPSHOT, <https://builds.apache.org/job/Airavata/ws/modules/ws-messenger/pom.xml,> line 117, column 21
[WARNING]
[WARNING] Some problems were encountered while building the effective model for org.apache.airavata:messagebroker:jar:0.0.1-SNAPSHOT
[WARNING] 'build.plugins.plugin.version' for org.apache.maven.plugins:maven-surefire-plugin is missing. @ org.apache.airavata:ws-messenger:0.0.1-SNAPSHOT, <https://builds.apache.org/job/Airavata/ws/modules/ws-messenger/pom.xml,> line 117, column 21
[WARNING] 'build.plugins.plugin.version' for org.apache.maven.plugins:maven-jar-plugin is missing. @ line 19, column 21
[WARNING]
[WARNING] Some problems were encountered while building the effective model for org.apache.airavata:ws-messenger-distribution:jar:0.0.1-SNAPSHOT
[WARNING] 'build.plugins.plugin.version' for org.apache.maven.plugins:maven-surefire-plugin is missing. @ org.apache.airavata:ws-messenger:0.0.1-SNAPSHOT, <https://builds.apache.org/job/Airavata/ws/modules/ws-messenger/pom.xml,> line 117, column 21
[WARNING] The expression ${version} is deprecated. Please use ${project.version} instead.
[WARNING]
[WARNING] Some problems were encountered while building the effective model for org.apache.airavata:ws-messenger:pom:0.0.1-SNAPSHOT
[WARNING] 'build.plugins.plugin.version' for org.apache.maven.plugins:maven-surefire-plugin is missing. @ line 117, column 21
[WARNING]
[WARNING] Some problems were encountered while building the effective model for org.apache.airavata:xbaya-gui:jar:0.0.1-SNAPSHOT
[WARNING] 'dependencies.dependency.(groupId:artifactId:type:classifier)' must be unique: org.apache.airavata:common-utils:jar -> duplicate declaration of version ${airavata.version} @ line 381, column 21
[WARNING] 'dependencies.dependency.(groupId:artifactId:type:classifier)' must be unique: log4j:log4j:jar -> duplicate declaration of version (?) @ line 410, column 21
[WARNING] 'build.plugins.plugin.version' for org.codehaus.mojo.webstart:webstart-maven-plugin is missing. @ line 120, column 21
[WARNING] 'build.plugins.plugin.version' for org.apache.maven.plugins:maven-compiler-plugin is missing. @ line 81, column 21
[WARNING] 'build.plugins.plugin.version' for org.apache.maven.plugins:maven-jar-plugin is missing. @ line 89, column 21
[WARNING]
[WARNING] Some problems were encountered while building the effective model for org.apache.airavata:workflowtracking:jar:0.0.1-SNAPSHOT
[WARNING] 'build.plugins.plugin.version' for org.apache.maven.plugins:maven-surefire-plugin is missing. @ line 85, column 21
[WARNING] The expression ${pom.version} is deprecated. Please use ${project.version} instead.
[WARNING]
[WARNING] Some problems were encountered while building the effective model for org.apache.airavata:gfac-schema-utils:jar:0.0.1-SNAPSHOT
[WARNING] 'build.plugins.plugin.version' for org.apache.maven.plugins:maven-surefire-plugin is missing. @ org.apache.airavata:commons:0.0.1-SNAPSHOT, <https://builds.apache.org/job/Airavata/ws/modules/commons/pom.xml,> line 31, column 21
[WARNING] 'build.plugins.plugin.version' for org.codehaus.mojo:build-helper-maven-plugin is missing. @ line 100, column 21
[WARNING] The expression ${artifactId} is deprecated. Please use ${project.artifactId} instead.
[WARNING] The expression ${version} is deprecated. Please use ${project.version} instead.
[WARNING]
[WARNING] Some problems were encountered while building the effective model for org.apache.airavata:common-utils:jar:0.0.1-SNAPSHOT
[WARNING] 'build.plugins.plugin.version' for org.apache.maven.plugins:maven-surefire-plugin is missing. @ org.apache.airavata:commons:0.0.1-SNAPSHOT, <https://builds.apache.org/job/Airavata/ws/modules/commons/pom.xml,> line 31, column 21
[WARNING]
[WARNING] Some problems were encountered while building the effective model for org.apache.airavata:registry-api:jar:0.0.1-SNAPSHOT
[WARNING] 'build.plugins.plugin.version' for org.apache.maven.plugins:maven-surefire-plugin is missing. @ org.apache.airavata:commons:0.0.1-SNAPSHOT, <https://builds.apache.org/job/Airavata/ws/modules/commons/pom.xml,> line 31, column 21
[WARNING]
[WARNING] Some problems were encountered while building the effective model for org.apache.airavata:workflow-execution-context:jar:0.0.1-SNAPSHOT
[WARNING] 'build.plugins.plugin.version' for org.apache.maven.plugins:maven-surefire-plugin is missing. @ org.apache.airavata:commons:0.0.1-SNAPSHOT, <https://builds.apache.org/job/Airavata/ws/modules/commons/pom.xml,> line 31, column 21
[WARNING] 'build.plugins.plugin.version' for org.codehaus.mojo:build-helper-maven-plugin is missing. @ line 85, column 12
[WARNING] The expression ${artifactId} is deprecated. Please use ${project.artifactId} instead.
[WARNING] The expression ${version} is deprecated. Please use ${project.version} instead.
[WARNING]
[WARNING] Some problems were encountered while building the effective model for org.apache.airavata:commons:pom:0.0.1-SNAPSHOT
[INFO] [WARNING] 'build.plugins.plugin.version' for org.apache.maven.plugins:maven-surefire-plugin is missing. @ line 31, column 21
[WARNING]
[WARNING] Some problems were encountered while building the effective model for org.apache.airavata:simple-math-service:jar:0.0.1-SNAPSHOT
[WARNING] 'build.plugins.plugin.version' for org.apache.maven.plugins:maven-compiler-plugin is missing. @ line 38, column 12
[WARNING]
[WARNING] Some problems were encountered while building the effective model for org.apache.airavata:distribution:jar:0.0.1-SNAPSHOT
[WARNING] 'dependencies.dependency.(groupId:artifactId:type:classifier)' must be unique: lead-security:cryptix32:jar -> duplicate declaration of version versionless @ line 208, column 21
[WARNING] 'dependencies.dependency.(groupId:artifactId:type:classifier)' must be unique: xsul:xsul:jar -> version (?) vs 2.10.5_d @ line 247, column 21
[WARNING] The expression ${version} is deprecated. Please use ${project.version} instead.
[WARNING]
[WARNING] It is highly recommended to fix these problems because they threaten the stability of your build.
[WARNING]
[WARNING] For this reason, future Maven versions might no longer support building such malformed projects.
[WARNING]
------------------------------------------------------------------------
[INFO] Reactor Build Order:
[INFO]
[INFO] Airavata
[INFO] Airavata Commons
[INFO] Airavata GFac Schema Utilities
[INFO] Airavata Registry API
[INFO] Airavata-WS-Messenger
[INFO] Messenger Commons
[INFO] Messenger Client
[INFO] Airavata Workflow Tracking
[INFO] GFac-Core
[INFO] Message Broker
[INFO] Airavata Common Utilities
[INFO] Airavata Workflow Execution Context
[INFO] GFac-Axis2-Interface
[INFO] MessageBox
[INFO] distribution
[INFO] Airavata XBaya
[INFO] Simple Math Service
[INFO] distribution
[INFO]
[INFO] ------------------------------------------------------------------------
[INFO] Building Airavata 0.0.1-SNAPSHOT
[INFO] ------------------------------------------------------------------------
[INFO]
[INFO] --- maven-clean-plugin:2.4.1:clean (default-clean) @ airavata ---
[INFO]
[INFO] --- maven-install-plugin:2.3.1:install (default-install) @ airavata ---
[INFO] Installing <https://builds.apache.org/job/Airavata/ws/pom.xml> to /home/jenkins/.m2/repository/org/apache/airavata/airavata/0.0.1-SNAPSHOT/airavata-0.0.1-SNAPSHOT.pom
[JENKINS] Archiving <https://builds.apache.org/job/Airavata/ws/pom.xml> to /home/hudson/hudson/jobs/Airavata/modules/org.apache.airavata$airavata/builds/2011-10-24_18-01-05/archive/org.apache.airavata/airavata/0.0.1-SNAPSHOT/airavata-0.0.1-SNAPSHOT.pom
[INFO]
[INFO] ------------------------------------------------------------------------
[INFO] Building Airavata Commons 0.0.1-SNAPSHOT
[INFO] ------------------------------------------------------------------------
[INFO]
[INFO] --- maven-clean-plugin:2.4.1:clean (default-clean) @ commons ---
[INFO] [INFO] Installing <https://builds.apache.org/job/Airavata/ws/modules/commons/pom.xml> to /home/jenkins/.m2/repository/org/apache/airavata/commons/0.0.1-SNAPSHOT/commons-0.0.1-SNAPSHOT.pom
[INFO] --- maven-install-plugin:2.3.1:install (default-install) @ commons ---
[JENKINS] Archiving <https://builds.apache.org/job/Airavata/ws/modules/commons/pom.xml> to /home/hudson/hudson/jobs/Airavata/modules/org.apache.airavata$commons/builds/2011-10-24_18-01-05/archive/org.apache.airavata/commons/0.0.1-SNAPSHOT/commons-0.0.1-SNAPSHOT.pom
[INFO]
[INFO] ------------------------------------------------------------------------
[INFO] Building Airavata GFac Schema Utilities 0.0.1-SNAPSHOT
[INFO] ------------------------------------------------------------------------
[INFO]
[INFO] --- maven-clean-plugin:2.4.1:clean (default-clean) @ gfac-schema-utils ---
[INFO]
[INFO] --- build-helper-maven-plugin:1.7:add-source (add-source) @ gfac-schema-utils ---
[INFO] Source directory: <https://builds.apache.org/job/Airavata/ws/modules/commons/gfac-schema/target/generated-sources/xmlbeans> added.
[INFO]
[INFO] --- xmlbeans-maven-plugin:2.3.3:xmlbeans (default) @ gfac-schema-utils ---
[INFO]
[INFO] --- maven-resources-plugin:2.4.3:resources (default-resources) @ gfac-schema-utils ---
[INFO] Using 'UTF-8' encoding to copy filtered resources.
[INFO] Copying 1 resource
[INFO] Copying 179 resources
[INFO]
[INFO] --- maven-compiler-plugin:2.0.2:compile (default-compile) @ gfac-schema-utils ---
[INFO] Compiling 20 source files to <https://builds.apache.org/job/Airavata/ws/modules/commons/gfac-schema/target/classes>
[INFO] [INFO] Using 'UTF-8' encoding to copy filtered resources.
[INFO] skip non existing resourceDirectory <https://builds.apache.org/job/Airavata/ws/modules/commons/gfac-schema/src/test/resources>
[INFO] --- maven-resources-plugin:2.4.3:testResources (default-testResources) @ gfac-schema-utils ---
[INFO] [INFO] No sources to compile
[INFO] --- maven-compiler-plugin:2.0.2:testCompile (default-testCompile) @ gfac-schema-utils ---
[INFO]
[INFO] --- maven-surefire-plugin:2.7.2:test (default-test) @ gfac-schema-utils ---
[INFO] Tests are skipped.
[INFO]
[INFO] --- maven-jar-plugin:2.3.1:jar (default-jar) @ gfac-schema-utils ---
[INFO] Building jar: <https://builds.apache.org/job/Airavata/ws/modules/commons/gfac-schema/target/gfac-schema-utils-0.0.1-SNAPSHOT.jar>
[INFO] [INFO] Installing <https://builds.apache.org/job/Airavata/ws/modules/commons/gfac-schema/target/gfac-schema-utils-0.0.1-SNAPSHOT.jar> to /home/jenkins/.m2/repository/org/apache/airavata/gfac-schema-utils/0.0.1-SNAPSHOT/gfac-schema-utils-0.0.1-SNAPSHOT.jar
[INFO] Installing <https://builds.apache.org/job/Airavata/ws/modules/commons/gfac-schema/pom.xml> to /home/jenkins/.m2/repository/org/apache/airavata/gfac-schema-utils/0.0.1-SNAPSHOT/gfac-schema-utils-0.0.1-SNAPSHOT.pom
[INFO] --- maven-install-plugin:2.3.1:install (default-install) @ gfac-schema-utils ---
[JENKINS] Archiving <https://builds.apache.org/job/Airavata/ws/modules/commons/gfac-schema/pom.xml> to /home/hudson/hudson/jobs/Airavata/modules/org.apache.airavata$gfac-schema-utils/builds/2011-10-24_18-01-05/archive/org.apache.airavata/gfac-schema-utils/0.0.1-SNAPSHOT/gfac-schema-utils-0.0.1-SNAPSHOT.pom
[JENKINS] Archiving <https://builds.apache.org/job/Airavata/ws/modules/commons/gfac-schema/target/gfac-schema-utils-0.0.1-SNAPSHOT.jar> to /home/hudson/hudson/jobs/Airavata/modules/org.apache.airavata$gfac-schema-utils/builds/2011-10-24_18-01-05/archive/org.apache.airavata/gfac-schema-utils/0.0.1-SNAPSHOT/gfac-schema-utils-0.0.1-SNAPSHOT.jar
[INFO]
[INFO] ------------------------------------------------------------------------
[INFO] Building Airavata Registry API 0.0.1-SNAPSHOT
[INFO] ------------------------------------------------------------------------
[INFO]
[INFO] --- maven-clean-plugin:2.4.1:clean (default-clean) @ registry-api ---
[INFO] [INFO] Using 'UTF-8' encoding to copy filtered resources.
[INFO] skip non existing resourceDirectory <https://builds.apache.org/job/Airavata/ws/modules/commons/registry-api/src/main/resources>
[INFO] --- maven-resources-plugin:2.4.3:resources (default-resources) @ registry-api ---
[INFO] [INFO] Compiling 15 source files to <https://builds.apache.org/job/Airavata/ws/modules/commons/registry-api/target/classes>
[INFO] --- maven-compiler-plugin:2.0.2:compile (default-compile) @ registry-api ---
[JENKINS] Archiving <https://builds.apache.org/job/Airavata/ws/modules/commons/registry-api/pom.xml> to /home/hudson/hudson/jobs/Airavata/modules/org.apache.airavata$registry-api/builds/2011-10-24_18-01-05/archive/org.apache.airavata/registry-api/0.0.1-SNAPSHOT/registry-api-0.0.1-SNAPSHOT.pom
[INFO] ------------------------------------------------------------------------
[INFO] Reactor Summary:
[INFO]
[INFO] Airavata .......................................... SUCCESS [7.833s]
[INFO] Airavata Commons .................................. SUCCESS [0.361s]
[INFO] Airavata GFac Schema Utilities .................... SUCCESS [7.481s]
[INFO] Airavata Registry API ............................. FAILURE [1.472s]
[INFO] Airavata-WS-Messenger ............................. SKIPPED
[INFO] Messenger Commons ................................. SKIPPED
[INFO] Messenger Client .................................. SKIPPED
[INFO] Airavata Workflow Tracking ........................ SKIPPED
[INFO] GFac-Core ......................................... SKIPPED
[INFO] Message Broker .................................... SKIPPED
[INFO] Airavata Common Utilities ......................... SKIPPED
[INFO] Airavata Workflow Execution Context ............... SKIPPED
[INFO] GFac-Axis2-Interface .............................. SKIPPED
[INFO] MessageBox ........................................ SKIPPED
[INFO] distribution ...................................... SKIPPED
[INFO] Airavata XBaya .................................... SKIPPED
[INFO] Simple Math Service ............................... SKIPPED
[INFO] distribution ...................................... SKIPPED
[INFO] ------------------------------------------------------------------------
[INFO] BUILD FAILURE
[INFO] ------------------------------------------------------------------------
[INFO] Total time: 22.114s
[INFO] Finished at: Mon Oct 24 18:01:37 UTC 2011
[INFO] Final Memory: 25M/141M
[INFO] ------------------------------------------------------------------------
Waiting for Jenkins to finish collecting data
mavenExecutionResult exceptions not empty
message : Failed to execute goal org.apache.maven.plugins:maven-compiler-plugin:2.0.2:compile (default-compile) on project registry-api: Compilation failure
cause : Compilation failure
Stack trace :
org.apache.maven.lifecycle.LifecycleExecutionException: Failed to execute goal org.apache.maven.plugins:maven-compiler-plugin:2.0.2:compile (default-compile) on project registry-api: Compilation failure
at org.apache.maven.lifecycle.internal.MojoExecutor.execute(MojoExecutor.java:213)
at org.apache.maven.lifecycle.internal.MojoExecutor.execute(MojoExecutor.java:153)
at org.apache.maven.lifecycle.internal.MojoExecutor.execute(MojoExecutor.java:145)
at org.apache.maven.lifecycle.internal.LifecycleModuleBuilder.buildProject(LifecycleModuleBuilder.java:84)
at org.apache.maven.lifecycle.internal.LifecycleModuleBuilder.buildProject(LifecycleModuleBuilder.java:59)
at org.apache.maven.lifecycle.internal.LifecycleStarter.singleThreadedBuild(LifecycleStarter.java:183)
at org.apache.maven.lifecycle.internal.LifecycleStarter.execute(LifecycleStarter.java:161)
at org.apache.maven.DefaultMaven.doExecute(DefaultMaven.java:319)
at org.apache.maven.DefaultMaven.execute(DefaultMaven.java:156)
at org.jvnet.hudson.maven3.launcher.Maven3Launcher.main(Maven3Launcher.java:79)
at sun.reflect.NativeMethodAccessorImpl.invoke0(Native Method)
at sun.reflect.NativeMethodAccessorImpl.invoke(NativeMethodAccessorImpl.java:39)
at sun.reflect.DelegatingMethodAccessorImpl.invoke(DelegatingMethodAccessorImpl.java:25)
at java.lang.reflect.Method.invoke(Method.java:597)
at org.codehaus.plexus.classworlds.launcher.Launcher.launchStandard(Launcher.java:329)
at org.codehaus.plexus.classworlds.launcher.Launcher.launch(Launcher.java:239)
at org.jvnet.hudson.maven3.agent.Maven3Main.launch(Maven3Main.java:158)
at hudson.maven.Maven3Builder.call(Maven3Builder.java:122)
at hudson.maven.Maven3Builder.call(Maven3Builder.java:74)
at hudson.remoting.UserRequest.perform(UserRequest.java:118)
at hudson.remoting.UserRequest.perform(UserRequest.java:48)
at hudson.remoting.Request$2.run(Request.java:287)
at java.util.concurrent.Executors$RunnableAdapter.call(Executors.java:441)
at java.util.concurrent.FutureTask$Sync.innerRun(FutureTask.java:303)
at java.util.concurrent.FutureTask.run(FutureTask.java:138)
at java.util.concurrent.ThreadPoolExecutor$Worker.runTask(ThreadPoolExecutor.java:886)
at java.util.concurrent.ThreadPoolExecutor$Worker.run(ThreadPoolExecutor.java:908)
at java.lang.Thread.run(Thread.java:662)
Caused by: org.apache.maven.plugin.CompilationFailureException: Compilation failure
at org.apache.maven.plugin.AbstractCompilerMojo.execute(AbstractCompilerMojo.java:516)
at org.apache.maven.plugin.CompilerMojo.execute(CompilerMojo.java:114)
at org.apache.maven.plugin.DefaultBuildPluginManager.executeMojo(DefaultBuildPluginManager.java:101)
at org.apache.maven.lifecycle.internal.MojoExecutor.execute(MojoExecutor.java:209)
... 27 more
Sending e-mails to: airavata-dev@incubator.apache.org glahiru@gmail.com
channel stopped
Jenkins build is still unstable: Airavata #141
Posted by Apache Jenkins Server <je...@builds.apache.org>.
See <https://builds.apache.org/job/Airavata/changes>
Jenkins build is still unstable: Airavata #140
Posted by Apache Jenkins Server <je...@builds.apache.org>.
See <https://builds.apache.org/job/Airavata/changes>
bear with build Issues tonight
Posted by Suresh Marru <sm...@cs.indiana.edu>.
Hi All,
As you might have noticed trunk is having build issues. I will take this opportunity to make some schema enhancements which will effect most of the components. We are feature freeze right now, but I rather make these changes now which will help us with the release modularity. I will ensure everything is stable and all my changes are in by tomorrow morning eastern time.
If this is conflicting with any changes you are making, please let me know. I will create JIRA issues about the changes I am making.
Suresh
On Oct 23, 2011, at 5:39 PM, Apache Jenkins Server wrote:
> See <https://builds.apache.org/job/Airavata/changes>
>