You are viewing a plain text version of this content. The canonical link for it is here.
Posted to builds@solr.apache.org by Apache Jenkins Server <je...@builds.apache.org> on 2023/06/04 20:59:44 UTC
[JENKINS] Solr » Solr-Smoketest-9.2 - Build # 83 - Still Failing!
Build: https://ci-builds.apache.org/job/Solr/job/Solr-Smoketest-9.2/83/
Log:
Started by timer
Running as SYSTEM
[EnvInject] - Loading node environment variables.
Building remotely on lucene-solr-1 (solr lucene) in workspace /home/jenkins/jenkins-slave/workspace/Solr/Solr-Smoketest-9.2
The recommended git tool is: NONE
No credentials specified
> git rev-parse --resolve-git-dir /home/jenkins/jenkins-slave/workspace/Solr/Solr-Smoketest-9.2/.git # timeout=10
Fetching changes from the remote Git repository
> git config remote.origin.url https://github.com/apache/solr.git # timeout=10
Cleaning workspace
> git rev-parse --verify HEAD # timeout=10
Resetting working tree
> git reset --hard # timeout=10
> git clean -fdx # timeout=10
Fetching upstream changes from https://github.com/apache/solr.git
> git --version # timeout=10
> git --version # 'git version 2.17.1'
> git fetch --tags --progress -- https://github.com/apache/solr.git +refs/heads/*:refs/remotes/origin/* # timeout=10
> git rev-parse origin/branch_9_2^{commit} # timeout=10
Checking out Revision 2d4509f6e7575fdaca77164718df8234de799a5a (origin/branch_9_2)
> git config core.sparsecheckout # timeout=10
> git checkout -f 2d4509f6e7575fdaca77164718df8234de799a5a # timeout=10
Commit message: "MINOR: Document change to mention hadoop/Kerberos Plugins moved to package org.apache.solr.security.hadoop (#1673)"
> git rev-list --no-walk 2d4509f6e7575fdaca77164718df8234de799a5a # timeout=10
No emails were triggered.
provisioning config files...
copy managed file [gradle.properties] to file:/home/jenkins/jenkins-slave/workspace/Solr/Solr-Smoketest-9.2/gradle.properties
[Gradle] - Launching build.
[Solr-Smoketest-9.2] $ /home/jenkins/jenkins-slave/workspace/Solr/Solr-Smoketest-9.2/gradlew -Dversion.suffix= -Dgradle.user.home=/home/jenkins/jenkins-slave/workspace/Solr/.gradle -Porg.gradle.daemon=false -Pvalidation.git.failOnModified=false --continue -x signJarsPublication clean assembleRelease
Downloading gradle-wrapper.jar from https://raw.githubusercontent.com/gradle/gradle/v7.6.0/gradle/wrapper/gradle-wrapper.jar
To honour the JVM settings for this build a single-use Daemon process will be forked. See https://docs.gradle.org/7.6/userguide/gradle_daemon.html#sec:disabling_the_daemon.
Daemon will be stopped at the end of the build
> Task :buildSrc:compileJava
> Task :buildSrc:compileGroovy NO-SOURCE
> Task :buildSrc:processResources NO-SOURCE
> Task :buildSrc:classes
> Task :buildSrc:jar
> Task :buildSrc:assemble
> Task :buildSrc:compileTestJava NO-SOURCE
> Task :buildSrc:compileTestGroovy NO-SOURCE
> Task :buildSrc:processTestResources NO-SOURCE
> Task :buildSrc:testClasses UP-TO-DATE
> Task :buildSrc:test NO-SOURCE
> Task :buildSrc:check UP-TO-DATE
> Task :buildSrc:build
> Task :clean
> Task :solr:clean UP-TO-DATE
> Task :solr:benchmark:clean
> Task :solr:core:clean
> Task :solr:distribution:clean UP-TO-DATE
> Task :solr:docker:clean UP-TO-DATE
> Task :solr:documentation:clean UP-TO-DATE
> Task :solr:example:clean UP-TO-DATE
> Task :solr:modules:clean UP-TO-DATE
> Task :solr:packaging:clean UP-TO-DATE
> Task :solr:prometheus-exporter:clean
> Task :solr:server:clean
> Task :solr:solr-ref-guide:clean
> Task :solr:solrj:clean
> Task :solr:solrj-streaming:clean
> Task :solr:solrj-zookeeper:clean
> Task :solr:test-framework:clean
> Task :solr:webapp:clean
> Task :solr:modules:analysis-extras:clean
> Task :solr:modules:analytics:clean
> Task :solr:modules:clustering:clean
> Task :solr:modules:extraction:clean
> Task :solr:modules:gcs-repository:clean
> Task :solr:modules:hadoop-auth:clean
> Task :solr:modules:hdfs:clean
> Task :solr:modules:jaegertracer-configurator:clean
> Task :solr:modules:jwt-auth:clean
> Task :solr:modules:langid:clean
> Task :solr:modules:ltr:clean
> Task :solr:modules:opentelemetry:clean
> Task :solr:modules:s3-repository:clean
> Task :solr:modules:scripting:clean
> Task :solr:modules:sql:clean
> Task :mavenLocalClean UP-TO-DATE
> Task :solr-missing-doclet:compileJava
> Task :solr-missing-doclet:processResources NO-SOURCE
> Task :solr-missing-doclet:classes
> Task :solr-missing-doclet:jar
> Task :gitStatus
> Task :checkJdkInternalsExportedToGradle
> Task :solr:solrj:compileJava
Note: Some input files use or override a deprecated API.
Note: Recompile with -Xlint:deprecation for details.
> Task :solr:solrj-streaming:compileJava
Note: Some input files use or override a deprecated API.
Note: Recompile with -Xlint:deprecation for details.
> Task :solr:solrj-zookeeper:compileJava
Note: Some input files use or override a deprecated API.
Note: Recompile with -Xlint:deprecation for details.
> Task :solr:core:compileJava
Note: Some input files use or override a deprecated API.
Note: Recompile with -Xlint:deprecation for details.
> Task :solr:core:processResources
> Task :solr:core:classes
> Task :solr:core:jar
> Task :solr:core:generateMetadataFileForJarsPublication SKIPPED
> Task :solr:core:generatePomFileForJarsPublication
> Task :solr:solrj:renderJavadoc
> Task :solr:solrj-streaming:renderJavadoc
> Task :solr:solrj-zookeeper:renderJavadoc
> Task :solr:core:renderJavadoc
> Task :solr:core:javadoc SKIPPED
> Task :solr:core:javadocJar
> Task :solr:core:sourcesJar
> Task :solr:core:publishJarsPublicationToBuildRepository
> Task :solr:prometheus-exporter:compileJava
Note: Some input files use or override a deprecated API.
Note: Recompile with -Xlint:deprecation for details.
> Task :solr:prometheus-exporter:processResources NO-SOURCE
> Task :solr:prometheus-exporter:classes
> Task :solr:prometheus-exporter:jar
> Task :solr:prometheus-exporter:generateMetadataFileForJarsPublication SKIPPED
> Task :solr:prometheus-exporter:generatePomFileForJarsPublication
> Task :solr:prometheus-exporter:renderJavadoc
> Task :solr:prometheus-exporter:javadoc SKIPPED
> Task :solr:prometheus-exporter:javadocJar
> Task :solr:prometheus-exporter:sourcesJar
> Task :solr:prometheus-exporter:publishJarsPublicationToBuildRepository
> Task :solr:solrj:processResources NO-SOURCE
> Task :solr:solrj:classes
> Task :solr:solrj:jar
> Task :solr:solrj:generateMetadataFileForJarsPublication SKIPPED
> Task :solr:solrj:generatePomFileForJarsPublication
> Task :solr:solrj:javadoc SKIPPED
> Task :solr:solrj:javadocJar
> Task :solr:solrj:sourcesJar
> Task :solr:solrj:publishJarsPublicationToBuildRepository
> Task :solr:solrj-streaming:processResources
> Task :solr:solrj-streaming:classes
> Task :solr:solrj-streaming:jar
> Task :solr:solrj-streaming:generateMetadataFileForJarsPublication SKIPPED
> Task :solr:solrj-streaming:generatePomFileForJarsPublication
> Task :solr:solrj-streaming:javadoc SKIPPED
> Task :solr:solrj-streaming:javadocJar
> Task :solr:solrj-streaming:sourcesJar
> Task :solr:solrj-streaming:publishJarsPublicationToBuildRepository
> Task :solr:solrj-zookeeper:processResources NO-SOURCE
> Task :solr:solrj-zookeeper:classes
> Task :solr:solrj-zookeeper:jar
> Task :solr:solrj-zookeeper:generateMetadataFileForJarsPublication SKIPPED
> Task :solr:solrj-zookeeper:generatePomFileForJarsPublication
> Task :solr:solrj-zookeeper:javadoc SKIPPED
> Task :solr:solrj-zookeeper:javadocJar
> Task :solr:solrj-zookeeper:sourcesJar
> Task :solr:solrj-zookeeper:publishJarsPublicationToBuildRepository
> Task :solr:test-framework:compileJava
Note: Some input files use or override a deprecated API.
Note: Recompile with -Xlint:deprecation for details.
> Task :solr:test-framework:processResources
> Task :solr:test-framework:classes
> Task :solr:test-framework:jar
> Task :solr:test-framework:generateMetadataFileForJarsPublication SKIPPED
> Task :solr:test-framework:generatePomFileForJarsPublication
> Task :solr:test-framework:renderJavadoc
> Task :solr:test-framework:javadoc SKIPPED
> Task :solr:test-framework:javadocJar
> Task :solr:test-framework:sourcesJar
> Task :solr:test-framework:publishJarsPublicationToBuildRepository
> Task :solr:modules:analysis-extras:compileJava
Note: /home/jenkins/jenkins-slave/workspace/Solr/Solr-Smoketest-9.2/solr/modules/analysis-extras/src/java/org/apache/solr/schema/ICUCollationField.java uses or overrides a deprecated API.
Note: Recompile with -Xlint:deprecation for details.
> Task :solr:modules:analysis-extras:processResources NO-SOURCE
> Task :solr:modules:analysis-extras:classes
> Task :solr:modules:analysis-extras:jar
> Task :solr:modules:analysis-extras:generateMetadataFileForJarsPublication SKIPPED
> Task :solr:modules:analysis-extras:generatePomFileForJarsPublication
> Task :solr:modules:analysis-extras:renderJavadoc
> Task :solr:modules:analysis-extras:javadoc SKIPPED
> Task :solr:modules:analysis-extras:javadocJar
> Task :solr:modules:analysis-extras:sourcesJar
> Task :solr:modules:analysis-extras:publishJarsPublicationToBuildRepository
> Task :solr:modules:analytics:compileJava
Note: Some input files use or override a deprecated API.
Note: Recompile with -Xlint:deprecation for details.
> Task :solr:modules:analytics:processResources NO-SOURCE
> Task :solr:modules:analytics:classes
> Task :solr:modules:analytics:jar
> Task :solr:modules:analytics:generateMetadataFileForJarsPublication SKIPPED
> Task :solr:modules:analytics:generatePomFileForJarsPublication
> Task :solr:modules:analytics:renderJavadoc
> Task :solr:modules:analytics:javadoc SKIPPED
> Task :solr:modules:analytics:javadocJar
> Task :solr:modules:analytics:sourcesJar
> Task :solr:modules:analytics:publishJarsPublicationToBuildRepository
> Task :solr:modules:clustering:compileJava
> Task :solr:modules:clustering:processResources NO-SOURCE
> Task :solr:modules:clustering:classes
> Task :solr:modules:clustering:jar
> Task :solr:modules:clustering:generateMetadataFileForJarsPublication SKIPPED
> Task :solr:modules:clustering:generatePomFileForJarsPublication
> Task :solr:modules:clustering:renderJavadoc
> Task :solr:modules:clustering:javadoc SKIPPED
> Task :solr:modules:clustering:javadocJar
> Task :solr:modules:clustering:sourcesJar
> Task :solr:modules:clustering:publishJarsPublicationToBuildRepository
> Task :solr:modules:extraction:compileJava
Note: /home/jenkins/jenkins-slave/workspace/Solr/Solr-Smoketest-9.2/solr/modules/extraction/src/java/org/apache/solr/handler/extraction/ExtractingDocumentLoader.java uses or overrides a deprecated API.
Note: Recompile with -Xlint:deprecation for details.
> Task :solr:modules:extraction:processResources
> Task :solr:modules:extraction:classes
> Task :solr:modules:extraction:jar
> Task :solr:modules:extraction:generateMetadataFileForJarsPublication SKIPPED
> Task :solr:modules:extraction:generatePomFileForJarsPublication
> Task :solr:modules:extraction:renderJavadoc
> Task :solr:modules:extraction:javadoc SKIPPED
> Task :solr:modules:extraction:javadocJar
> Task :solr:modules:extraction:sourcesJar
> Task :solr:modules:extraction:publishJarsPublicationToBuildRepository
> Task :solr:modules:gcs-repository:compileJava
Note: /home/jenkins/jenkins-slave/workspace/Solr/Solr-Smoketest-9.2/solr/modules/gcs-repository/src/java/org/apache/solr/gcs/GCSConfigParser.java uses or overrides a deprecated API.
Note: Recompile with -Xlint:deprecation for details.
> Task :solr:modules:gcs-repository:processResources NO-SOURCE
> Task :solr:modules:gcs-repository:classes
> Task :solr:modules:gcs-repository:jar
> Task :solr:modules:gcs-repository:generateMetadataFileForJarsPublication SKIPPED
> Task :solr:modules:gcs-repository:generatePomFileForJarsPublication
> Task :solr:modules:gcs-repository:renderJavadoc
> Task :solr:modules:gcs-repository:javadoc SKIPPED
> Task :solr:modules:gcs-repository:javadocJar
> Task :solr:modules:gcs-repository:sourcesJar
> Task :solr:modules:gcs-repository:publishJarsPublicationToBuildRepository
> Task :solr:modules:hadoop-auth:compileJava
Note: Some input files use or override a deprecated API.
Note: Recompile with -Xlint:deprecation for details.
> Task :solr:modules:hadoop-auth:processResources NO-SOURCE
> Task :solr:modules:hadoop-auth:classes
> Task :solr:modules:hadoop-auth:jar
> Task :solr:modules:hadoop-auth:generateMetadataFileForJarsPublication SKIPPED
> Task :solr:modules:hadoop-auth:generatePomFileForJarsPublication
> Task :solr:modules:hadoop-auth:renderJavadoc
> Task :solr:modules:hadoop-auth:javadoc SKIPPED
> Task :solr:modules:hadoop-auth:javadocJar
> Task :solr:modules:hadoop-auth:sourcesJar
> Task :solr:modules:hadoop-auth:publishJarsPublicationToBuildRepository
> Task :solr:modules:hdfs:compileJava
Note: Some input files use or override a deprecated API.
Note: Recompile with -Xlint:deprecation for details.
> Task :solr:modules:hdfs:processResources NO-SOURCE
> Task :solr:modules:hdfs:classes
> Task :solr:modules:hdfs:jar
> Task :solr:modules:hdfs:generateMetadataFileForJarsPublication SKIPPED
> Task :solr:modules:hdfs:generatePomFileForJarsPublication
> Task :solr:modules:hdfs:renderJavadoc
> Task :solr:modules:hdfs:javadoc SKIPPED
> Task :solr:modules:hdfs:javadocJar
> Task :solr:modules:hdfs:sourcesJar
> Task :solr:modules:hdfs:publishJarsPublicationToBuildRepository
> Task :solr:modules:jaegertracer-configurator:compileJava
> Task :solr:modules:jaegertracer-configurator:processResources NO-SOURCE
> Task :solr:modules:jaegertracer-configurator:classes
> Task :solr:modules:jaegertracer-configurator:jar
> Task :solr:modules:jaegertracer-configurator:generateMetadataFileForJarsPublication SKIPPED
> Task :solr:modules:jaegertracer-configurator:generatePomFileForJarsPublication
> Task :solr:modules:jaegertracer-configurator:renderJavadoc
> Task :solr:modules:jaegertracer-configurator:javadoc SKIPPED
> Task :solr:modules:jaegertracer-configurator:javadocJar
> Task :solr:modules:jaegertracer-configurator:sourcesJar
> Task :solr:modules:jaegertracer-configurator:publishJarsPublicationToBuildRepository
> Task :solr:modules:jwt-auth:compileJava
Note: /home/jenkins/jenkins-slave/workspace/Solr/Solr-Smoketest-9.2/solr/modules/jwt-auth/src/java/org/apache/solr/security/jwt/JWTAuthPlugin.java uses or overrides a deprecated API.
Note: Recompile with -Xlint:deprecation for details.
> Task :solr:modules:jwt-auth:processResources NO-SOURCE
> Task :solr:modules:jwt-auth:classes
> Task :solr:modules:jwt-auth:jar
> Task :solr:modules:jwt-auth:generateMetadataFileForJarsPublication SKIPPED
> Task :solr:modules:jwt-auth:generatePomFileForJarsPublication
> Task :solr:modules:jwt-auth:renderJavadoc
> Task :solr:modules:jwt-auth:javadoc SKIPPED
> Task :solr:modules:jwt-auth:javadocJar
> Task :solr:modules:jwt-auth:sourcesJar
> Task :solr:modules:jwt-auth:publishJarsPublicationToBuildRepository
> Task :solr:modules:langid:compileJava
Note: Some input files use or override a deprecated API.
Note: Recompile with -Xlint:deprecation for details.
> Task :solr:modules:langid:processResources
> Task :solr:modules:langid:classes
> Task :solr:modules:langid:jar
> Task :solr:modules:langid:generateMetadataFileForJarsPublication SKIPPED
> Task :solr:modules:langid:generatePomFileForJarsPublication
> Task :solr:modules:langid:renderJavadoc
> Task :solr:modules:langid:javadoc SKIPPED
> Task :solr:modules:langid:javadocJar
> Task :solr:modules:langid:sourcesJar
> Task :solr:modules:langid:publishJarsPublicationToBuildRepository
> Task :solr:modules:ltr:compileJava
> Task :solr:modules:ltr:processResources NO-SOURCE
> Task :solr:modules:ltr:classes
> Task :solr:modules:ltr:jar
> Task :solr:modules:ltr:generateMetadataFileForJarsPublication SKIPPED
> Task :solr:modules:ltr:generatePomFileForJarsPublication
> Task :solr:modules:ltr:renderJavadoc
> Task :solr:modules:ltr:javadoc SKIPPED
> Task :solr:modules:ltr:javadocJar
> Task :solr:modules:ltr:sourcesJar
> Task :solr:modules:ltr:publishJarsPublicationToBuildRepository
> Task :solr:modules:opentelemetry:compileJava
> Task :solr:modules:opentelemetry:processResources NO-SOURCE
> Task :solr:modules:opentelemetry:classes
> Task :solr:modules:opentelemetry:jar
> Task :solr:modules:opentelemetry:generateMetadataFileForJarsPublication SKIPPED
> Task :solr:modules:opentelemetry:generatePomFileForJarsPublication
> Task :solr:modules:opentelemetry:renderJavadoc
> Task :solr:modules:opentelemetry:javadoc SKIPPED
> Task :solr:modules:opentelemetry:javadocJar
> Task :solr:modules:opentelemetry:sourcesJar
> Task :solr:modules:opentelemetry:publishJarsPublicationToBuildRepository
> Task :solr:modules:s3-repository:compileJava
> Task :solr:modules:s3-repository:processResources NO-SOURCE
> Task :solr:modules:s3-repository:classes
> Task :solr:modules:s3-repository:jar
> Task :solr:modules:s3-repository:generateMetadataFileForJarsPublication SKIPPED
> Task :solr:modules:s3-repository:generatePomFileForJarsPublication
> Task :solr:modules:s3-repository:renderJavadoc
> Task :solr:modules:s3-repository:javadoc SKIPPED
> Task :solr:modules:s3-repository:javadocJar
> Task :solr:modules:s3-repository:sourcesJar
> Task :solr:modules:s3-repository:publishJarsPublicationToBuildRepository
> Task :solr:modules:scripting:compileJava
Note: /home/jenkins/jenkins-slave/workspace/Solr/Solr-Smoketest-9.2/solr/modules/scripting/src/java/org/apache/solr/scripting/xslt/XSLTUpdateRequestHandler.java uses or overrides a deprecated API.
Note: Recompile with -Xlint:deprecation for details.
> Task :solr:modules:scripting:processResources NO-SOURCE
> Task :solr:modules:scripting:classes
> Task :solr:modules:scripting:jar
> Task :solr:modules:scripting:generateMetadataFileForJarsPublication SKIPPED
> Task :solr:modules:scripting:generatePomFileForJarsPublication
> Task :solr:modules:scripting:renderJavadoc
> Task :solr:modules:scripting:javadoc SKIPPED
> Task :solr:modules:scripting:javadocJar
> Task :solr:modules:scripting:sourcesJar
> Task :solr:modules:scripting:publishJarsPublicationToBuildRepository
> Task :solr:modules:sql:compileJava
Note: Some input files use or override a deprecated API.
Note: Recompile with -Xlint:deprecation for details.
> Task :solr:modules:sql:processResources
> Task :solr:modules:sql:classes
> Task :solr:modules:sql:jar
> Task :solr:modules:sql:generateMetadataFileForJarsPublication SKIPPED
> Task :solr:modules:sql:generatePomFileForJarsPublication
> Task :solr:modules:sql:renderJavadoc
> Task :solr:modules:sql:javadoc SKIPPED
> Task :solr:modules:sql:javadocJar
> Task :solr:modules:sql:sourcesJar
> Task :solr:modules:sql:publishJarsPublicationToBuildRepository
> Task :mavenToLocalFolder
Local maven artifacts (poms, jars) created at: /home/jenkins/jenkins-slave/workspace/Solr/Solr-Smoketest-9.2/build/maven-local
> Task :checkWorkingCopyClean
> Task :solr:distribution:assembleSourceTgz
> Task :solr:docker:createBodySnippetDockerfile
> Task :solr:docker:createDockerfileLocal
> Task :solr:docker:assemblePackaging
> Task :solr:documentation:changesToHtml
> Task :solr:documentation:copyDocumentationAssets
> Task :solr:documentation:markdownToHtml
> Task :solr:documentation:copyChangesToHtmlForMiniSite
> Task :solr:documentation:copyMiniDocumentationAssets
> Task :solr:documentation:createMiniDocumentationIndex
> Task :solr:documentation:documentationMinimal
> Task :solr:core:assemblePostJar
> Task :solr:example:assemblePackaging
> Task :solr:prometheus-exporter:assemblePackaging
> Task :solr:webapp:compileJava NO-SOURCE
> Task :solr:webapp:processResources NO-SOURCE
> Task :solr:webapp:classes UP-TO-DATE
> Task :solr:webapp:war
> Task :solr:server:assemblePackaging
> Task :solr:modules:analysis-extras:assemblePackaging
> Task :solr:modules:analytics:assemblePackaging
> Task :solr:modules:clustering:assemblePackaging
> Task :solr:modules:extraction:assemblePackaging
> Task :solr:modules:gcs-repository:assemblePackaging
> Task :solr:modules:hadoop-auth:assemblePackaging
> Task :solr:modules:hdfs:assemblePackaging
> Task :solr:modules:jaegertracer-configurator:assemblePackaging
> Task :solr:modules:jwt-auth:assemblePackaging
> Task :solr:modules:langid:assemblePackaging
> Task :solr:modules:ltr:assemblePackaging
> Task :solr:modules:opentelemetry:assemblePackaging
> Task :solr:modules:s3-repository:assemblePackaging
> Task :solr:modules:scripting:assemblePackaging
> Task :solr:modules:sql:assemblePackaging
> Task :solr:packaging:distTar
> Task :solr:distribution:computeChecksums
> Task :solr:distribution:prepareGitRev
> Task :solr:distribution:assembleRelease
Deprecated Gradle features were used in this build, making it incompatible with Gradle 8.0.
You can use '--warning-mode all' to show the individual deprecation warnings and determine if they come from your own scripts or plugins.
See https://docs.gradle.org/7.6/userguide/command_line_interface.html#sec:command_line_warnings
BUILD SUCCESSFUL in 3m 41s
229 actionable tasks: 221 executed, 8 up-to-date
Build step 'Invoke Gradle script' changed build result to SUCCESS
Run condition [Always] enabling perform for step [Execute shell]
[Solr-Smoketest-9.2] $ /bin/bash /tmp/jenkins11507821860724697331.sh
Installing Python script requirements
Defaulting to user installation because normal site-packages is not writeable
Collecting six~=1.16.0
Using cached six-1.16.0-py2.py3-none-any.whl (11 kB)
ERROR: Could not find a version that satisfies the requirement Jinja2~=3.1.1 (from versions: 2.0rc1, 2.0, 2.1, 2.1.1, 2.2, 2.2.1, 2.3, 2.3.1, 2.4, 2.4.1, 2.5, 2.5.1, 2.5.2, 2.5.3, 2.5.4, 2.5.5, 2.6, 2.7, 2.7.1, 2.7.2, 2.7.3, 2.8, 2.8.1, 2.9, 2.9.1, 2.9.2, 2.9.3, 2.9.4, 2.9.5, 2.9.6, 2.10, 2.10.1, 2.10.2, 2.10.3, 2.11.0, 2.11.1, 2.11.2, 2.11.3, 3.0.0a1, 3.0.0rc1, 3.0.0rc2, 3.0.0, 3.0.1, 3.0.2, 3.0.3)
ERROR: No matching distribution found for Jinja2~=3.1.1
Starting Smoke tester in folder /home/jenkins/jenkins-slave/workspace/Solr/Solr-Smoketest-9.2
Java 11 JAVA_HOME=/home/jenkins/tools/java/latest11
NOTE: output encoding is UTF-8
NOTE: Not running @Nightly or @BadApple tests. Please verify that recent Jenkins runs have passed.
Load release URL "file:///home/jenkins/jenkins-slave/workspace/Solr/Solr-Smoketest-9.2/solr/distribution/build/release"...
Get KEYS...
Downloading online KEYS file https://archive.apache.org/dist/solr/KEYS
Downloading https://archive.apache.org/dist/solr/KEYS
0.3 MB in 1.11 sec (0.3 MB/sec)
Test Solr...
test basics...
check changes HTML...
download solr-9.2.2-src.tgz...
Downloading file:///home/jenkins/jenkins-slave/workspace/Solr/Solr-Smoketest-9.2/solr/distribution/build/release/solr-9.2.2-src.tgz
85.7 MB in 0.06 sec (1360.8 MB/sec)
verify sha512 digest
download solr-9.2.2.tgz...
Downloading file:///home/jenkins/jenkins-slave/workspace/Solr/Solr-Smoketest-9.2/solr/distribution/build/release/solr-9.2.2.tgz
265.6 MB in 0.20 sec (1337.0 MB/sec)
verify sha512 digest
unpack solr-9.2.2.tgz...
solr-9.2.2.tgz
Checking LICENSE.txt
Checking NOTICE.txt
Checking README.txt
Checking CHANGES.txt
Checking bin
Checking modules
Checking docker
Checking prometheus-exporter
Checking docs
Checking example
Checking licenses
Checking server
Checking lib
verify JAR metadata/identity/no javax.* or java.* classes...
**WARNING**: skipping check of /home/jenkins/jenkins-slave/workspace/Solr/Solr-Smoketest-9.2/_tmp/smoke_1685910123/unpack/solr-9.2.2/server/solr-webapp/webapp/WEB-INF/lib/jakarta.xml.bind-api-2.3.3.jar: it has javax.* classes
**WARNING**: skipping check of /home/jenkins/jenkins-slave/workspace/Solr/Solr-Smoketest-9.2/_tmp/smoke_1685910123/unpack/solr-9.2.2/server/solr-webapp/webapp/WEB-INF/lib/jakarta.annotation-api-1.3.5.jar: it has javax.* classes
**WARNING**: skipping check of /home/jenkins/jenkins-slave/workspace/Solr/Solr-Smoketest-9.2/_tmp/smoke_1685910123/unpack/solr-9.2.2/server/solr-webapp/webapp/WEB-INF/lib/jakarta.activation-api-1.2.2.jar: it has javax.* classes
**WARNING**: skipping check of /home/jenkins/jenkins-slave/workspace/Solr/Solr-Smoketest-9.2/_tmp/smoke_1685910123/unpack/solr-9.2.2/server/solr-webapp/webapp/WEB-INF/lib/jakarta.ws.rs-api-2.1.6.jar: it has javax.* classes
**WARNING**: skipping check of /home/jenkins/jenkins-slave/workspace/Solr/Solr-Smoketest-9.2/_tmp/smoke_1685910123/unpack/solr-9.2.2/server/solr-webapp/webapp/WEB-INF/lib/jakarta.inject-2.6.1.jar: it has javax.* classes
**WARNING**: skipping check of /home/jenkins/jenkins-slave/workspace/Solr/Solr-Smoketest-9.2/_tmp/smoke_1685910123/unpack/solr-9.2.2/server/solr-webapp/webapp/WEB-INF/lib/jakarta.validation-api-2.0.2.jar: it has javax.* classes
**WARNING**: skipping check of /home/jenkins/jenkins-slave/workspace/Solr/Solr-Smoketest-9.2/_tmp/smoke_1685910123/unpack/solr-9.2.2/server/lib/ext/jetty-servlet-api-4.0.6.jar: it has javax.* classes
**WARNING**: skipping check of /home/jenkins/jenkins-slave/workspace/Solr/Solr-Smoketest-9.2/_tmp/smoke_1685910123/unpack/solr-9.2.2/modules/extraction/lib/jakarta.activation-1.2.2.jar: it has javax.* classes
**WARNING**: skipping check of /home/jenkins/jenkins-slave/workspace/Solr/Solr-Smoketest-9.2/_tmp/smoke_1685910123/unpack/solr-9.2.2/modules/extraction/lib/unit-api-1.0.jar: it has javax.* classes
copying unpacked distribution for Java 11 ...
test solr example w/ Java 11...
start Solr instance (log=/home/jenkins/jenkins-slave/workspace/Solr/Solr-Smoketest-9.2/_tmp/smoke_1685910123/unpack/solr-9.2.2-java11/solr-example.log)...
No process found for Solr node running on port 8983
Running techproducts example on port 8983 from /home/jenkins/jenkins-slave/workspace/Solr/Solr-Smoketest-9.2/_tmp/smoke_1685910123/unpack/solr-9.2.2-java11
*** [WARN] *** Your open file limit is currently 60000.
It should be set to 65000 to avoid operational disruption.
If you no longer wish to see this warning, set SOLR_ULIMIT_CHECKS to false in your profile or solr.in.sh
*** [WARN] *** Your Max Processes Limit is currently 30000.
It should be set to 65000 to avoid operational disruption.
If you no longer wish to see this warning, set SOLR_ULIMIT_CHECKS to false in your profile or solr.in.sh
Creating Solr home directory /home/jenkins/jenkins-slave/workspace/Solr/Solr-Smoketest-9.2/_tmp/smoke_1685910123/unpack/solr-9.2.2-java11/example/techproducts/solr
Starting up Solr on port 8983 using command:
"bin/solr" start -p 8983 -s "example/techproducts/solr"
*** [WARN] *** Your open file limit is currently 60000.
It should be set to 65000 to avoid operational disruption.
If you no longer wish to see this warning, set SOLR_ULIMIT_CHECKS to false in your profile or solr.in.sh
*** [WARN] *** Your Max Processes Limit is currently 30000.
It should be set to 65000 to avoid operational disruption.
If you no longer wish to see this warning, set SOLR_ULIMIT_CHECKS to false in your profile or solr.in.sh
Warning: Available entropy is low. As a result, use of the UUIDField, SSL, or any other features that require
RNG might not work properly. To check for the amount of available entropy, use 'cat /proc/sys/kernel/random/entropy_avail'.
Waiting up to 180 seconds to see Solr running on port 8983 [|] [/] [-] [\] [|]
Started Solr server on port 8983 (pid=9710). Happy searching!
Created new core 'techproducts'
Indexing tech product example docs from /home/jenkins/jenkins-slave/workspace/Solr/Solr-Smoketest-9.2/_tmp/smoke_1685910123/unpack/solr-9.2.2-java11/example/exampledocs
SimplePostTool version 5.0.0
Posting files to [base] url http://localhost:8983/solr/techproducts/update using content-type application/xml...
POSTing file mp500.xml to [base]
POSTing file ipod_video.xml to [base]
POSTing file monitor2.xml to [base]
POSTing file gb18030-example.xml to [base]
POSTing file vidcard.xml to [base]
POSTing file money.xml to [base]
POSTing file hd.xml to [base]
POSTing file ipod_other.xml to [base]
POSTing file sd500.xml to [base]
POSTing file solr.xml to [base]
POSTing file utf8-example.xml to [base]
POSTing file monitor.xml to [base]
POSTing file manufacturers.xml to [base]
POSTing file mem.xml to [base]
14 files indexed.
COMMITting Solr index changes to http://localhost:8983/solr/techproducts/update...
Time spent: 0:00:00.679
Solr techproducts example launched successfully. Direct your Web browser to http://localhost:8983/solr to visit the Solr Admin UI
test utf8...
run query...
stop server using: bin/solr stop -p 8983
Sending stop command to Solr running on port 8983 ... waiting up to 180 seconds to allow Jetty process 9710 to stop gracefully.
[|] [/] [-] [\] unpack solr-9.2.2-src.tgz...
solr-9.2.2-src.tgz
Checking LICENSE.txt
Checking NOTICE.txt
Checking README.md
Checking CONTRIBUTING.md
Checking CHANGES.txt
Checking README.adoc
Checking buildSrc
Checking dev-docs
Checking dev-tools
Checking gradle
Checking help
Checking solr
Checking build.gradle
Checking gradlew
Checking gradlew.bat
Checking settings.gradle
Checking versions.lock
Checking versions.props
Checking benchmark
Checking bin
Checking modules
Checking core
Checking docker
Checking documentation
Checking example
Checking licenses
Checking packaging
Checking distribution
Checking prometheus-exporter
Checking server
Checking solr-ref-guide
Checking solrj
Checking solrj-streaming
Checking solrj-zookeeper
Checking test-framework
Checking webapp
Checking .gitignore
Checking .gitattributes
Checking build.gradle
make sure no JARs/WARs in src dist...
run "./gradlew --no-daemon check -p solr/documentation"
run tests w/ Java 11 and testArgs='-Dtests.nightly=false -Dtests.badapples=false '...
command "export JAVA_HOME="/home/jenkins/tools/java/latest11" PATH="/home/jenkins/tools/java/latest11/bin:$PATH" JAVACMD="/home/jenkins/tools/java/latest11/bin/java"; ./gradlew --no-daemon test -Dtests.nightly=false -Dtests.badapples=false " failed:
To honour the JVM settings for this build a single-use Daemon process will be forked. See https://docs.gradle.org/7.6/userguide/gradle_daemon.html#sec:disabling_the_daemon.
Daemon will be stopped at the end of the build
Gradle Enterprise plugins resolution: https://plugins.gradle.org/m2
Applying com.gradle.enterprise.gradleplugin.GradleEnterprisePlugin via init script
Connection to Gradle Enterprise: https://ge.apache.org, allowUntrustedServer: false
Enforcing Gradle Enterprise: https://ge.apache.org, allowUntrustedServer: false
Applying com.gradle.CommonCustomUserDataGradlePlugin via init script
> Task :buildSrc:compileJava UP-TO-DATE
> Task :buildSrc:compileGroovy NO-SOURCE
> Task :buildSrc:processResources NO-SOURCE
> Task :buildSrc:classes UP-TO-DATE
> Task :buildSrc:jar UP-TO-DATE
> Task :buildSrc:assemble UP-TO-DATE
> Task :buildSrc:compileTestJava NO-SOURCE
> Task :buildSrc:compileTestGroovy NO-SOURCE
> Task :buildSrc:processTestResources NO-SOURCE
> Task :buildSrc:testClasses UP-TO-DATE
> Task :buildSrc:test NO-SOURCE
> Task :buildSrc:check UP-TO-DATE
> Task :buildSrc:build UP-TO-DATE
> Task :randomizationInfo
Running tests with randomization seed: tests.seed=EA915EDCE398126
> Task :checkJdkInternalsExportedToGradle
> Task :solr:benchmark:processResources
> Task :solr:benchmark:processTestResources
> Task :solr:solrj:compileJava UP-TO-DATE
> Task :solr:solrj-streaming:compileJava UP-TO-DATE
> Task :solr:solrj-zookeeper:compileJava UP-TO-DATE
> Task :gitStatus
> Task :solr:solrj:processResources NO-SOURCE
> Task :solr:solrj:classes UP-TO-DATE
> Task :solr:solrj:jar UP-TO-DATE
> Task :solr:solrj-streaming:processResources UP-TO-DATE
> Task :solr:solrj-streaming:classes UP-TO-DATE
> Task :solr:solrj-streaming:jar UP-TO-DATE
> Task :solr:solrj-zookeeper:processResources NO-SOURCE
> Task :solr:solrj-zookeeper:classes UP-TO-DATE
> Task :solr:solrj-zookeeper:jar UP-TO-DATE
> Task :solr:test-framework:processResources
> Task :solr:modules:analysis-extras:processResources NO-SOURCE
> Task :solr:core:compileJava UP-TO-DATE
> Task :solr:test-framework:compileJava UP-TO-DATE
> Task :solr:prometheus-exporter:compileJava
Note: Some input files use or override a deprecated API.
Note: Recompile with -Xlint:deprecation for details.
> Task :solr:core:processResources UP-TO-DATE
> Task :solr:core:classes UP-TO-DATE
> Task :solr:core:jar UP-TO-DATE
> Task :solr:test-framework:classes
> Task :solr:test-framework:jar
> Task :solr:benchmark:compileJava
> Task :solr:benchmark:classes
> Task :solr:benchmark:compileTestJava
> Task :solr:benchmark:testClasses
> Task :solr:core:compileTestJava
> Task :solr:benchmark:test
> Task :solr:core:compileTestJava
Note: Some input files use or override a deprecated API.
Note: Recompile with -Xlint:deprecation for details.
> Task :solr:core:processTestResources
> Task :solr:core:testClasses
> Task :solr:modules:analysis-extras:compileJava
Note: /home/jenkins/jenkins-slave/workspace/Solr/Solr-Smoketest-9.2/_tmp/smoke_1685910123/unpack/solr-9.2.2/solr/modules/analysis-extras/src/java/org/apache/solr/schema/ICUCollationField.java uses or overrides a deprecated API.
Note: Recompile with -Xlint:deprecation for details.
> Task :solr:modules:analysis-extras:classes
> Task :solr:modules:analysis-extras:jar
> Task :solr:core:test
WARNING: Test org.apache.solr.TestRandomFaceting wrote 15,077,840 bytes of output.
org.apache.solr.cloud.SplitShardWithNodeRoleTest > testSolrClusterWithNodeRoleWithPull FAILED
java.lang.AssertionError: Timed out waiting for sub shards to be active. Number of active shards=1
Timeout waiting to see state for collection=coll_NRT_PULL :DocCollection(coll_NRT_PULL//collections/coll_NRT_PULL/state.json/14 {/collections/coll_NRT_PULL/state.json/[28]: [core_node2:1:A, core_node10:2:A, core_node4:2:A:L, core_node8:2:A:L, core_node9:2:A, core_node7:2:A:L]})={
"pullReplicas":"1",
"configName":"conf",
"replicationFactor":"1",
"shards":{
"shard1":{
"range":"80000000-7fffffff",
"state":"active",
"replicas":{
"core_node2":{
"core":"coll_NRT_PULL_shard1_replica_p1",
"node_name":"127.0.0.1:45835_solr",
"type":"PULL",
"state":"active",
"force_set_state":"false",
"base_url":"http://127.0.0.1:45835/solr"},
"core_node4":{
"core":"coll_NRT_PULL_shard1_replica_n3",
"node_name":"127.0.0.1:42785_solr",
"type":"NRT",
"state":"active",
"leader":"true",
"force_set_state":"false",
"base_url":"http://127.0.0.1:42785/solr"}}},
"shard1_0":{
"parent":"shard1",
"stateTimestamp":"1685910823023974782",
"shard_parent_node":"127.0.0.1:42785_solr",
"replicas":{
"core_node7":{
"core":"coll_NRT_PULL_shard1_0_replica_n5",
"node_name":"127.0.0.1:42785_solr",
"type":"NRT",
"state":"active",
"leader":"true",
"force_set_state":"false",
"base_url":"http://127.0.0.1:42785/solr"},
"core_node10":{
"core":"coll_NRT_PULL_shard1_0_replica_p1",
"node_name":"127.0.0.1:45835_solr",
"type":"PULL",
"state":"active",
"force_set_state":"false",
"base_url":"http://127.0.0.1:45835/solr"}},
"range":"80000000-ffffffff",
"state":"recovery",
"shard_parent_zk_session":"72077877738799109"},
"shard1_1":{
"parent":"shard1",
"stateTimestamp":"1685910823023953915",
"shard_parent_node":"127.0.0.1:42785_solr",
"replicas":{
"core_node8":{
"core":"coll_NRT_PULL_shard1_1_replica_n6",
"node_name":"127.0.0.1:42785_solr",
"type":"NRT",
"state":"active",
"leader":"true",
"force_set_state":"false",
"base_url":"http://127.0.0.1:42785/solr"},
"core_node9":{
"core":"coll_NRT_PULL_shard1_1_replica_p0",
"node_name":"127.0.0.1:45835_solr",
"type":"PULL",
"state":"active",
"force_set_state":"false",
"base_url":"http://127.0.0.1:45835/solr"}},
"range":"0-7fffffff",
"state":"recovery",
"shard_parent_zk_session":"72077877738799109"}},
"router":{"name":"compositeId"},
"nrtReplicas":"1",
"tlogReplicas":"0",
"perReplicaState":"true"}
Live Nodes: [127.0.0.1:34489_solr, 127.0.0.1:37845_solr, 127.0.0.1:38031_solr, 127.0.0.1:39505_solr, 127.0.0.1:42785_solr, 127.0.0.1:45835_solr]
Last available state: DocCollection(coll_NRT_PULL//collections/coll_NRT_PULL/state.json/14 {/collections/coll_NRT_PULL/state.json/[28]: [core_node2:1:A, core_node10:2:A, core_node4:2:A:L, core_node8:2:A:L, core_node9:2:A, core_node7:2:A:L]})={
"pullReplicas":"1",
"configName":"conf",
"replicationFactor":"1",
"shards":{
"shard1":{
"range":"80000000-7fffffff",
"state":"active",
"replicas":{
"core_node2":{
"core":"coll_NRT_PULL_shard1_replica_p1",
"node_name":"127.0.0.1:45835_solr",
"type":"PULL",
"state":"active",
"force_set_state":"false",
"base_url":"http://127.0.0.1:45835/solr"},
"core_node4":{
"core":"coll_NRT_PULL_shard1_replica_n3",
"node_name":"127.0.0.1:42785_solr",
"type":"NRT",
"state":"active",
"leader":"true",
"force_set_state":"false",
"base_url":"http://127.0.0.1:42785/solr"}}},
"shard1_0":{
"parent":"shard1",
"stateTimestamp":"1685910823023974782",
"shard_parent_node":"127.0.0.1:42785_solr",
"replicas":{
"core_node7":{
"core":"coll_NRT_PULL_shard1_0_replica_n5",
"node_name":"127.0.0.1:42785_solr",
"type":"NRT",
"state":"active",
"leader":"true",
"force_set_state":"false",
"base_url":"http://127.0.0.1:42785/solr"},
"core_node10":{
"core":"coll_NRT_PULL_shard1_0_replica_p1",
"node_name":"127.0.0.1:45835_solr",
"type":"PULL",
"state":"active",
"force_set_state":"false",
"base_url":"http://127.0.0.1:45835/solr"}},
"range":"80000000-ffffffff",
"state":"recovery",
"shard_parent_zk_session":"72077877738799109"},
"shard1_1":{
"parent":"shard1",
"stateTimestamp":"1685910823023953915",
"shard_parent_node":"127.0.0.1:42785_solr",
"replicas":{
"core_node8":{
"core":"coll_NRT_PULL_shard1_1_replica_n6",
"node_name":"127.0.0.1:42785_solr",
"type":"NRT",
"state":"active",
"leader":"true",
"force_set_state":"false",
"base_url":"http://127.0.0.1:42785/solr"},
"core_node9":{
"core":"coll_NRT_PULL_shard1_1_replica_p0",
"node_name":"127.0.0.1:45835_solr",
"type":"PULL",
"state":"active",
"force_set_state":"false",
"base_url":"http://127.0.0.1:45835/solr"}},
"range":"0-7fffffff",
"state":"recovery",
"shard_parent_zk_session":"72077877738799109"}},
"router":{"name":"compositeId"},
"nrtReplicas":"1",
"tlogReplicas":"0",
"perReplicaState":"true"}
at __randomizedtesting.SeedInfo.seed([EA915EDCE398126:D40F87C96AF7CC5B]:0)
at org.junit.Assert.fail(Assert.java:89)
at org.apache.solr.cloud.SolrCloudTestCase.waitForState(SolrCloudTestCase.java:170)
at org.apache.solr.cloud.SolrCloudTestCase.waitForState(SolrCloudTestCase.java:136)
at org.apache.solr.cloud.SplitShardWithNodeRoleTest.doSplit(SplitShardWithNodeRoleTest.java:87)
at org.apache.solr.cloud.SplitShardWithNodeRoleTest.testSolrClusterWithNodeRoleWithPull(SplitShardWithNodeRoleTest.java:65)
at java.base/jdk.internal.reflect.NativeMethodAccessorImpl.invoke0(Native Method)
at java.base/jdk.internal.reflect.NativeMethodAccessorImpl.invoke(NativeMethodAccessorImpl.java:62)
at java.base/jdk.internal.reflect.DelegatingMethodAccessorImpl.invoke(DelegatingMethodAccessorImpl.java:43)
at java.base/java.lang.reflect.Method.invoke(Method.java:566)
at com.carrotsearch.randomizedtesting.RandomizedRunner.invoke(RandomizedRunner.java:1758)
at com.carrotsearch.randomizedtesting.RandomizedRunner$8.evaluate(RandomizedRunner.java:946)
at com.carrotsearch.randomizedtesting.RandomizedRunner$9.evaluate(RandomizedRunner.java:982)
at com.carrotsearch.randomizedtesting.RandomizedRunner$10.evaluate(RandomizedRunner.java:996)
at com.carrotsearch.randomizedtesting.rules.SystemPropertiesRestoreRule$1.evaluate(SystemPropertiesRestoreRule.java:80)
at org.junit.rules.RunRules.evaluate(RunRules.java:20)
at org.apache.lucene.tests.util.TestRuleSetupTeardownChained$1.evaluate(TestRuleSetupTeardownChained.java:44)
at org.apache.lucene.tests.util.AbstractBeforeAfterRule$1.evaluate(AbstractBeforeAfterRule.java:43)
at org.apache.lucene.tests.util.TestRuleThreadAndTestName$1.evaluate(TestRuleThreadAndTestName.java:45)
at org.apache.lucene.tests.util.TestRuleIgnoreAfterMaxFailures$1.evaluate(TestRuleIgnoreAfterMaxFailures.java:60)
at org.apache.lucene.tests.util.TestRuleMarkFailure$1.evaluate(TestRuleMarkFailure.java:44)
at org.junit.rules.RunRules.evaluate(RunRules.java:20)
at com.carrotsearch.randomizedtesting.rules.StatementAdapter.evaluate(StatementAdapter.java:36)
at com.carrotsearch.randomizedtesting.ThreadLeakControl$StatementRunner.run(ThreadLeakControl.java:390)
at com.carrotsearch.randomizedtesting.ThreadLeakControl.forkTimeoutingTask(ThreadLeakControl.java:843)
at com.carrotsearch.randomizedtesting.ThreadLeakControl$3.evaluate(ThreadLeakControl.java:490)
at com.carrotsearch.randomizedtesting.RandomizedRunner.runSingleTest(RandomizedRunner.java:955)
at com.carrotsearch.randomizedtesting.RandomizedRunner$5.evaluate(RandomizedRunner.java:840)
at com.carrotsearch.randomizedtesting.RandomizedRunner$6.evaluate(RandomizedRunner.java:891)
at com.carrotsearch.randomizedtesting.RandomizedRunner$7.evaluate(RandomizedRunner.java:902)
at com.carrotsearch.randomizedtesting.rules.StatementAdapter.evaluate(StatementAdapter.java:36)
at com.carrotsearch.randomizedtesting.rules.StatementAdapter.evaluate(StatementAdapter.java:36)
at org.apache.lucene.tests.util.AbstractBeforeAfterRule$1.evaluate(AbstractBeforeAfterRule.java:43)
at org.apache.lucene.tests.util.AbstractBeforeAfterRule$1.evaluate(AbstractBeforeAfterRule.java:43)
at com.carrotsearch.randomizedtesting.rules.SystemPropertiesRestoreRule$1.evaluate(SystemPropertiesRestoreRule.java:80)
at org.junit.rules.RunRules.evaluate(RunRules.java:20)
at org.apache.lucene.tests.util.AbstractBeforeAfterRule$1.evaluate(AbstractBeforeAfterRule.java:43)
at com.carrotsearch.randomizedtesting.rules.StatementAdapter.evaluate(StatementAdapter.java:36)
at org.apache.lucene.tests.util.TestRuleStoreClassName$1.evaluate(TestRuleStoreClassName.java:38)
at com.carrotsearch.randomizedtesting.rules.NoShadowingOrOverridesOnMethodsRule$1.evaluate(NoShadowingOrOverridesOnMethodsRule.java:40)
at com.carrotsearch.randomizedtesting.rules.NoShadowingOrOverridesOnMethodsRule$1.evaluate(NoShadowingOrOverridesOnMethodsRule.java:40)
at com.carrotsearch.randomizedtesting.rules.StatementAdapter.evaluate(StatementAdapter.java:36)
at com.carrotsearch.randomizedtesting.rules.StatementAdapter.evaluate(StatementAdapter.java:36)
at org.apache.lucene.tests.util.TestRuleAssertionsRequired$1.evaluate(TestRuleAssertionsRequired.java:53)
at org.apache.lucene.tests.util.AbstractBeforeAfterRule$1.evaluate(AbstractBeforeAfterRule.java:43)
at org.apache.lucene.tests.util.TestRuleMarkFailure$1.evaluate(TestRuleMarkFailure.java:44)
at org.apache.lucene.tests.util.TestRuleIgnoreAfterMaxFailures$1.evaluate(TestRuleIgnoreAfterMaxFailures.java:60)
at org.apache.lucene.tests.util.TestRuleIgnoreTestSuites$1.evaluate(TestRuleIgnoreTestSuites.java:47)
at org.junit.rules.RunRules.evaluate(RunRules.java:20)
at com.carrotsearch.randomizedtesting.rules.StatementAdapter.evaluate(StatementAdapter.java:36)
at com.carrotsearch.randomizedtesting.ThreadLeakControl$StatementRunner.run(ThreadLeakControl.java:390)
at com.carrotsearch.randomizedtesting.ThreadLeakControl.lambda$forkTimeoutingTask$0(ThreadLeakControl.java:850)
at java.base/java.lang.Thread.run(Thread.java:829)
org.apache.solr.cloud.SplitShardWithNodeRoleTest > test suite's output saved to /home/jenkins/jenkins-slave/workspace/Solr/Solr-Smoketest-9.2/_tmp/smoke_1685910123/unpack/solr-9.2.2/solr/core/build/test-results/test/outputs/OUTPUT-org.apache.solr.cloud.SplitShardWithNodeRoleTest.txt, copied below:
2> 461570 INFO (SUITE-SplitShardWithNodeRoleTest-seed#[EA915EDCE398126]-worker) [] o.a.s.SolrTestCase Setting 'solr.default.confdir' system property to test-framework derived value of '/home/jenkins/jenkins-slave/workspace/Solr/Solr-Smoketest-9.2/_tmp/smoke_1685910123/unpack/solr-9.2.2/solr/server/solr/configsets/_default/conf'
2> 461571 INFO (SUITE-SplitShardWithNodeRoleTest-seed#[EA915EDCE398126]-worker) [] o.a.s.SolrTestCaseJ4 SecureRandom sanity checks: test.solr.allowed.securerandom=null & java.security.egd=file:/dev/./urandom
2> 461571 INFO (SUITE-SplitShardWithNodeRoleTest-seed#[EA915EDCE398126]-worker) [] o.a.s.u.ErrorLogMuter Closing ErrorLogMuter-regex-10598 after mutting 0 log messages
2> 461571 INFO (SUITE-SplitShardWithNodeRoleTest-seed#[EA915EDCE398126]-worker) [] o.a.s.u.ErrorLogMuter Creating ErrorLogMuter-regex-10599 for ERROR logs matching regex: ignore_exception
2> 461572 INFO (SUITE-SplitShardWithNodeRoleTest-seed#[EA915EDCE398126]-worker) [] o.a.s.SolrTestCaseJ4 Created dataDir: /home/jenkins/jenkins-slave/workspace/Solr/Solr-Smoketest-9.2/_tmp/smoke_1685910123/unpack/solr-9.2.2/solr/core/build/tmp/tests-tmp/solr.cloud.SplitShardWithNodeRoleTest_EA915EDCE398126-001/data-dir-58-001
2> 461572 INFO (SUITE-SplitShardWithNodeRoleTest-seed#[EA915EDCE398126]-worker) [] o.a.s.SolrTestCaseJ4 Using PointFields (NUMERIC_POINTS_SYSPROP=true) w/NUMERIC_DOCVALUES_SYSPROP=true
2> 461573 INFO (SUITE-SplitShardWithNodeRoleTest-seed#[EA915EDCE398126]-worker) [] o.a.s.SolrTestCaseJ4 Randomized ssl (false) and clientAuth (false) via: @org.apache.solr.util.RandomizeSSL(reason="", value=0.0/0.0, ssl=0.0/0.0, clientAuth=0.0/0.0)
2> 461573 INFO (SUITE-SplitShardWithNodeRoleTest-seed#[EA915EDCE398126]-worker) [] o.a.s.c.MiniSolrCloudCluster Starting cluster of 2 servers in /home/jenkins/jenkins-slave/workspace/Solr/Solr-Smoketest-9.2/_tmp/smoke_1685910123/unpack/solr-9.2.2/solr/core/build/tmp/tests-tmp/solr.cloud.SplitShardWithNodeRoleTest_EA915EDCE398126-001/tempDir-001
2> 461573 INFO (SUITE-SplitShardWithNodeRoleTest-seed#[EA915EDCE398126]-worker) [] o.a.s.c.ZkTestServer STARTING ZK TEST SERVER
2> 461574 INFO (ZkTestServer Run Thread) [] o.a.s.c.ZkTestServer client port: 0.0.0.0/0.0.0.0:0
2> 461574 INFO (ZkTestServer Run Thread) [] o.a.s.c.ZkTestServer Starting server
2> 461575 WARN (ZkTestServer Run Thread) [] o.a.z.s.ServerCnxnFactory maxCnxns is not configured, using default value 0.
2> 461674 INFO (SUITE-SplitShardWithNodeRoleTest-seed#[EA915EDCE398126]-worker) [] o.a.s.c.ZkTestServer start zk server on port: 37239
2> 461675 WARN (SUITE-SplitShardWithNodeRoleTest-seed#[EA915EDCE398126]-worker) [] o.a.s.c.c.SolrZkClient Using default ZkCredentialsInjector. ZkCredentialsInjector is not secure, it creates an empty list of credentials which leads to 'OPEN_ACL_UNSAFE' ACLs to Zookeeper nodes
2> 461675 INFO (SUITE-SplitShardWithNodeRoleTest-seed#[EA915EDCE398126]-worker) [] o.a.s.c.c.ConnectionManager Waiting up to 30000ms for client to connect to ZooKeeper
2> 461677 INFO (zkConnectionManagerCallback-5559-thread-1) [] o.a.s.c.c.ConnectionManager zkClient has connected
2> 461677 INFO (SUITE-SplitShardWithNodeRoleTest-seed#[EA915EDCE398126]-worker) [] o.a.s.c.c.ConnectionManager Client is connected to ZooKeeper
2> 461677 WARN (SUITE-SplitShardWithNodeRoleTest-seed#[EA915EDCE398126]-worker) [] o.a.s.c.c.SolrZkClient Using default ZkACLProvider. DefaultZkACLProvider is not secure, it creates 'OPEN_ACL_UNSAFE' ACLs to Zookeeper nodes
2> 461678 WARN (SUITE-SplitShardWithNodeRoleTest-seed#[EA915EDCE398126]-worker) [] o.a.s.c.c.SolrZkClient Using default ZkCredentialsInjector. ZkCredentialsInjector is not secure, it creates an empty list of credentials which leads to 'OPEN_ACL_UNSAFE' ACLs to Zookeeper nodes
2> 461679 INFO (SUITE-SplitShardWithNodeRoleTest-seed#[EA915EDCE398126]-worker) [] o.a.s.c.c.ConnectionManager Waiting up to 30000ms for client to connect to ZooKeeper
2> 461679 INFO (zkConnectionManagerCallback-5561-thread-1) [] o.a.s.c.c.ConnectionManager zkClient has connected
2> 461679 INFO (SUITE-SplitShardWithNodeRoleTest-seed#[EA915EDCE398126]-worker) [] o.a.s.c.c.ConnectionManager Client is connected to ZooKeeper
2> 461679 WARN (SUITE-SplitShardWithNodeRoleTest-seed#[EA915EDCE398126]-worker) [] o.a.s.c.c.SolrZkClient Using default ZkACLProvider. DefaultZkACLProvider is not secure, it creates 'OPEN_ACL_UNSAFE' ACLs to Zookeeper nodes
2> 461680 WARN (SUITE-SplitShardWithNodeRoleTest-seed#[EA915EDCE398126]-worker) [] o.a.s.c.c.SolrZkClient Using default ZkCredentialsInjector. ZkCredentialsInjector is not secure, it creates an empty list of credentials which leads to 'OPEN_ACL_UNSAFE' ACLs to Zookeeper nodes
2> 461680 INFO (SUITE-SplitShardWithNodeRoleTest-seed#[EA915EDCE398126]-worker) [] o.a.s.c.c.ConnectionManager Waiting up to 30000ms for client to connect to ZooKeeper
2> 461681 INFO (zkConnectionManagerCallback-5563-thread-1) [] o.a.s.c.c.ConnectionManager zkClient has connected
2> 461681 INFO (SUITE-SplitShardWithNodeRoleTest-seed#[EA915EDCE398126]-worker) [] o.a.s.c.c.ConnectionManager Client is connected to ZooKeeper
2> 461681 WARN (SUITE-SplitShardWithNodeRoleTest-seed#[EA915EDCE398126]-worker) [] o.a.s.c.c.SolrZkClient Using default ZkACLProvider. DefaultZkACLProvider is not secure, it creates 'OPEN_ACL_UNSAFE' ACLs to Zookeeper nodes
2> 461784 INFO (jetty-launcher-5564-thread-2) [] o.a.s.e.JettySolrRunner Start Jetty (configured port=0, binding port=0)
2> 461784 INFO (jetty-launcher-5564-thread-2) [] o.a.s.e.JettySolrRunner Trying to start Jetty on port 0 try number 2 ...
2> 461784 INFO (jetty-launcher-5564-thread-2) [] o.e.j.s.Server jetty-10.0.13; built: 2022-12-07T20:13:20.134Z; git: 1c2636ea05c0ca8de1ffd6ca7f3a98ac084c766d; jvm 11.0.16.1+1
2> 461784 INFO (jetty-launcher-5564-thread-1) [] o.a.s.e.JettySolrRunner Start Jetty (configured port=0, binding port=0)
2> 461784 INFO (jetty-launcher-5564-thread-1) [] o.a.s.e.JettySolrRunner Trying to start Jetty on port 0 try number 2 ...
2> 461784 INFO (jetty-launcher-5564-thread-1) [] o.e.j.s.Server jetty-10.0.13; built: 2022-12-07T20:13:20.134Z; git: 1c2636ea05c0ca8de1ffd6ca7f3a98ac084c766d; jvm 11.0.16.1+1
2> 461785 INFO (jetty-launcher-5564-thread-2) [] o.e.j.s.s.DefaultSessionIdManager Session workerName=node0
2> 461785 INFO (jetty-launcher-5564-thread-1) [] o.e.j.s.s.DefaultSessionIdManager Session workerName=node0
2> 461786 INFO (jetty-launcher-5564-thread-2) [] o.e.j.s.h.ContextHandler Started o.e.j.s.ServletContextHandler@5f17863d{/solr,file:///home/jenkins/jenkins-slave/workspace/Solr/Solr-Smoketest-9.2/_tmp/smoke_1685910123/unpack/solr-9.2.2/solr/core/build/tmp/tests-cwd/,AVAILABLE}
2> 461786 INFO (jetty-launcher-5564-thread-2) [] o.e.j.s.AbstractConnector Started ServerConnector@69beb95b{HTTP/1.1, (http/1.1, h2c)}{127.0.0.1:42785}
2> 461786 INFO (jetty-launcher-5564-thread-1) [] o.e.j.s.h.ContextHandler Started o.e.j.s.ServletContextHandler@41723179{/solr,file:///home/jenkins/jenkins-slave/workspace/Solr/Solr-Smoketest-9.2/_tmp/smoke_1685910123/unpack/solr-9.2.2/solr/core/build/tmp/tests-cwd/,AVAILABLE}
2> 461786 INFO (jetty-launcher-5564-thread-2) [] o.e.j.s.Server Started Server@1961ff44{STARTING}[10.0.13,sto=0] @461810ms
2> 461786 ERROR (jetty-launcher-5564-thread-2) [] o.a.s.u.StartupLoggingUtils Missing Java Option solr.log.dir. Logging may be missing or incomplete.
2> 461786 INFO (jetty-launcher-5564-thread-2) [] o.a.s.s.CoreContainerProvider Using logger factory org.apache.logging.slf4j.Log4jLoggerFactory
2> 461786 INFO (jetty-launcher-5564-thread-2) [] o.a.s.s.CoreContainerProvider ___ _ Welcome to Apache Solr™ version 9.2.2
2> 461786 INFO (jetty-launcher-5564-thread-2) [] o.a.s.s.CoreContainerProvider / __| ___| |_ _ Starting in cloud mode on port null
2> 461786 INFO (jetty-launcher-5564-thread-2) [] o.a.s.s.CoreContainerProvider \__ \/ _ \ | '_| Install dir: /home/jenkins/jenkins-slave/workspace/Solr/Solr-Smoketest-9.2/_tmp/smoke_1685910123/unpack/solr-9.2.2/solr
2> 461786 INFO (jetty-launcher-5564-thread-2) [] o.a.s.s.CoreContainerProvider |___/\___/_|_| Start time: 2023-06-04T20:33:41.522620Z
2> 461786 INFO (jetty-launcher-5564-thread-1) [] o.e.j.s.AbstractConnector Started ServerConnector@7bf9d7c2{HTTP/1.1, (http/1.1, h2c)}{127.0.0.1:45835}
2> 461786 INFO (jetty-launcher-5564-thread-2) [] o.a.s.s.CoreContainerProvider Solr Home: /home/jenkins/jenkins-slave/workspace/Solr/Solr-Smoketest-9.2/_tmp/smoke_1685910123/unpack/solr-9.2.2/solr/core/build/tmp/tests-tmp/solr.cloud.SplitShardWithNodeRoleTest_EA915EDCE398126-001/tempDir-001/node2 (source: servlet config: solr.solr.home)
2> 461786 INFO (jetty-launcher-5564-thread-1) [] o.e.j.s.Server Started Server@bb444e6{STARTING}[10.0.13,sto=0] @461810ms
2> 461786 WARN (jetty-launcher-5564-thread-2) [] o.a.s.c.c.SolrZkClient Using default ZkCredentialsInjector. ZkCredentialsInjector is not secure, it creates an empty list of credentials which leads to 'OPEN_ACL_UNSAFE' ACLs to Zookeeper nodes
2> 461786 ERROR (jetty-launcher-5564-thread-1) [] o.a.s.u.StartupLoggingUtils Missing Java Option solr.log.dir. Logging may be missing or incomplete.
2> 461786 INFO (jetty-launcher-5564-thread-1) [] o.a.s.s.CoreContainerProvider Using logger factory org.apache.logging.slf4j.Log4jLoggerFactory
2> 461786 INFO (jetty-launcher-5564-thread-1) [] o.a.s.s.CoreContainerProvider ___ _ Welcome to Apache Solr™ version 9.2.2
2> 461786 INFO (jetty-launcher-5564-thread-1) [] o.a.s.s.CoreContainerProvider / __| ___| |_ _ Starting in cloud mode on port null
2> 461786 INFO (jetty-launcher-5564-thread-1) [] o.a.s.s.CoreContainerProvider \__ \/ _ \ | '_| Install dir: /home/jenkins/jenkins-slave/workspace/Solr/Solr-Smoketest-9.2/_tmp/smoke_1685910123/unpack/solr-9.2.2/solr
2> 461786 INFO (jetty-launcher-5564-thread-1) [] o.a.s.s.CoreContainerProvider |___/\___/_|_| Start time: 2023-06-04T20:33:41.522933Z
2> 461787 INFO (jetty-launcher-5564-thread-1) [] o.a.s.s.CoreContainerProvider Solr Home: /home/jenkins/jenkins-slave/workspace/Solr/Solr-Smoketest-9.2/_tmp/smoke_1685910123/unpack/solr-9.2.2/solr/core/build/tmp/tests-tmp/solr.cloud.SplitShardWithNodeRoleTest_EA915EDCE398126-001/tempDir-001/node1 (source: servlet config: solr.solr.home)
2> 461787 WARN (jetty-launcher-5564-thread-1) [] o.a.s.c.c.SolrZkClient Using default ZkCredentialsInjector. ZkCredentialsInjector is not secure, it creates an empty list of credentials which leads to 'OPEN_ACL_UNSAFE' ACLs to Zookeeper nodes
2> 461788 INFO (jetty-launcher-5564-thread-2) [] o.a.s.c.c.ConnectionManager Waiting up to 30000ms for client to connect to ZooKeeper
2> 461788 INFO (jetty-launcher-5564-thread-1) [] o.a.s.c.c.ConnectionManager Waiting up to 30000ms for client to connect to ZooKeeper
2> 461788 INFO (zkConnectionManagerCallback-5566-thread-1) [] o.a.s.c.c.ConnectionManager zkClient has connected
2> 461788 INFO (jetty-launcher-5564-thread-2) [] o.a.s.c.c.ConnectionManager Client is connected to ZooKeeper
2> 461788 WARN (jetty-launcher-5564-thread-2) [] o.a.s.c.c.SolrZkClient Using default ZkACLProvider. DefaultZkACLProvider is not secure, it creates 'OPEN_ACL_UNSAFE' ACLs to Zookeeper nodes
2> 461789 INFO (zkConnectionManagerCallback-5568-thread-1) [] o.a.s.c.c.ConnectionManager zkClient has connected
2> 461789 INFO (jetty-launcher-5564-thread-1) [] o.a.s.c.c.ConnectionManager Client is connected to ZooKeeper
2> 461789 WARN (jetty-launcher-5564-thread-1) [] o.a.s.c.c.SolrZkClient Using default ZkACLProvider. DefaultZkACLProvider is not secure, it creates 'OPEN_ACL_UNSAFE' ACLs to Zookeeper nodes
2> 461789 INFO (jetty-launcher-5564-thread-2) [] o.a.s.c.NodeConfig solr.xml found in ZooKeeper. Loading...
2> 461789 INFO (jetty-launcher-5564-thread-1) [] o.a.s.c.NodeConfig solr.xml found in ZooKeeper. Loading...
2> 461790 INFO (jetty-launcher-5564-thread-2) [] o.a.s.c.SolrXmlConfig Metrics collection is disabled.
2> 461791 INFO (jetty-launcher-5564-thread-1) [] o.a.s.c.SolrXmlConfig Metrics collection is disabled.
2> 461896 INFO (jetty-launcher-5564-thread-2) [] o.a.s.c.ZkContainer Zookeeper client=127.0.0.1:37239/solr
2> 461896 INFO (jetty-launcher-5564-thread-2) [] o.a.s.c.DistributedClusterStateUpdater Creating DistributedClusterStateUpdater with useDistributedStateUpdate=true. Solr will be using distributed cluster state updates.
2> 461896 INFO (jetty-launcher-5564-thread-2) [n:127.0.0.1:42785_solr] o.a.s.c.c.ConnectionManager Waiting up to 30000ms for client to connect to ZooKeeper
2> 461897 INFO (jetty-launcher-5564-thread-1) [] o.a.s.c.ZkContainer Zookeeper client=127.0.0.1:37239/solr
2> 461897 INFO (jetty-launcher-5564-thread-1) [] o.a.s.c.DistributedClusterStateUpdater Creating DistributedClusterStateUpdater with useDistributedStateUpdate=true. Solr will be using distributed cluster state updates.
2> 461898 INFO (jetty-launcher-5564-thread-1) [n:127.0.0.1:45835_solr] o.a.s.c.c.ConnectionManager Waiting up to 30000ms for client to connect to ZooKeeper
2> 461898 INFO (zkConnectionManagerCallback-5585-thread-1) [] o.a.s.c.c.ConnectionManager zkClient has connected
2> 461898 INFO (jetty-launcher-5564-thread-2) [n:127.0.0.1:42785_solr] o.a.s.c.c.ConnectionManager Client is connected to ZooKeeper
2> 461898 INFO (zkConnectionManagerCallback-5588-thread-1) [] o.a.s.c.c.ConnectionManager zkClient has connected
2> 461898 INFO (jetty-launcher-5564-thread-1) [n:127.0.0.1:45835_solr] o.a.s.c.c.ConnectionManager Client is connected to ZooKeeper
2> 461916 WARN (jetty-launcher-5564-thread-1) [n:127.0.0.1:45835_solr] o.a.s.c.ZkController Contents of zookeeper /security.json are world-readable; consider setting up ACLs as described in https://solr.apache.org/guide/solr/latest/deployment-guide/zookeeper-access-control.html
2> 461916 WARN (jetty-launcher-5564-thread-2) [n:127.0.0.1:42785_solr] o.a.s.c.ZkController Contents of zookeeper /security.json are world-readable; consider setting up ACLs as described in https://solr.apache.org/guide/solr/latest/deployment-guide/zookeeper-access-control.html
2> 461918 INFO (jetty-launcher-5564-thread-1) [n:127.0.0.1:45835_solr] o.a.s.c.DistributedClusterStateUpdater Creating DistributedClusterStateUpdater with useDistributedStateUpdate=true. Solr will be using distributed cluster state updates.
2> 461919 INFO (jetty-launcher-5564-thread-2) [n:127.0.0.1:42785_solr] o.a.s.c.DistributedClusterStateUpdater Creating DistributedClusterStateUpdater with useDistributedStateUpdate=true. Solr will be using distributed cluster state updates.
2> 461920 INFO (jetty-launcher-5564-thread-2) [n:127.0.0.1:42785_solr] o.a.s.c.OverseerElectionContext I am going to be the leader 127.0.0.1:42785_solr
2> 461921 INFO (jetty-launcher-5564-thread-1) [n:127.0.0.1:45835_solr] o.a.s.c.ZkController Register node as live in ZooKeeper:/live_nodes/127.0.0.1:45835_solr
2> 461921 INFO (jetty-launcher-5564-thread-2) [n:127.0.0.1:42785_solr] o.a.s.c.Overseer Overseer (id=72077877738799109-127.0.0.1:42785_solr-n_0000000000) starting
2> 461922 INFO (zkCallback-5584-thread-1) [] o.a.s.c.c.ZkStateReader Updated live nodes from ZooKeeper... (0) -> (1)
2> 461923 INFO (zkCallback-5587-thread-1) [] o.a.s.c.c.ZkStateReader Updated live nodes from ZooKeeper... (0) -> (1)
2> 461924 WARN (jetty-launcher-5564-thread-1) [n:127.0.0.1:45835_solr] o.a.s.c.CoreContainer Not all security plugins configured! authentication=disabled authorization=disabled. Solr is only as secure as you make it. Consider configuring authentication/authorization before exposing Solr to users internal or external. See https://s.apache.org/solrsecurity for more info
2> 461926 INFO (OverseerStateUpdate-72077877738799109-127.0.0.1:42785_solr-n_0000000000) [n:127.0.0.1:42785_solr] o.a.s.c.Overseer Starting to work on the main queue : 127.0.0.1:42785_solr
2> 461926 INFO (jetty-launcher-5564-thread-2) [n:127.0.0.1:42785_solr] o.a.s.c.ZkController Publish node=127.0.0.1:42785_solr as DOWN
2> 461934 INFO (jetty-launcher-5564-thread-2) [n:127.0.0.1:42785_solr] o.a.s.c.ZkController Register node as live in ZooKeeper:/live_nodes/127.0.0.1:42785_solr
2> 461935 INFO (zkCallback-5584-thread-1) [] o.a.s.c.c.ZkStateReader Updated live nodes from ZooKeeper... (1) -> (2)
2> 461936 INFO (zkCallback-5587-thread-1) [] o.a.s.c.c.ZkStateReader Updated live nodes from ZooKeeper... (1) -> (2)
2> 461937 WARN (jetty-launcher-5564-thread-2) [n:127.0.0.1:42785_solr] o.a.s.c.CoreContainer Not all security plugins configured! authentication=disabled authorization=disabled. Solr is only as secure as you make it. Consider configuring authentication/authorization before exposing Solr to users internal or external. See https://s.apache.org/solrsecurity for more info
2> 461953 INFO (jetty-launcher-5564-thread-2) [n:127.0.0.1:42785_solr] o.a.s.c.CorePropertiesLocator Found 0 core definitions underneath /home/jenkins/jenkins-slave/workspace/Solr/Solr-Smoketest-9.2/_tmp/smoke_1685910123/unpack/solr-9.2.2/solr/core/build/tmp/tests-tmp/solr.cloud.SplitShardWithNodeRoleTest_EA915EDCE398126-001/tempDir-001/node2
2> 461970 INFO (jetty-launcher-5564-thread-1) [n:127.0.0.1:45835_solr] o.a.s.c.CorePropertiesLocator Found 0 core definitions underneath /home/jenkins/jenkins-slave/workspace/Solr/Solr-Smoketest-9.2/_tmp/smoke_1685910123/unpack/solr-9.2.2/solr/core/build/tmp/tests-tmp/solr.cloud.SplitShardWithNodeRoleTest_EA915EDCE398126-001/tempDir-001/node1
2> 461974 INFO (jetty-launcher-5564-thread-2) [n:127.0.0.1:42785_solr] o.a.s.j.SolrRequestAuthorizer Creating a new SolrRequestAuthorizer
2> 461979 INFO (jetty-launcher-5564-thread-2) [n:127.0.0.1:42785_solr] o.a.s.e.JettySolrRunner Jetty properties: {hostContext=/solr, hostPort=42785, zkHost=127.0.0.1:37239/solr}
2> 461986 INFO (jetty-launcher-5564-thread-1) [n:127.0.0.1:45835_solr] o.a.s.j.SolrRequestAuthorizer Creating a new SolrRequestAuthorizer
2> 461991 INFO (jetty-launcher-5564-thread-1) [n:127.0.0.1:45835_solr] o.a.s.e.JettySolrRunner Jetty properties: {hostContext=/solr, hostPort=45835, zkHost=127.0.0.1:37239/solr}
2> 461992 INFO (SUITE-SplitShardWithNodeRoleTest-seed#[EA915EDCE398126]-worker) [] o.a.s.c.MiniSolrCloudCluster waitForAllNodes: numServers=2
2> 461992 INFO (SUITE-SplitShardWithNodeRoleTest-seed#[EA915EDCE398126]-worker) [] o.a.s.c.MiniSolrCloudCluster waitForNode: 127.0.0.1:42785_solr
2> 461992 WARN (SUITE-SplitShardWithNodeRoleTest-seed#[EA915EDCE398126]-worker) [] o.a.s.c.c.SolrZkClient Using default ZkCredentialsInjector. ZkCredentialsInjector is not secure, it creates an empty list of credentials which leads to 'OPEN_ACL_UNSAFE' ACLs to Zookeeper nodes
2> 461993 INFO (SUITE-SplitShardWithNodeRoleTest-seed#[EA915EDCE398126]-worker) [] o.a.s.c.c.ConnectionManager Waiting up to 15000ms for client to connect to ZooKeeper
2> 461994 INFO (zkConnectionManagerCallback-5604-thread-1) [] o.a.s.c.c.ConnectionManager zkClient has connected
2> 461994 INFO (SUITE-SplitShardWithNodeRoleTest-seed#[EA915EDCE398126]-worker) [] o.a.s.c.c.ConnectionManager Client is connected to ZooKeeper
2> 461994 WARN (SUITE-SplitShardWithNodeRoleTest-seed#[EA915EDCE398126]-worker) [] o.a.s.c.c.SolrZkClient Using default ZkACLProvider. DefaultZkACLProvider is not secure, it creates 'OPEN_ACL_UNSAFE' ACLs to Zookeeper nodes
2> 461995 INFO (SUITE-SplitShardWithNodeRoleTest-seed#[EA915EDCE398126]-worker) [] o.a.s.c.c.ZkStateReader Updated live nodes from ZooKeeper... (0) -> (2)
2> 461996 INFO (SUITE-SplitShardWithNodeRoleTest-seed#[EA915EDCE398126]-worker) [] o.a.s.c.s.i.ZkClientClusterStateProvider Cluster at 127.0.0.1:37239/solr ready
2> 461996 INFO (SUITE-SplitShardWithNodeRoleTest-seed#[EA915EDCE398126]-worker) [] o.a.s.c.MiniSolrCloudCluster waitForNode: 127.0.0.1:45835_solr
2> 461996 WARN (SUITE-SplitShardWithNodeRoleTest-seed#[EA915EDCE398126]-worker) [] o.a.s.c.c.SolrZkClient Using default ZkCredentialsInjector. ZkCredentialsInjector is not secure, it creates an empty list of credentials which leads to 'OPEN_ACL_UNSAFE' ACLs to Zookeeper nodes
2> 461996 INFO (SUITE-SplitShardWithNodeRoleTest-seed#[EA915EDCE398126]-worker) [] o.a.s.c.c.ConnectionManager Waiting up to 45000ms for client to connect to ZooKeeper
2> 461997 INFO (zkConnectionManagerCallback-5606-thread-1) [] o.a.s.c.c.ConnectionManager zkClient has connected
2> 461997 INFO (SUITE-SplitShardWithNodeRoleTest-seed#[EA915EDCE398126]-worker) [] o.a.s.c.c.ConnectionManager Client is connected to ZooKeeper
2> 461997 WARN (SUITE-SplitShardWithNodeRoleTest-seed#[EA915EDCE398126]-worker) [] o.a.s.c.c.SolrZkClient Using default ZkACLProvider. DefaultZkACLProvider is not secure, it creates 'OPEN_ACL_UNSAFE' ACLs to Zookeeper nodes
2> 462101 INFO (SUITE-SplitShardWithNodeRoleTest-seed#[EA915EDCE398126]-worker) [] o.a.s.e.JettySolrRunner Start Jetty (configured port=0, binding port=0)
2> 462101 INFO (SUITE-SplitShardWithNodeRoleTest-seed#[EA915EDCE398126]-worker) [] o.a.s.e.JettySolrRunner Trying to start Jetty on port 0 try number 2 ...
2> 462101 INFO (SUITE-SplitShardWithNodeRoleTest-seed#[EA915EDCE398126]-worker) [] o.e.j.s.Server jetty-10.0.13; built: 2022-12-07T20:13:20.134Z; git: 1c2636ea05c0ca8de1ffd6ca7f3a98ac084c766d; jvm 11.0.16.1+1
2> 462102 INFO (SUITE-SplitShardWithNodeRoleTest-seed#[EA915EDCE398126]-worker) [] o.e.j.s.s.DefaultSessionIdManager Session workerName=node0
2> 462102 INFO (SUITE-SplitShardWithNodeRoleTest-seed#[EA915EDCE398126]-worker) [] o.e.j.s.h.ContextHandler Started o.e.j.s.ServletContextHandler@1ca512cb{/solr,file:///home/jenkins/jenkins-slave/workspace/Solr/Solr-Smoketest-9.2/_tmp/smoke_1685910123/unpack/solr-9.2.2/solr/core/build/tmp/tests-cwd/,AVAILABLE}
2> 462102 INFO (SUITE-SplitShardWithNodeRoleTest-seed#[EA915EDCE398126]-worker) [] o.e.j.s.AbstractConnector Started ServerConnector@52ba8e06{HTTP/1.1, (http/1.1, h2c)}{127.0.0.1:38031}
2> 462103 INFO (SUITE-SplitShardWithNodeRoleTest-seed#[EA915EDCE398126]-worker) [] o.e.j.s.Server Started Server@bf6b8c1{STARTING}[10.0.13,sto=0] @462127ms
2> 462103 ERROR (SUITE-SplitShardWithNodeRoleTest-seed#[EA915EDCE398126]-worker) [] o.a.s.u.StartupLoggingUtils Missing Java Option solr.log.dir. Logging may be missing or incomplete.
2> 462103 INFO (SUITE-SplitShardWithNodeRoleTest-seed#[EA915EDCE398126]-worker) [] o.a.s.s.CoreContainerProvider Using logger factory org.apache.logging.slf4j.Log4jLoggerFactory
2> 462103 INFO (SUITE-SplitShardWithNodeRoleTest-seed#[EA915EDCE398126]-worker) [] o.a.s.s.CoreContainerProvider ___ _ Welcome to Apache Solr™ version 9.2.2
2> 462103 INFO (SUITE-SplitShardWithNodeRoleTest-seed#[EA915EDCE398126]-worker) [] o.a.s.s.CoreContainerProvider / __| ___| |_ _ Starting in cloud mode on port null
2> 462103 INFO (SUITE-SplitShardWithNodeRoleTest-seed#[EA915EDCE398126]-worker) [] o.a.s.s.CoreContainerProvider \__ \/ _ \ | '_| Install dir: /home/jenkins/jenkins-slave/workspace/Solr/Solr-Smoketest-9.2/_tmp/smoke_1685910123/unpack/solr-9.2.2/solr
2> 462103 INFO (SUITE-SplitShardWithNodeRoleTest-seed#[EA915EDCE398126]-worker) [] o.a.s.s.CoreContainerProvider |___/\___/_|_| Start time: 2023-06-04T20:33:41.839220Z
2> 462103 INFO (SUITE-SplitShardWithNodeRoleTest-seed#[EA915EDCE398126]-worker) [] o.a.s.s.CoreContainerProvider Solr Home: /home/jenkins/jenkins-slave/workspace/Solr/Solr-Smoketest-9.2/_tmp/smoke_1685910123/unpack/solr-9.2.2/solr/core/build/tmp/tests-tmp/solr.cloud.SplitShardWithNodeRoleTest_EA915EDCE398126-001/tempDir-001/node3 (source: servlet config: solr.solr.home)
2> 462103 WARN (SUITE-SplitShardWithNodeRoleTest-seed#[EA915EDCE398126]-worker) [] o.a.s.c.c.SolrZkClient Using default ZkCredentialsInjector. ZkCredentialsInjector is not secure, it creates an empty list of credentials which leads to 'OPEN_ACL_UNSAFE' ACLs to Zookeeper nodes
2> 462103 INFO (SUITE-SplitShardWithNodeRoleTest-seed#[EA915EDCE398126]-worker) [] o.a.s.c.c.ConnectionManager Waiting up to 30000ms for client to connect to ZooKeeper
2> 462104 INFO (zkConnectionManagerCallback-5608-thread-1) [] o.a.s.c.c.ConnectionManager zkClient has connected
2> 462104 INFO (SUITE-SplitShardWithNodeRoleTest-seed#[EA915EDCE398126]-worker) [] o.a.s.c.c.ConnectionManager Client is connected to ZooKeeper
2> 462104 WARN (SUITE-SplitShardWithNodeRoleTest-seed#[EA915EDCE398126]-worker) [] o.a.s.c.c.SolrZkClient Using default ZkACLProvider. DefaultZkACLProvider is not secure, it creates 'OPEN_ACL_UNSAFE' ACLs to Zookeeper nodes
2> 462105 INFO (SUITE-SplitShardWithNodeRoleTest-seed#[EA915EDCE398126]-worker) [] o.a.s.c.NodeConfig solr.xml found in ZooKeeper. Loading...
2> 462106 INFO (SUITE-SplitShardWithNodeRoleTest-seed#[EA915EDCE398126]-worker) [] o.a.s.c.SolrXmlConfig Metrics collection is disabled.
2> 462212 INFO (SUITE-SplitShardWithNodeRoleTest-seed#[EA915EDCE398126]-worker) [] o.a.s.c.ZkContainer Zookeeper client=127.0.0.1:37239/solr
2> 462212 INFO (SUITE-SplitShardWithNodeRoleTest-seed#[EA915EDCE398126]-worker) [] o.a.s.c.DistributedClusterStateUpdater Creating DistributedClusterStateUpdater with useDistributedStateUpdate=true. Solr will be using distributed cluster state updates.
2> 462213 INFO (SUITE-SplitShardWithNodeRoleTest-seed#[EA915EDCE398126]-worker) [n:127.0.0.1:38031_solr] o.a.s.c.c.ConnectionManager Waiting up to 30000ms for client to connect to ZooKeeper
2> 462214 INFO (zkConnectionManagerCallback-5618-thread-1) [] o.a.s.c.c.ConnectionManager zkClient has connected
2> 462214 INFO (SUITE-SplitShardWithNodeRoleTest-seed#[EA915EDCE398126]-worker) [n:127.0.0.1:38031_solr] o.a.s.c.c.ConnectionManager Client is connected to ZooKeeper
2> 462219 WARN (SUITE-SplitShardWithNodeRoleTest-seed#[EA915EDCE398126]-worker) [n:127.0.0.1:38031_solr] o.a.s.c.ZkController Contents of zookeeper /security.json are world-readable; consider setting up ACLs as described in https://solr.apache.org/guide/solr/latest/deployment-guide/zookeeper-access-control.html
2> 462219 INFO (SUITE-SplitShardWithNodeRoleTest-seed#[EA915EDCE398126]-worker) [n:127.0.0.1:38031_solr] o.a.s.c.c.ZkStateReader Updated live nodes from ZooKeeper... (0) -> (2)
2> 462221 INFO (SUITE-SplitShardWithNodeRoleTest-seed#[EA915EDCE398126]-worker) [n:127.0.0.1:38031_solr] o.a.s.c.DistributedClusterStateUpdater Creating DistributedClusterStateUpdater with useDistributedStateUpdate=true. Solr will be using distributed cluster state updates.
2> 462221 INFO (SUITE-SplitShardWithNodeRoleTest-seed#[EA915EDCE398126]-worker) [n:127.0.0.1:38031_solr] o.a.s.c.ZkController Publish node=127.0.0.1:38031_solr as DOWN
2> 462222 INFO (SUITE-SplitShardWithNodeRoleTest-seed#[EA915EDCE398126]-worker) [n:127.0.0.1:38031_solr] o.a.s.c.ZkController Register node as live in ZooKeeper:/live_nodes/127.0.0.1:38031_solr
2> 462222 INFO (zkCallback-5587-thread-1) [] o.a.s.c.c.ZkStateReader Updated live nodes from ZooKeeper... (2) -> (3)
2> 462223 INFO (zkCallback-5584-thread-1) [] o.a.s.c.c.ZkStateReader Updated live nodes from ZooKeeper... (2) -> (3)
2> 462223 INFO (zkCallback-5603-thread-1) [] o.a.s.c.c.ZkStateReader Updated live nodes from ZooKeeper... (2) -> (3)
2> 462223 INFO (zkCallback-5617-thread-1) [] o.a.s.c.c.ZkStateReader Updated live nodes from ZooKeeper... (2) -> (3)
2> 462224 WARN (SUITE-SplitShardWithNodeRoleTest-seed#[EA915EDCE398126]-worker) [n:127.0.0.1:38031_solr] o.a.s.c.CoreContainer Not all security plugins configured! authentication=disabled authorization=disabled. Solr is only as secure as you make it. Consider configuring authentication/authorization before exposing Solr to users internal or external. See https://s.apache.org/solrsecurity for more info
2> 462242 INFO (SUITE-SplitShardWithNodeRoleTest-seed#[EA915EDCE398126]-worker) [n:127.0.0.1:38031_solr] o.a.s.c.CorePropertiesLocator Found 0 core definitions underneath /home/jenkins/jenkins-slave/workspace/Solr/Solr-Smoketest-9.2/_tmp/smoke_1685910123/unpack/solr-9.2.2/solr/core/build/tmp/tests-tmp/solr.cloud.SplitShardWithNodeRoleTest_EA915EDCE398126-001/tempDir-001/node3
2> 462258 INFO (SUITE-SplitShardWithNodeRoleTest-seed#[EA915EDCE398126]-worker) [n:127.0.0.1:38031_solr] o.a.s.j.SolrRequestAuthorizer Creating a new SolrRequestAuthorizer
2> 462264 INFO (SUITE-SplitShardWithNodeRoleTest-seed#[EA915EDCE398126]-worker) [n:127.0.0.1:38031_solr] o.a.s.e.JettySolrRunner Jetty properties: {hostContext=/solr, hostPort=38031, zkHost=127.0.0.1:37239/solr}
2> 462270 INFO (SUITE-SplitShardWithNodeRoleTest-seed#[EA915EDCE398126]-worker) [] o.a.s.e.JettySolrRunner Start Jetty (configured port=0, binding port=0)
2> 462270 INFO (SUITE-SplitShardWithNodeRoleTest-seed#[EA915EDCE398126]-worker) [] o.a.s.e.JettySolrRunner Trying to start Jetty on port 0 try number 2 ...
2> 462270 INFO (SUITE-SplitShardWithNodeRoleTest-seed#[EA915EDCE398126]-worker) [] o.e.j.s.Server jetty-10.0.13; built: 2022-12-07T20:13:20.134Z; git: 1c2636ea05c0ca8de1ffd6ca7f3a98ac084c766d; jvm 11.0.16.1+1
2> 462271 INFO (SUITE-SplitShardWithNodeRoleTest-seed#[EA915EDCE398126]-worker) [] o.e.j.s.s.DefaultSessionIdManager Session workerName=node0
2> 462271 INFO (SUITE-SplitShardWithNodeRoleTest-seed#[EA915EDCE398126]-worker) [] o.e.j.s.h.ContextHandler Started o.e.j.s.ServletContextHandler@22ce253{/solr,file:///home/jenkins/jenkins-slave/workspace/Solr/Solr-Smoketest-9.2/_tmp/smoke_1685910123/unpack/solr-9.2.2/solr/core/build/tmp/tests-cwd/,AVAILABLE}
2> 462271 INFO (SUITE-SplitShardWithNodeRoleTest-seed#[EA915EDCE398126]-worker) [] o.e.j.s.AbstractConnector Started ServerConnector@4242d4c8{HTTP/1.1, (http/1.1, h2c)}{127.0.0.1:39505}
2> 462271 INFO (SUITE-SplitShardWithNodeRoleTest-seed#[EA915EDCE398126]-worker) [] o.e.j.s.Server Started Server@52505b96{STARTING}[10.0.13,sto=0] @462295ms
2> 462271 ERROR (SUITE-SplitShardWithNodeRoleTest-seed#[EA915EDCE398126]-worker) [] o.a.s.u.StartupLoggingUtils Missing Java Option solr.log.dir. Logging may be missing or incomplete.
2> 462271 INFO (SUITE-SplitShardWithNodeRoleTest-seed#[EA915EDCE398126]-worker) [] o.a.s.s.CoreContainerProvider Using logger factory org.apache.logging.slf4j.Log4jLoggerFactory
2> 462271 INFO (SUITE-SplitShardWithNodeRoleTest-seed#[EA915EDCE398126]-worker) [] o.a.s.s.CoreContainerProvider ___ _ Welcome to Apache Solr™ version 9.2.2
2> 462271 INFO (SUITE-SplitShardWithNodeRoleTest-seed#[EA915EDCE398126]-worker) [] o.a.s.s.CoreContainerProvider / __| ___| |_ _ Starting in cloud mode on port null
2> 462271 INFO (SUITE-SplitShardWithNodeRoleTest-seed#[EA915EDCE398126]-worker) [] o.a.s.s.CoreContainerProvider \__ \/ _ \ | '_| Install dir: /home/jenkins/jenkins-slave/workspace/Solr/Solr-Smoketest-9.2/_tmp/smoke_1685910123/unpack/solr-9.2.2/solr
2> 462271 INFO (SUITE-SplitShardWithNodeRoleTest-seed#[EA915EDCE398126]-worker) [] o.a.s.s.CoreContainerProvider |___/\___/_|_| Start time: 2023-06-04T20:33:42.007941Z
2> 462272 INFO (SUITE-SplitShardWithNodeRoleTest-seed#[EA915EDCE398126]-worker) [] o.a.s.s.CoreContainerProvider Solr Home: /home/jenkins/jenkins-slave/workspace/Solr/Solr-Smoketest-9.2/_tmp/smoke_1685910123/unpack/solr-9.2.2/solr/core/build/tmp/tests-tmp/solr.cloud.SplitShardWithNodeRoleTest_EA915EDCE398126-001/tempDir-001/node4 (source: servlet config: solr.solr.home)
2> 462272 WARN (SUITE-SplitShardWithNodeRoleTest-seed#[EA915EDCE398126]-worker) [] o.a.s.c.c.SolrZkClient Using default ZkCredentialsInjector. ZkCredentialsInjector is not secure, it creates an empty list of credentials which leads to 'OPEN_ACL_UNSAFE' ACLs to Zookeeper nodes
2> 462272 INFO (SUITE-SplitShardWithNodeRoleTest-seed#[EA915EDCE398126]-worker) [] o.a.s.c.c.ConnectionManager Waiting up to 30000ms for client to connect to ZooKeeper
2> 462273 INFO (zkConnectionManagerCallback-5624-thread-1) [] o.a.s.c.c.ConnectionManager zkClient has connected
2> 462273 INFO (SUITE-SplitShardWithNodeRoleTest-seed#[EA915EDCE398126]-worker) [] o.a.s.c.c.ConnectionManager Client is connected to ZooKeeper
2> 462273 WARN (SUITE-SplitShardWithNodeRoleTest-seed#[EA915EDCE398126]-worker) [] o.a.s.c.c.SolrZkClient Using default ZkACLProvider. DefaultZkACLProvider is not secure, it creates 'OPEN_ACL_UNSAFE' ACLs to Zookeeper nodes
2> 462274 INFO (SUITE-SplitShardWithNodeRoleTest-seed#[EA915EDCE398126]-worker) [] o.a.s.c.NodeConfig solr.xml found in ZooKeeper. Loading...
2> 462275 INFO (SUITE-SplitShardWithNodeRoleTest-seed#[EA915EDCE398126]-worker) [] o.a.s.c.SolrXmlConfig Metrics collection is disabled.
2> 462381 INFO (SUITE-SplitShardWithNodeRoleTest-seed#[EA915EDCE398126]-worker) [] o.a.s.c.ZkContainer Zookeeper client=127.0.0.1:37239/solr
2> 462381 INFO (SUITE-SplitShardWithNodeRoleTest-seed#[EA915EDCE398126]-worker) [] o.a.s.c.DistributedClusterStateUpdater Creating DistributedClusterStateUpdater with useDistributedStateUpdate=true. Solr will be using distributed cluster state updates.
2> 462382 INFO (SUITE-SplitShardWithNodeRoleTest-seed#[EA915EDCE398126]-worker) [n:127.0.0.1:39505_solr] o.a.s.c.c.ConnectionManager Waiting up to 30000ms for client to connect to ZooKeeper
2> 462382 INFO (zkConnectionManagerCallback-5634-thread-1) [] o.a.s.c.c.ConnectionManager zkClient has connected
2> 462383 INFO (SUITE-SplitShardWithNodeRoleTest-seed#[EA915EDCE398126]-worker) [n:127.0.0.1:39505_solr] o.a.s.c.c.ConnectionManager Client is connected to ZooKeeper
2> 462388 WARN (SUITE-SplitShardWithNodeRoleTest-seed#[EA915EDCE398126]-worker) [n:127.0.0.1:39505_solr] o.a.s.c.ZkController Contents of zookeeper /security.json are world-readable; consider setting up ACLs as described in https://solr.apache.org/guide/solr/latest/deployment-guide/zookeeper-access-control.html
2> 462388 INFO (SUITE-SplitShardWithNodeRoleTest-seed#[EA915EDCE398126]-worker) [n:127.0.0.1:39505_solr] o.a.s.c.c.ZkStateReader Updated live nodes from ZooKeeper... (0) -> (3)
2> 462390 INFO (SUITE-SplitShardWithNodeRoleTest-seed#[EA915EDCE398126]-worker) [n:127.0.0.1:39505_solr] o.a.s.c.DistributedClusterStateUpdater Creating DistributedClusterStateUpdater with useDistributedStateUpdate=true. Solr will be using distributed cluster state updates.
2> 462391 INFO (SUITE-SplitShardWithNodeRoleTest-seed#[EA915EDCE398126]-worker) [n:127.0.0.1:39505_solr] o.a.s.c.ZkController Publish node=127.0.0.1:39505_solr as DOWN
2> 462391 INFO (SUITE-SplitShardWithNodeRoleTest-seed#[EA915EDCE398126]-worker) [n:127.0.0.1:39505_solr] o.a.s.c.ZkController Register node as live in ZooKeeper:/live_nodes/127.0.0.1:39505_solr
2> 462392 INFO (zkCallback-5617-thread-1) [] o.a.s.c.c.ZkStateReader Updated live nodes from ZooKeeper... (3) -> (4)
2> 462392 INFO (zkCallback-5584-thread-1) [] o.a.s.c.c.ZkStateReader Updated live nodes from ZooKeeper... (3) -> (4)
2> 462392 INFO (zkCallback-5603-thread-1) [] o.a.s.c.c.ZkStateReader Updated live nodes from ZooKeeper... (3) -> (4)
2> 462392 INFO (zkCallback-5587-thread-1) [] o.a.s.c.c.ZkStateReader Updated live nodes from ZooKeeper... (3) -> (4)
2> 462392 INFO (zkCallback-5633-thread-1) [] o.a.s.c.c.ZkStateReader Updated live nodes from ZooKeeper... (3) -> (4)
2> 462393 WARN (SUITE-SplitShardWithNodeRoleTest-seed#[EA915EDCE398126]-worker) [n:127.0.0.1:39505_solr] o.a.s.c.CoreContainer Not all security plugins configured! authentication=disabled authorization=disabled. Solr is only as secure as you make it. Consider configuring authentication/authorization before exposing Solr to users internal or external. See https://s.apache.org/solrsecurity for more info
2> 462409 INFO (SUITE-SplitShardWithNodeRoleTest-seed#[EA915EDCE398126]-worker) [n:127.0.0.1:39505_solr] o.a.s.c.CorePropertiesLocator Found 0 core definitions underneath /home/jenkins/jenkins-slave/workspace/Solr/Solr-Smoketest-9.2/_tmp/smoke_1685910123/unpack/solr-9.2.2/solr/core/build/tmp/tests-tmp/solr.cloud.SplitShardWithNodeRoleTest_EA915EDCE398126-001/tempDir-001/node4
2> 462425 INFO (SUITE-SplitShardWithNodeRoleTest-seed#[EA915EDCE398126]-worker) [n:127.0.0.1:39505_solr] o.a.s.j.SolrRequestAuthorizer Creating a new SolrRequestAuthorizer
2> 462431 INFO (SUITE-SplitShardWithNodeRoleTest-seed#[EA915EDCE398126]-worker) [n:127.0.0.1:39505_solr] o.a.s.e.JettySolrRunner Jetty properties: {hostContext=/solr, hostPort=39505, zkHost=127.0.0.1:37239/solr}
2> 462432 INFO (SUITE-SplitShardWithNodeRoleTest-seed#[EA915EDCE398126]-worker) [] o.a.s.e.JettySolrRunner Start Jetty (configured port=0, binding port=0)
2> 462432 INFO (SUITE-SplitShardWithNodeRoleTest-seed#[EA915EDCE398126]-worker) [] o.a.s.e.JettySolrRunner Trying to start Jetty on port 0 try number 2 ...
2> 462432 INFO (SUITE-SplitShardWithNodeRoleTest-seed#[EA915EDCE398126]-worker) [] o.e.j.s.Server jetty-10.0.13; built: 2022-12-07T20:13:20.134Z; git: 1c2636ea05c0ca8de1ffd6ca7f3a98ac084c766d; jvm 11.0.16.1+1
2> 462432 INFO (SUITE-SplitShardWithNodeRoleTest-seed#[EA915EDCE398126]-worker) [] o.e.j.s.s.DefaultSessionIdManager Session workerName=node0
2> 462433 INFO (SUITE-SplitShardWithNodeRoleTest-seed#[EA915EDCE398126]-worker) [] o.e.j.s.h.ContextHandler Started o.e.j.s.ServletContextHandler@762a6290{/solr,file:///home/jenkins/jenkins-slave/workspace/Solr/Solr-Smoketest-9.2/_tmp/smoke_1685910123/unpack/solr-9.2.2/solr/core/build/tmp/tests-cwd/,AVAILABLE}
2> 462433 INFO (SUITE-SplitShardWithNodeRoleTest-seed#[EA915EDCE398126]-worker) [] o.e.j.s.AbstractConnector Started ServerConnector@7d949ffc{HTTP/1.1, (http/1.1, h2c)}{127.0.0.1:34489}
2> 462433 INFO (SUITE-SplitShardWithNodeRoleTest-seed#[EA915EDCE398126]-worker) [] o.e.j.s.Server Started Server@30abb1{STARTING}[10.0.13,sto=0] @462457ms
2> 462433 ERROR (SUITE-SplitShardWithNodeRoleTest-seed#[EA915EDCE398126]-worker) [] o.a.s.u.StartupLoggingUtils Missing Java Option solr.log.dir. Logging may be missing or incomplete.
2> 462433 INFO (SUITE-SplitShardWithNodeRoleTest-seed#[EA915EDCE398126]-worker) [] o.a.s.s.CoreContainerProvider Using logger factory org.apache.logging.slf4j.Log4jLoggerFactory
2> 462433 INFO (SUITE-SplitShardWithNodeRoleTest-seed#[EA915EDCE398126]-worker) [] o.a.s.s.CoreContainerProvider ___ _ Welcome to Apache Solr™ version 9.2.2
2> 462433 INFO (SUITE-SplitShardWithNodeRoleTest-seed#[EA915EDCE398126]-worker) [] o.a.s.s.CoreContainerProvider / __| ___| |_ _ Starting in cloud mode on port null
2> 462433 INFO (SUITE-SplitShardWithNodeRoleTest-seed#[EA915EDCE398126]-worker) [] o.a.s.s.CoreContainerProvider \__ \/ _ \ | '_| Install dir: /home/jenkins/jenkins-slave/workspace/Solr/Solr-Smoketest-9.2/_tmp/smoke_1685910123/unpack/solr-9.2.2/solr
2> 462433 INFO (SUITE-SplitShardWithNodeRoleTest-seed#[EA915EDCE398126]-worker) [] o.a.s.s.CoreContainerProvider |___/\___/_|_| Start time: 2023-06-04T20:33:42.169977Z
2> 462434 INFO (SUITE-SplitShardWithNodeRoleTest-seed#[EA915EDCE398126]-worker) [] o.a.s.s.CoreContainerProvider Solr Home: /home/jenkins/jenkins-slave/workspace/Solr/Solr-Smoketest-9.2/_tmp/smoke_1685910123/unpack/solr-9.2.2/solr/core/build/tmp/tests-tmp/solr.cloud.SplitShardWithNodeRoleTest_EA915EDCE398126-001/tempDir-001/node5 (source: servlet config: solr.solr.home)
2> 462434 WARN (SUITE-SplitShardWithNodeRoleTest-seed#[EA915EDCE398126]-worker) [] o.a.s.c.c.SolrZkClient Using default ZkCredentialsInjector. ZkCredentialsInjector is not secure, it creates an empty list of credentials which leads to 'OPEN_ACL_UNSAFE' ACLs to Zookeeper nodes
2> 462434 INFO (SUITE-SplitShardWithNodeRoleTest-seed#[EA915EDCE398126]-worker) [] o.a.s.c.c.ConnectionManager Waiting up to 30000ms for client to connect to ZooKeeper
2> 462435 INFO (zkConnectionManagerCallback-5640-thread-1) [] o.a.s.c.c.ConnectionManager zkClient has connected
2> 462435 INFO (SUITE-SplitShardWithNodeRoleTest-seed#[EA915EDCE398126]-worker) [] o.a.s.c.c.ConnectionManager Client is connected to ZooKeeper
2> 462435 WARN (SUITE-SplitShardWithNodeRoleTest-seed#[EA915EDCE398126]-worker) [] o.a.s.c.c.SolrZkClient Using default ZkACLProvider. DefaultZkACLProvider is not secure, it creates 'OPEN_ACL_UNSAFE' ACLs to Zookeeper nodes
2> 462435 INFO (SUITE-SplitShardWithNodeRoleTest-seed#[EA915EDCE398126]-worker) [] o.a.s.c.NodeConfig solr.xml found in ZooKeeper. Loading...
2> 462437 INFO (SUITE-SplitShardWithNodeRoleTest-seed#[EA915EDCE398126]-worker) [] o.a.s.c.SolrXmlConfig Metrics collection is disabled.
2> 462543 INFO (SUITE-SplitShardWithNodeRoleTest-seed#[EA915EDCE398126]-worker) [] o.a.s.c.ZkContainer Zookeeper client=127.0.0.1:37239/solr
2> 462543 INFO (SUITE-SplitShardWithNodeRoleTest-seed#[EA915EDCE398126]-worker) [] o.a.s.c.DistributedClusterStateUpdater Creating DistributedClusterStateUpdater with useDistributedStateUpdate=true. Solr will be using distributed cluster state updates.
2> 462544 INFO (SUITE-SplitShardWithNodeRoleTest-seed#[EA915EDCE398126]-worker) [n:127.0.0.1:34489_solr] o.a.s.c.c.ConnectionManager Waiting up to 30000ms for client to connect to ZooKeeper
2> 462545 INFO (zkConnectionManagerCallback-5650-thread-1) [] o.a.s.c.c.ConnectionManager zkClient has connected
2> 462545 INFO (SUITE-SplitShardWithNodeRoleTest-seed#[EA915EDCE398126]-worker) [n:127.0.0.1:34489_solr] o.a.s.c.c.ConnectionManager Client is connected to ZooKeeper
2> 462549 WARN (SUITE-SplitShardWithNodeRoleTest-seed#[EA915EDCE398126]-worker) [n:127.0.0.1:34489_solr] o.a.s.c.ZkController Contents of zookeeper /security.json are world-readable; consider setting up ACLs as described in https://solr.apache.org/guide/solr/latest/deployment-guide/zookeeper-access-control.html
2> 462550 INFO (SUITE-SplitShardWithNodeRoleTest-seed#[EA915EDCE398126]-worker) [n:127.0.0.1:34489_solr] o.a.s.c.c.ZkStateReader Updated live nodes from ZooKeeper... (0) -> (4)
2> 462552 INFO (SUITE-SplitShardWithNodeRoleTest-seed#[EA915EDCE398126]-worker) [n:127.0.0.1:34489_solr] o.a.s.c.DistributedClusterStateUpdater Creating DistributedClusterStateUpdater with useDistributedStateUpdate=true. Solr will be using distributed cluster state updates.
2> 462554 INFO (SUITE-SplitShardWithNodeRoleTest-seed#[EA915EDCE398126]-worker) [n:127.0.0.1:34489_solr] o.a.s.c.ZkController Publish node=127.0.0.1:34489_solr as DOWN
2> 462554 INFO (SUITE-SplitShardWithNodeRoleTest-seed#[EA915EDCE398126]-worker) [n:127.0.0.1:34489_solr] o.a.s.c.ZkController Register node as live in ZooKeeper:/live_nodes/127.0.0.1:34489_solr
2> 462555 INFO (zkCallback-5617-thread-1) [] o.a.s.c.c.ZkStateReader Updated live nodes from ZooKeeper... (4) -> (5)
2> 462555 INFO (zkCallback-5587-thread-1) [] o.a.s.c.c.ZkStateReader Updated live nodes from ZooKeeper... (4) -> (5)
2> 462555 INFO (zkCallback-5633-thread-1) [] o.a.s.c.c.ZkStateReader Updated live nodes from ZooKeeper... (4) -> (5)
2> 462555 INFO (zkCallback-5603-thread-1) [] o.a.s.c.c.ZkStateReader Updated live nodes from ZooKeeper... (4) -> (5)
2> 462555 INFO (zkCallback-5584-thread-1) [] o.a.s.c.c.ZkStateReader Updated live nodes from ZooKeeper... (4) -> (5)
2> 462556 INFO (zkCallback-5649-thread-1) [] o.a.s.c.c.ZkStateReader Updated live nodes from ZooKeeper... (4) -> (5)
2> 462557 WARN (SUITE-SplitShardWithNodeRoleTest-seed#[EA915EDCE398126]-worker) [n:127.0.0.1:34489_solr] o.a.s.c.CoreContainer Not all security plugins configured! authentication=disabled authorization=disabled. Solr is only as secure as you make it. Consider configuring authentication/authorization before exposing Solr to users internal or external. See https://s.apache.org/solrsecurity for more info
2> 462573 INFO (SUITE-SplitShardWithNodeRoleTest-seed#[EA915EDCE398126]-worker) [n:127.0.0.1:34489_solr] o.a.s.c.CorePropertiesLocator Found 0 core definitions underneath /home/jenkins/jenkins-slave/workspace/Solr/Solr-Smoketest-9.2/_tmp/smoke_1685910123/unpack/solr-9.2.2/solr/core/build/tmp/tests-tmp/solr.cloud.SplitShardWithNodeRoleTest_EA915EDCE398126-001/tempDir-001/node5
2> 462589 INFO (SUITE-SplitShardWithNodeRoleTest-seed#[EA915EDCE398126]-worker) [n:127.0.0.1:34489_solr] o.a.s.j.SolrRequestAuthorizer Creating a new SolrRequestAuthorizer
2> 462592 INFO (SUITE-SplitShardWithNodeRoleTest-seed#[EA915EDCE398126]-worker) [n:127.0.0.1:34489_solr] o.a.s.c.CoreContainer This node has been started as a preferred overseer
[...truncated too long message...]
closing
2> 508545 INFO (closeThreadPool-5760-thread-2) [] o.a.s.c.Overseer Overseer (id=72077877738799118-127.0.0.1:34489_solr-n_0000000001) closing
2> 508645 INFO (jetty-closer-5741-thread-1) [] o.a.s.c.Overseer Overseer (id=72077877738799109-127.0.0.1:42785_solr-n_0000000000) closing
2> 508647 INFO (jetty-closer-5741-thread-5) [] o.a.s.c.Overseer Overseer (id=72077877738799118-127.0.0.1:34489_solr-n_0000000001) closing
2> 508648 INFO (SUITE-SplitShardWithNodeRoleTest-seed#[EA915EDCE398126]-worker) [] o.a.s.c.ZkTestServer Shutting down ZkTestServer.
2> 508850 WARN (ZkTestServer Run Thread) [] o.a.s.c.ZkTestServer Watch limit violations:
2> Maximum concurrent create/delete watches above limit:
2>
2> 7 /solr/clusterprops.json
2> 7 /solr/aliases.json
2> 6 /solr/packages.json
2> 6 /solr/security.json
2> 5 /solr/collections/coll_NRT_PULL/terms/shard1
2> 4 /solr/collections/coll_NRT_PULL/terms/shard1_0
2> 4 /solr/collections/coll_NRT_PULL/terms/shard1_1
2> 3 /solr/collections/coll_ONLY_NRT/terms/shard1
2> 3 /solr/collections/coll_ONLY_NRT/terms/shard1_0
2> 3 /solr/collections/coll_ONLY_NRT/terms/shard1_1
2> 2 /solr/configs/conf
2>
2> Maximum concurrent data watches above limit:
2>
2> 177 /solr/collections/coll_NRT_PULL/state.json
2> 58 /solr/collections/coll_ONLY_NRT/state.json
2> 2 /solr/overseer_elect/election/72077877738799110-127.0.0.1:45835_solr-n_0000000001
2> 2 /solr/overseer_elect/election/72077877738799109-127.0.0.1:42785_solr-n_0000000000
2> 2 /solr/overseer_elect/election/72077877738799118-127.0.0.1:34489_solr-n_0000000001
2>
2> Maximum concurrent children watches above limit:
2>
2> 57 /solr/collections/coll_NRT_PULL/state.json
2> 45 /solr/live_nodes
2> 24 /solr/collections/coll_ONLY_NRT/state.json
2> 21 /solr/collections
2> 19 /solr/overseer/collection-queue-work
2> 3 /solr/overseer/queue
2> 2 /solr/overseer/queue-work
2>
2> 508854 INFO (SUITE-SplitShardWithNodeRoleTest-seed#[EA915EDCE398126]-worker) [] o.a.s.u.ErrorLogMuter Closing ErrorLogMuter-regex-10599 after mutting 0 log messages
2> 508854 INFO (SUITE-SplitShardWithNodeRoleTest-seed#[EA915EDCE398126]-worker) [] o.a.s.u.ErrorLogMuter Creating ErrorLogMuter-regex-10600 for ERROR logs matching regex: ignore_exception
2> NOTE: leaving temporary files on disk at: /home/jenkins/jenkins-slave/workspace/Solr/Solr-Smoketest-9.2/_tmp/smoke_1685910123/unpack/solr-9.2.2/solr/core/build/tmp/tests-tmp/solr.cloud.SplitShardWithNodeRoleTest_EA915EDCE398126-001
2> NOTE: test params are: codec=DeflateWithPresetCompressingStoredFieldsData(storedFieldsFormat=Lucene90CompressingStoredFieldsFormat(compressionMode=BEST_COMPRESSION, chunkSize=38, maxDocsPerChunk=472, blockShift=8), termVectorsFormat=Lucene90CompressingTermVectorsFormat(compressionMode=BEST_COMPRESSION, chunkSize=38, maxDocsPerChunk=472, blockSize=8)), sim=Asserting(RandomSimilarity(queryNorm=true): {}), locale=fo-FO, timezone=Atlantic/Faeroe
2> NOTE: Linux 4.15.0-212-generic amd64/Eclipse Adoptium 11.0.16.1 (64-bit)/cpus=1,threads=2,free=135048848,total=401080320
2> NOTE: All tests run in this JVM: [AnalysisAfterCoreReloadTest, ConvertedLegacyTest, DisMaxRequestHandlerTest, EchoParamsTest, MinimalSchemaTest, SampleTest, SolrTestCaseJ4DeleteCoreTest, TestCrossCoreJoin, TestDistributedGrouping, TestDistributedSearch, TestGroupingSearch, TestJoin, TestRandomFaceting, TestSolrCoreProperties, TestTrie, PathHierarchyTokenizerFactoryTest, TestCharFilters, TestLuceneMatchVersion, TestWordDelimiterFilterFactory, JerseyResourceTest, TestEmbeddedSolrServerConstructors, ConnectionReuseTest, AddReplicaTest, AssignBackwardCompatibilityTest, BasicDistributedZkTest, ChaosMonkeyNothingIsSafeWithPullReplicasTest, ChaosMonkeySafeLeaderWithPullReplicasTest, CleanupOldIndexTest, ClusterStateMockUtilTest, ClusterStateUpdateTest, CollectionStateZnodeTest, ConcurrentCreateRoutedAliasTest, ConnectionManagerTest, CreateRoutedAliasTest, DeleteLastCustomShardedReplicaTest, DeleteReplicaTest, DeleteStatusTest, DistribDocExpirationUpdateProcessorTest, DistributedApiAsyncTrackerTest, DistributedVersionInfoTest, ForceLeaderTest, FullSolrCloudDistribCmdsTest, HttpPartitionTest, LeaderElectionContextKeyTest, LeaderElectionTest, LeaderFailureAfterFreshStartTest, LeaderVoteWaitTimeoutTest, MissingSegmentRecoveryTest, MultiSolrCloudTestCaseTest, NestedShardedAtomicUpdateTest, NodeRolesTest, OverriddenZkACLAndCredentialsProvidersTest, OverseerModifyCollectionTest, OverseerSolrResponseTest, OverseerTaskQueueTest, PackageManagerCLITest, PeerSyncReplicationTest, RecoveryZkTest, RemoteQueryErrorTest, RestartWhileUpdatingTest, RouteFieldTest, ShardRoutingCustomTest, ShardTermsTest, SolrCLIZkUtilsTest, SolrXmlInZkTest, SplitShardWithNodeRoleTest]
WARNING: Test org.apache.solr.schema.TestCloudSchemaless wrote 13,439,672 bytes of output.
WARNING: Test org.apache.solr.search.facet.TestCloudJSONFacetSKGEquiv wrote 15,898,877 bytes of output.
WARNING: Test org.apache.solr.search.facet.TestCloudJSONFacetSKG wrote 25,352,168 bytes of output.
> Task :solr:benchmark:test
:solr:benchmark:test (SUCCESS): 11 test(s)
> Task :solr:benchmark:wipeTaskTemp
> Task :solr:prometheus-exporter:processResources NO-SOURCE
> Task :solr:prometheus-exporter:classes
> Task :solr:prometheus-exporter:compileTestJava
Note: /home/jenkins/jenkins-slave/workspace/Solr/Solr-Smoketest-9.2/_tmp/smoke_1685910123/unpack/solr-9.2.2/solr/prometheus-exporter/src/test/org/apache/solr/prometheus/exporter/MetricsQueryTemplateTest.java uses or overrides a deprecated API.
Note: Recompile with -Xlint:deprecation for details.
> Task :solr:prometheus-exporter:processTestResources
> Task :solr:prometheus-exporter:testClasses
> Task :solr:prometheus-exporter:test
:solr:prometheus-exporter:test (SUCCESS): 21 test(s)
> Task :solr:prometheus-exporter:wipeTaskTemp
> Task :solr:server:compileJava SKIPPED
> Task :solr:server:processResources NO-SOURCE
> Task :solr:server:classes UP-TO-DATE
> Task :solr:server:compileTestJava NO-SOURCE
> Task :solr:server:processTestResources NO-SOURCE
> Task :solr:server:testClasses UP-TO-DATE
> Task :solr:server:test NO-SOURCE
> Task :solr:server:wipeTaskTemp
> Task :solr:solr-ref-guide:compileJava NO-SOURCE
> Task :solr:solr-ref-guide:processResources NO-SOURCE
> Task :solr:solr-ref-guide:classes UP-TO-DATE
> Task :solr:solr-ref-guide:compileTestJava
Note: Some input files use or override a deprecated API.
Note: Recompile with -Xlint:deprecation for details.
> Task :solr:solr-ref-guide:copySolrjTestResources
> Task :solr:solr-ref-guide:processTestResources NO-SOURCE
> Task :solr:solr-ref-guide:testClasses
> Task :solr:core:test
:solr:core:test (FAILURE): 4652 test(s), 1 failure(s), 200 skipped
4652 tests completed, 1 failed, 200 skipped
> Task :solr:solr-ref-guide:test
:solr:solr-ref-guide:test (SUCCESS): 32 test(s)
> Task :solr:solr-ref-guide:wipeTaskTemp
> Task :solr:core:test FAILED
> Task :solr:core:wipeTaskTemp
> Task :solr:solrj:compileTestJava
Note: Some input files use or override a deprecated API.
Note: Recompile with -Xlint:deprecation for details.
ERROR: The following test(s) have failed:
- org.apache.solr.cloud.SplitShardWithNodeRoleTest.testSolrClusterWithNodeRoleWithPull (:solr:core)
Test output: /home/jenkins/jenkins-slave/workspace/Solr/Solr-Smoketest-9.2/_tmp/smoke_1685910123/unpack/solr-9.2.2/solr/core/build/test-results/test/outputs/OUTPUT-org.apache.solr.cloud.SplitShardWithNodeRoleTest.txt
Reproduce with: gradlew :solr:core:test --tests "org.apache.solr.cloud.SplitShardWithNodeRoleTest.testSolrClusterWithNodeRoleWithPull" -Ptests.jvms=2 "-Ptests.jvmargs=-XX:TieredStopAtLevel=1 -XX:+UseParallelGC -XX:ActiveProcessorCount=1 -XX:ReservedCodeCacheSize=120m" -Ptests.seed=EA915EDCE398126 -Ptests.badapples=false -Ptests.file.encoding=ISO-8859-1
FAILURE: Build failed with an exception.
* What went wrong:
Execution failed for task ':solr:core:test'.
> There were failing tests. See the results at: file:///home/jenkins/jenkins-slave/workspace/Solr/Solr-Smoketest-9.2/_tmp/smoke_1685910123/unpack/solr-9.2.2/solr/core/build/test-results/test/
* Try:
> Run with --stacktrace option to get the stack trace.
> Run with --info or --debug option to get more log output.
* Get more help at https://help.gradle.org
BUILD FAILED in 34m 55s
41 actionable tasks: 28 executed, 13 up-to-date
Publishing build scan...
https://ge.apache.org/s/oensrtea4p6vg
Traceback (most recent call last):
File "dev-tools/scripts/smokeTestRelease.py", line 1162, in <module>
main()
File "dev-tools/scripts/smokeTestRelease.py", line 1093, in main
downloadOnly=c.download_only)
File "dev-tools/scripts/smokeTestRelease.py", line 1150, in smokeTest
unpackAndVerify(java, tmpDir, 'solr-%s-src.tgz' % version, gitRevision, version, testArgs)
File "dev-tools/scripts/smokeTestRelease.py", line 548, in unpackAndVerify
verifyUnpacked(java, artifact, unpackPath, gitRevision, version, testArgs)
File "dev-tools/scripts/smokeTestRelease.py", line 636, in verifyUnpacked
java.run_java11('./gradlew --no-daemon test %s' % testArgs, '%s/test.log' % unpackPath)
File "dev-tools/scripts/smokeTestRelease.py", line 1002, in run_java
run('%s; %s' % (cmd_prefix, cmd), logfile)
File "dev-tools/scripts/smokeTestRelease.py", line 480, in run
raise RuntimeError('command "%s" failed; see log file %s' % (command, logPath))
RuntimeError: command "export JAVA_HOME="/home/jenkins/tools/java/latest11" PATH="/home/jenkins/tools/java/latest11/bin:$PATH" JAVACMD="/home/jenkins/tools/java/latest11/bin/java"; ./gradlew --no-daemon test -Dtests.nightly=false -Dtests.badapples=false " failed; see log file /home/jenkins/jenkins-slave/workspace/Solr/Solr-Smoketest-9.2/_tmp/smoke_1685910123/unpack/solr-9.2.2/test.log
Build step 'Run with timeout' marked build as failure
Email was triggered for: Failure - Any
Sending email for trigger: Failure - Any