You are viewing a plain text version of this content. The canonical link for it is here.
Posted to builds@cassandra.apache.org by Apache Jenkins Server <je...@builds.apache.org> on 2023/12/12 21:20:43 UTC
Build complete: Cassandra-trunk #1809 [UNSTABLE] 901786ec27f726305ba665056a868b37d9cb3e38
-------------------------------------------------------------------------------
Build Cassandra-trunk #1809 Still Unstable
URL: https://ci-cassandra.apache.org/job/Cassandra-trunk/1809/
-------------------------------------------------------------------------------
Changes:
[Marcus Eriksson] Avoid race inserting new data in compaction_history during truncation in SystemKeyspaceMigrator41Test.testMigrateCompactionHistory
-------------------------------------------------------------------------------
Failed Tests:
7 tests failed.
FAILED: dtest-offheap.materialized_views_test.TestMaterializedViews.test_view_metadata_cleanup
FAILED: dtest-offheap.cqlsh_tests.test_cqlsh_copy.TestCqlshCopy.test_bulk_round_trip_with_timeouts
FAILED: dtest-offheap.materialized_views_test.TestMaterializedViews.test_complex_mv_select_statements
FAILED: dtest-upgrade.upgrade_tests.cql_tests.TestCQLNodes3RF3_Upgrade_current_4_1_x_To_indev_trunk.test_npe_composite_table_slice
FAILED: org.apache.cassandra.service.StartupChecksTest.checkReadAheadKbSettingCheck-oa_jdk11_x86_64
FAILED: org.apache.cassandra.index.sasi.disk.OnDiskIndexTest.testSparseMode-trie_jdk17_x86_64
FAILED: org.apache.cassandra.simulator.test.ShortPaxosSimulationTest.simulationTest-_jdk11_x86_64
-------------------------------------------------------------------------------
For complete test report and logs see https://nightlies.apache.org/cassandra/Cassandra-trunk/1809/