You are viewing a plain text version of this content. The canonical link for it is here.
Posted to dev@zookeeper.apache.org by Apache Jenkins Server <je...@builds.apache.org> on 2017/02/16 01:33:21 UTC
ZooKeeper-trunk-jdk8 - Build # 945 - Still Failing
See https://builds.apache.org/job/ZooKeeper-trunk-jdk8/945/
###################################################################################
########################## LAST 60 LINES OF THE CONSOLE ###########################
[...truncated 474758 lines...]
[junit] java.net.ConnectException: Connection refused
[junit] at sun.nio.ch.SocketChannelImpl.checkConnect(Native Method)
[junit] at sun.nio.ch.SocketChannelImpl.finishConnect(SocketChannelImpl.java:717)
[junit] at org.apache.zookeeper.ClientCnxnSocketNIO.doTransport(ClientCnxnSocketNIO.java:357)
[junit] at org.apache.zookeeper.ClientCnxn$SendThread.run(ClientCnxn.java:1214)
[junit] 2017-02-16 01:32:52,323 [myid:127.0.0.1:30073] - INFO [main-SendThread(127.0.0.1:30073):ClientCnxn$SendThread@1113] - Opening socket connection to server 127.0.0.1/127.0.0.1:30073. Will not attempt to authenticate using SASL (unknown error)
[junit] 2017-02-16 01:32:52,324 [myid:127.0.0.1:30073] - WARN [main-SendThread(127.0.0.1:30073):ClientCnxn$SendThread@1235] - Session 0x25c0a2ec50000 for server 127.0.0.1/127.0.0.1:30073, unexpected error, closing socket connection and attempting reconnect
[junit] java.net.ConnectException: Connection refused
[junit] at sun.nio.ch.SocketChannelImpl.checkConnect(Native Method)
[junit] at sun.nio.ch.SocketChannelImpl.finishConnect(SocketChannelImpl.java:717)
[junit] at org.apache.zookeeper.ClientCnxnSocketNIO.doTransport(ClientCnxnSocketNIO.java:357)
[junit] at org.apache.zookeeper.ClientCnxn$SendThread.run(ClientCnxn.java:1214)
[junit] 2017-02-16 01:32:53,417 [myid:127.0.0.1:30073] - INFO [main-SendThread(127.0.0.1:30073):ClientCnxn$SendThread@1113] - Opening socket connection to server 127.0.0.1/127.0.0.1:30073. Will not attempt to authenticate using SASL (unknown error)
[junit] 2017-02-16 01:32:53,417 [myid:127.0.0.1:30073] - WARN [main-SendThread(127.0.0.1:30073):ClientCnxn$SendThread@1235] - Session 0x25c0a2ec50001 for server 127.0.0.1/127.0.0.1:30073, unexpected error, closing socket connection and attempting reconnect
[junit] java.net.ConnectException: Connection refused
[junit] at sun.nio.ch.SocketChannelImpl.checkConnect(Native Method)
[junit] at sun.nio.ch.SocketChannelImpl.finishConnect(SocketChannelImpl.java:717)
[junit] at org.apache.zookeeper.ClientCnxnSocketNIO.doTransport(ClientCnxnSocketNIO.java:357)
[junit] at org.apache.zookeeper.ClientCnxn$SendThread.run(ClientCnxn.java:1214)
[junit] 2017-02-16 01:32:54,069 [myid:127.0.0.1:30073] - INFO [main-SendThread(127.0.0.1:30073):ClientCnxn$SendThread@1113] - Opening socket connection to server 127.0.0.1/127.0.0.1:30073. Will not attempt to authenticate using SASL (unknown error)
[junit] 2017-02-16 01:32:54,070 [myid:127.0.0.1:30073] - WARN [main-SendThread(127.0.0.1:30073):ClientCnxn$SendThread@1235] - Session 0x25c0a2ec50000 for server 127.0.0.1/127.0.0.1:30073, unexpected error, closing socket connection and attempting reconnect
[junit] java.net.ConnectException: Connection refused
[junit] at sun.nio.ch.SocketChannelImpl.checkConnect(Native Method)
[junit] at sun.nio.ch.SocketChannelImpl.finishConnect(SocketChannelImpl.java:717)
[junit] at org.apache.zookeeper.ClientCnxnSocketNIO.doTransport(ClientCnxnSocketNIO.java:357)
[junit] at org.apache.zookeeper.ClientCnxn$SendThread.run(ClientCnxn.java:1214)
[junit] 2017-02-16 01:32:55,209 [myid:127.0.0.1:30073] - INFO [main-SendThread(127.0.0.1:30073):ClientCnxn$SendThread@1113] - Opening socket connection to server 127.0.0.1/127.0.0.1:30073. Will not attempt to authenticate using SASL (unknown error)
[junit] 2017-02-16 01:32:55,209 [myid:127.0.0.1:30073] - INFO [main-SendThread(127.0.0.1:30073):ClientCnxn$SendThread@1113] - Opening socket connection to server 127.0.0.1/127.0.0.1:30073. Will not attempt to authenticate using SASL (unknown error)
[junit] 2017-02-16 01:32:55,209 [myid:127.0.0.1:30073] - WARN [main-SendThread(127.0.0.1:30073):ClientCnxn$SendThread@1235] - Session 0x25c0a2ec50001 for server 127.0.0.1/127.0.0.1:30073, unexpected error, closing socket connection and attempting reconnect
[junit] java.net.ConnectException: Connection refused
[junit] at sun.nio.ch.SocketChannelImpl.checkConnect(Native Method)
[junit] at sun.nio.ch.SocketChannelImpl.finishConnect(SocketChannelImpl.java:717)
[junit] at org.apache.zookeeper.ClientCnxnSocketNIO.doTransport(ClientCnxnSocketNIO.java:357)
[junit] at org.apache.zookeeper.ClientCnxn$SendThread.run(ClientCnxn.java:1214)
[junit] 2017-02-16 01:32:55,209 [myid:127.0.0.1:30073] - WARN [main-SendThread(127.0.0.1:30073):ClientCnxn$SendThread@1235] - Session 0x25c0a2ec50000 for server 127.0.0.1/127.0.0.1:30073, unexpected error, closing socket connection and attempting reconnect
[junit] java.net.ConnectException: Connection refused
[junit] at sun.nio.ch.SocketChannelImpl.checkConnect(Native Method)
[junit] at sun.nio.ch.SocketChannelImpl.finishConnect(SocketChannelImpl.java:717)
[junit] at org.apache.zookeeper.ClientCnxnSocketNIO.doTransport(ClientCnxnSocketNIO.java:357)
[junit] at org.apache.zookeeper.ClientCnxn$SendThread.run(ClientCnxn.java:1214)
[junit] Running org.apache.zookeeper.server.quorum.StandaloneDisabledTest in thread 8
[junit] Tests run: 1, Failures: 0, Errors: 1, Skipped: 0, Time elapsed: 0 sec, Thread: 8, Class: org.apache.zookeeper.server.quorum.StandaloneDisabledTest
[junit] Test org.apache.zookeeper.server.quorum.StandaloneDisabledTest FAILED (timeout)
[junit] Running org.apache.zookeeper.server.quorum.Zab1_0Test in thread 6
[junit] Tests run: 1, Failures: 0, Errors: 1, Skipped: 0, Time elapsed: 0 sec, Thread: 6, Class: org.apache.zookeeper.server.quorum.Zab1_0Test
[junit] Test org.apache.zookeeper.server.quorum.Zab1_0Test FAILED (timeout)
fail.build.on.test.failure:
BUILD FAILED
/home/jenkins/jenkins-slave/workspace/ZooKeeper-trunk-jdk8/build.xml:1212: The following error occurred while executing this line:
/home/jenkins/jenkins-slave/workspace/ZooKeeper-trunk-jdk8/build.xml:1216: Tests failed!
Total time: 17 minutes 10 seconds
Build step 'Invoke Ant' marked build as failure
[WARNINGS] Skipping publisher since build result is FAILURE
Recording test results
Email was triggered for: Failure - Any
Sending email for trigger: Failure - Any
###################################################################################
############################## FAILED TESTS (if any) ##############################
2 tests failed.
FAILED: org.apache.zookeeper.server.quorum.StandaloneDisabledTest.startSingleServerTest
Error Message:
Timeout occurred. Please note the time in the report does not reflect the time until the timeout.
Stack Trace:
junit.framework.AssertionFailedError: Timeout occurred. Please note the time in the report does not reflect the time until the timeout.
at java.lang.Thread.run(Thread.java:745)
FAILED: org.apache.zookeeper.server.quorum.Zab1_0Test.testNormalObserverRun
Error Message:
Timeout occurred. Please note the time in the report does not reflect the time until the timeout.
Stack Trace:
junit.framework.AssertionFailedError: Timeout occurred. Please note the time in the report does not reflect the time until the timeout.
at java.lang.Thread.run(Thread.java:745)
ZooKeeper-trunk-jdk8 - Build # 947 - Still Failing
Posted by Apache Jenkins Server <je...@builds.apache.org>.
See https://builds.apache.org/job/ZooKeeper-trunk-jdk8/947/
###################################################################################
########################## LAST 60 LINES OF THE CONSOLE ###########################
[...truncated 485246 lines...]
[junit] 2017-02-17 11:55:01,293 [myid:] - INFO [main:MBeanRegistry@128] - Unregister MBean [org.apache.ZooKeeperService:name0=StandaloneServer_port30319,name1=InMemoryDataTree]
[junit] 2017-02-17 11:55:01,293 [myid:] - INFO [main:MBeanRegistry@128] - Unregister MBean [org.apache.ZooKeeperService:name0=StandaloneServer_port30319]
[junit] 2017-02-17 11:55:01,303 [myid:] - INFO [main:FourLetterWordMain@85] - connecting to 127.0.0.1 30319
[junit] 2017-02-17 11:55:01,304 [myid:] - INFO [main:JMXEnv@146] - ensureOnly:[]
[junit] 2017-02-17 11:55:01,316 [myid:] - INFO [main:ClientBase@583] - fdcount after test is: 7718 at start it was 7718
[junit] 2017-02-17 11:55:01,316 [myid:] - INFO [main:ZKTestCase$1@65] - SUCCEEDED testWatcherAutoResetWithLocal
[junit] 2017-02-17 11:55:01,316 [myid:] - INFO [main:ZKTestCase$1@60] - FINISHED testWatcherAutoResetWithLocal
[junit] Tests run: 103, Failures: 0, Errors: 0, Skipped: 0, Time elapsed: 482.289 sec, Thread: 8, Class: org.apache.zookeeper.test.NettyNettySuiteTest
[junit] 2017-02-17 11:55:01,419 [myid:127.0.0.1:14041] - INFO [main-SendThread(127.0.0.1:14041):ClientCnxn$SendThread@1113] - Opening socket connection to server 127.0.0.1/127.0.0.1:14041. Will not attempt to authenticate using SASL (unknown error)
[junit] 2017-02-17 11:55:01,420 [myid:127.0.0.1:14041] - WARN [main-SendThread(127.0.0.1:14041):ClientCnxn$SendThread@1235] - Session 0x202771bf8e70000 for server 127.0.0.1/127.0.0.1:14041, unexpected error, closing socket connection and attempting reconnect
[junit] java.net.ConnectException: Connection refused
[junit] at sun.nio.ch.SocketChannelImpl.checkConnect(Native Method)
[junit] at sun.nio.ch.SocketChannelImpl.finishConnect(SocketChannelImpl.java:717)
[junit] at org.apache.zookeeper.ClientCnxnSocketNIO.doTransport(ClientCnxnSocketNIO.java:357)
[junit] at org.apache.zookeeper.ClientCnxn$SendThread.run(ClientCnxn.java:1214)
[junit] 2017-02-17 11:55:01,830 [myid:127.0.0.1:30073] - INFO [main-SendThread(127.0.0.1:30073):ClientCnxn$SendThread@1113] - Opening socket connection to server 127.0.0.1/127.0.0.1:30073. Will not attempt to authenticate using SASL (unknown error)
[junit] 2017-02-17 11:55:01,832 [myid:] - INFO [New I/O boss #98:ClientCnxnSocketNetty$1@127] - future isn't success, cause: {}
[junit] java.net.ConnectException: Connection refused: 127.0.0.1/127.0.0.1:30073
[junit] at sun.nio.ch.SocketChannelImpl.checkConnect(Native Method)
[junit] at sun.nio.ch.SocketChannelImpl.finishConnect(SocketChannelImpl.java:717)
[junit] at org.jboss.netty.channel.socket.nio.NioClientBoss.connect(NioClientBoss.java:152)
[junit] at org.jboss.netty.channel.socket.nio.NioClientBoss.processSelectedKeys(NioClientBoss.java:105)
[junit] at org.jboss.netty.channel.socket.nio.NioClientBoss.process(NioClientBoss.java:79)
[junit] at org.jboss.netty.channel.socket.nio.AbstractNioSelector.run(AbstractNioSelector.java:337)
[junit] at org.jboss.netty.channel.socket.nio.NioClientBoss.run(NioClientBoss.java:42)
[junit] at org.jboss.netty.util.ThreadRenamingRunnable.run(ThreadRenamingRunnable.java:108)
[junit] at org.jboss.netty.util.internal.DeadLockProofWorker$1.run(DeadLockProofWorker.java:42)
[junit] at java.util.concurrent.ThreadPoolExecutor.runWorker(ThreadPoolExecutor.java:1142)
[junit] at java.util.concurrent.ThreadPoolExecutor$Worker.run(ThreadPoolExecutor.java:617)
[junit] at java.lang.Thread.run(Thread.java:745)
[junit] 2017-02-17 11:55:01,832 [myid:] - WARN [New I/O boss #98:ClientCnxnSocketNetty$ZKClientHandler@439] - Exception caught: [id: 0x07b3a06f] EXCEPTION: java.net.ConnectException: Connection refused: 127.0.0.1/127.0.0.1:30073
[junit] java.net.ConnectException: Connection refused: 127.0.0.1/127.0.0.1:30073
[junit] at sun.nio.ch.SocketChannelImpl.checkConnect(Native Method)
[junit] at sun.nio.ch.SocketChannelImpl.finishConnect(SocketChannelImpl.java:717)
[junit] at org.jboss.netty.channel.socket.nio.NioClientBoss.connect(NioClientBoss.java:152)
[junit] at org.jboss.netty.channel.socket.nio.NioClientBoss.processSelectedKeys(NioClientBoss.java:105)
[junit] at org.jboss.netty.channel.socket.nio.NioClientBoss.process(NioClientBoss.java:79)
[junit] at org.jboss.netty.channel.socket.nio.AbstractNioSelector.run(AbstractNioSelector.java:337)
[junit] at org.jboss.netty.channel.socket.nio.NioClientBoss.run(NioClientBoss.java:42)
[junit] at org.jboss.netty.util.ThreadRenamingRunnable.run(ThreadRenamingRunnable.java:108)
[junit] at org.jboss.netty.util.internal.DeadLockProofWorker$1.run(DeadLockProofWorker.java:42)
[junit] at java.util.concurrent.ThreadPoolExecutor.runWorker(ThreadPoolExecutor.java:1142)
[junit] at java.util.concurrent.ThreadPoolExecutor$Worker.run(ThreadPoolExecutor.java:617)
[junit] at java.lang.Thread.run(Thread.java:745)
[junit] 2017-02-17 11:55:01,832 [myid:] - INFO [New I/O boss #98:ClientCnxnSocketNetty@208] - channel is told closing
[junit] 2017-02-17 11:55:01,832 [myid:127.0.0.1:30073] - INFO [main-SendThread(127.0.0.1:30073):ClientCnxn$SendThread@1231] - channel for sessionid 0x102771820b90000 is lost, closing socket connection and attempting reconnect
fail.build.on.test.failure:
BUILD FAILED
/home/jenkins/jenkins-slave/workspace/ZooKeeper-trunk-jdk8/build.xml:1212: The following error occurred while executing this line:
/home/jenkins/jenkins-slave/workspace/ZooKeeper-trunk-jdk8/build.xml:1216: Tests failed!
Total time: 10 minutes 58 seconds
Build step 'Invoke Ant' marked build as failure
[WARNINGS] Skipping publisher since build result is FAILURE
Recording test results
Email was triggered for: Failure - Any
Sending email for trigger: Failure - Any
###################################################################################
############################## FAILED TESTS (if any) ##############################
1 tests failed.
FAILED: org.apache.zookeeper.test.ReadOnlyModeTest.testSessionEstablishment
Error Message:
KeeperErrorCode = ConnectionLoss for /test
Stack Trace:
org.apache.zookeeper.KeeperException$ConnectionLossException: KeeperErrorCode = ConnectionLoss for /test
at org.apache.zookeeper.KeeperException.create(KeeperException.java:99)
at org.apache.zookeeper.KeeperException.create(KeeperException.java:51)
at org.apache.zookeeper.ZooKeeper.create(ZooKeeper.java:1424)
at org.apache.zookeeper.test.ReadOnlyModeTest.testSessionEstablishment(ReadOnlyModeTest.java:238)
at org.apache.zookeeper.JUnit4ZKTestRunner$LoggedInvokeMethod.evaluate(JUnit4ZKTestRunner.java:79)
at java.util.concurrent.FutureTask.run(FutureTask.java:266)
at java.lang.Thread.run(Thread.java:745)
ZooKeeper-trunk-jdk8 - Build # 946 - Still Failing
Posted by Apache Jenkins Server <je...@builds.apache.org>.
See https://builds.apache.org/job/ZooKeeper-trunk-jdk8/946/
###################################################################################
########################## LAST 60 LINES OF THE CONSOLE ###########################
[...truncated 526618 lines...]
[junit] java.net.ConnectException: Connection refused
[junit] at sun.nio.ch.SocketChannelImpl.checkConnect(Native Method)
[junit] at sun.nio.ch.SocketChannelImpl.finishConnect(SocketChannelImpl.java:717)
[junit] at org.apache.zookeeper.ClientCnxnSocketNIO.doTransport(ClientCnxnSocketNIO.java:357)
[junit] at org.apache.zookeeper.ClientCnxn$SendThread.run(ClientCnxn.java:1214)
[junit] 2017-02-16 11:57:07,309 [myid:127.0.0.1:14038] - INFO [main-SendThread(127.0.0.1:14038):ClientCnxn$SendThread@1113] - Opening socket connection to server 127.0.0.1/127.0.0.1:14038. Will not attempt to authenticate using SASL (unknown error)
[junit] 2017-02-16 11:57:07,310 [myid:127.0.0.1:14038] - WARN [main-SendThread(127.0.0.1:14038):ClientCnxn$SendThread@1235] - Session 0x1025e50312f0000 for server 127.0.0.1/127.0.0.1:14038, unexpected error, closing socket connection and attempting reconnect
[junit] java.net.ConnectException: Connection refused
[junit] at sun.nio.ch.SocketChannelImpl.checkConnect(Native Method)
[junit] at sun.nio.ch.SocketChannelImpl.finishConnect(SocketChannelImpl.java:717)
[junit] at org.apache.zookeeper.ClientCnxnSocketNIO.doTransport(ClientCnxnSocketNIO.java:357)
[junit] at org.apache.zookeeper.ClientCnxn$SendThread.run(ClientCnxn.java:1214)
[junit] 2017-02-16 11:57:07,316 [myid:127.0.0.1:13915] - INFO [main-SendThread(127.0.0.1:13915):ClientCnxn$SendThread@1113] - Opening socket connection to server 127.0.0.1/127.0.0.1:13915. Will not attempt to authenticate using SASL (unknown error)
[junit] 2017-02-16 11:57:07,316 [myid:127.0.0.1:13915] - WARN [main-SendThread(127.0.0.1:13915):ClientCnxn$SendThread@1235] - Session 0x1025e4b95a20000 for server 127.0.0.1/127.0.0.1:13915, unexpected error, closing socket connection and attempting reconnect
[junit] java.net.ConnectException: Connection refused
[junit] at sun.nio.ch.SocketChannelImpl.checkConnect(Native Method)
[junit] at sun.nio.ch.SocketChannelImpl.finishConnect(SocketChannelImpl.java:717)
[junit] at org.apache.zookeeper.ClientCnxnSocketNIO.doTransport(ClientCnxnSocketNIO.java:357)
[junit] at org.apache.zookeeper.ClientCnxn$SendThread.run(ClientCnxn.java:1214)
[junit] 2017-02-16 11:57:07,659 [myid:] - INFO [ProcessThread(sid:0 cport:14161)::PrepRequestProcessor@617] - Processed session termination for sessionid: 0x1025e53419c0000
[junit] 2017-02-16 11:57:07,680 [myid:] - INFO [main:ZooKeeper@1324] - Session: 0x1025e53419c0000 closed
[junit] 2017-02-16 11:57:07,680 [myid:] - INFO [main-EventThread:ClientCnxn$EventThread@513] - EventThread shut down for session: 0x1025e53419c0000
[junit] 2017-02-16 11:57:07,680 [myid:] - INFO [SyncThread:0:MBeanRegistry@128] - Unregister MBean [org.apache.ZooKeeperService:name0=StandaloneServer_port14161,name1=Connections,name2=127.0.0.1,name3=0x1025e53419c0000]
[junit] 2017-02-16 11:57:07,681 [myid:] - INFO [main:JUnit4ZKTestRunner$LoggedInvokeMethod@82] - Memory used 166607
[junit] 2017-02-16 11:57:07,681 [myid:] - INFO [main:JUnit4ZKTestRunner$LoggedInvokeMethod@87] - Number of threads 1644
[junit] 2017-02-16 11:57:07,681 [myid:] - INFO [main:JUnit4ZKTestRunner$LoggedInvokeMethod@102] - FINISHED TEST METHOD testWatcherAutoResetWithLocal
[junit] 2017-02-16 11:57:07,681 [myid:] - INFO [main:ClientBase@558] - tearDown starting
[junit] 2017-02-16 11:57:07,681 [myid:] - INFO [main:ClientBase@528] - STOPPING server
[junit] 2017-02-16 11:57:07,681 [myid:] - INFO [main:NettyServerCnxnFactory@464] - shutdown called 0.0.0.0/0.0.0.0:14161
[junit] 2017-02-16 11:57:07,685 [myid:] - INFO [main:ZooKeeperServer@542] - shutting down
[junit] 2017-02-16 11:57:07,685 [myid:] - ERROR [main:ZooKeeperServer@506] - ZKShutdownHandler is not registered, so ZooKeeper server won't take any action on ERROR or SHUTDOWN server state changes
[junit] 2017-02-16 11:57:07,685 [myid:] - INFO [main:SessionTrackerImpl@232] - Shutting down
[junit] 2017-02-16 11:57:07,685 [myid:] - INFO [main:PrepRequestProcessor@1008] - Shutting down
[junit] 2017-02-16 11:57:07,686 [myid:] - INFO [main:SyncRequestProcessor@191] - Shutting down
[junit] 2017-02-16 11:57:07,686 [myid:] - INFO [ProcessThread(sid:0 cport:14161)::PrepRequestProcessor@157] - PrepRequestProcessor exited loop!
[junit] 2017-02-16 11:57:07,686 [myid:] - INFO [SyncThread:0:SyncRequestProcessor@169] - SyncRequestProcessor exited!
[junit] 2017-02-16 11:57:07,686 [myid:] - INFO [main:FinalRequestProcessor@481] - shutdown of request processor complete
[junit] 2017-02-16 11:57:07,686 [myid:] - INFO [main:MBeanRegistry@128] - Unregister MBean [org.apache.ZooKeeperService:name0=StandaloneServer_port14161,name1=InMemoryDataTree]
[junit] 2017-02-16 11:57:07,686 [myid:] - INFO [main:MBeanRegistry@128] - Unregister MBean [org.apache.ZooKeeperService:name0=StandaloneServer_port14161]
[junit] 2017-02-16 11:57:07,686 [myid:] - INFO [main:FourLetterWordMain@85] - connecting to 127.0.0.1 14161
[junit] 2017-02-16 11:57:07,687 [myid:] - INFO [main:JMXEnv@146] - ensureOnly:[]
[junit] 2017-02-16 11:57:07,691 [myid:] - INFO [main:ClientBase@583] - fdcount after test is: 4842 at start it was 4838
[junit] 2017-02-16 11:57:07,691 [myid:] - INFO [main:ClientBase@585] - sleeping for 20 secs
[junit] 2017-02-16 11:57:07,691 [myid:] - INFO [main:ZKTestCase$1@65] - SUCCEEDED testWatcherAutoResetWithLocal
[junit] 2017-02-16 11:57:07,691 [myid:] - INFO [main:ZKTestCase$1@60] - FINISHED testWatcherAutoResetWithLocal
[junit] Tests run: 103, Failures: 0, Errors: 0, Skipped: 0, Time elapsed: 509.239 sec, Thread: 2, Class: org.apache.zookeeper.test.NioNettySuiteTest
fail.build.on.test.failure:
BUILD FAILED
/home/jenkins/jenkins-slave/workspace/ZooKeeper-trunk-jdk8/build.xml:1212: The following error occurred while executing this line:
/home/jenkins/jenkins-slave/workspace/ZooKeeper-trunk-jdk8/build.xml:1216: Tests failed!
Total time: 13 minutes 5 seconds
Build step 'Invoke Ant' marked build as failure
[WARNINGS] Skipping publisher since build result is FAILURE
Recording test results
Email was triggered for: Failure - Any
Sending email for trigger: Failure - Any
###################################################################################
############################## FAILED TESTS (if any) ##############################
1 tests failed.
FAILED: org.apache.zookeeper.test.ReconfigTest.testPortChange
Error Message:
null
Stack Trace:
junit.framework.AssertionFailedError
at org.apache.zookeeper.test.ReconfigTest.testPortChange(ReconfigTest.java:681)
at org.apache.zookeeper.JUnit4ZKTestRunner$LoggedInvokeMethod.evaluate(JUnit4ZKTestRunner.java:79)