You are viewing a plain text version of this content. The canonical link for it is here.
Posted to dev@lucene.apache.org by Apache Jenkins Server <je...@builds.apache.org> on 2012/02/27 04:46:59 UTC

[JENKINS] Lucene-Solr-tests-only-trunk-java7 - Build # 1812 - Failure

Build: https://builds.apache.org/job/Lucene-Solr-tests-only-trunk-java7/1812/

1 tests failed.
REGRESSION:  org.apache.lucene.search.TestSimpleExplanations.testCSQ3

Error Message:
java.lang.AssertionError: org.apache.lucene.search.TestSimpleExplanations.testCSQ3: Insane FieldCache usage(s) found expected:<0> but was:<1>

Stack Trace:
java.lang.RuntimeException: java.lang.AssertionError: org.apache.lucene.search.TestSimpleExplanations.testCSQ3: Insane FieldCache usage(s) found expected:<0> but was:<1>
	at org.apache.lucene.util.LuceneTestCase.tearDownInternal(LuceneTestCase.java:780)
	at org.apache.lucene.util.LuceneTestCase.access$1000(LuceneTestCase.java:138)
	at org.apache.lucene.util.LuceneTestCase$InternalSetupTeardownRule$1.evaluate(LuceneTestCase.java:607)
	at org.apache.lucene.util.LuceneTestCase$TestResultInterceptorRule$1.evaluate(LuceneTestCase.java:511)
	at org.apache.lucene.util.LuceneTestCase$RememberThreadRule$1.evaluate(LuceneTestCase.java:569)
	at org.apache.lucene.util.LuceneTestCaseRunner.runChild(LuceneTestCaseRunner.java:165)
	at org.apache.lucene.util.LuceneTestCaseRunner.runChild(LuceneTestCaseRunner.java:57)
	at org.apache.lucene.util.LuceneTestCase.assertSaneFieldCaches(LuceneTestCase.java:907)
	at org.apache.lucene.util.LuceneTestCase.tearDownInternal(LuceneTestCase.java:770)




Build Log (for compile errors):
[...truncated 1946 lines...]



[JENKINS] Lucene-Solr-tests-only-trunk-java7 - Build # 1813 - Still Failing

Posted by Apache Jenkins Server <je...@builds.apache.org>.
Build: https://builds.apache.org/job/Lucene-Solr-tests-only-trunk-java7/1813/

1 tests failed.
REGRESSION:  org.apache.lucene.search.TestSloppyPhraseQuery2.testRepetitiveIncreasingSloppiness3WithHoles

Error Message:
null

Stack Trace:
junit.framework.AssertionFailedError
	at org.apache.lucene.util.LuceneTestCaseRunner.runChild(LuceneTestCaseRunner.java:165)
	at org.apache.lucene.util.LuceneTestCaseRunner.runChild(LuceneTestCaseRunner.java:57)
	at org.apache.lucene.search.SearchEquivalenceTestBase.assertSubsetOf(SearchEquivalenceTestBase.java:204)
	at org.apache.lucene.search.SearchEquivalenceTestBase.assertSubsetOf(SearchEquivalenceTestBase.java:159)
	at org.apache.lucene.search.TestSloppyPhraseQuery2.testRepetitiveIncreasingSloppiness3WithHoles(TestSloppyPhraseQuery2.java:171)
	at org.apache.lucene.util.LuceneTestCase$SubclassSetupTeardownRule$1.evaluate(LuceneTestCase.java:707)
	at org.apache.lucene.util.LuceneTestCase$InternalSetupTeardownRule$1.evaluate(LuceneTestCase.java:606)
	at org.apache.lucene.util.LuceneTestCase$TestResultInterceptorRule$1.evaluate(LuceneTestCase.java:511)
	at org.apache.lucene.util.LuceneTestCase$RememberThreadRule$1.evaluate(LuceneTestCase.java:569)




Build Log (for compile errors):
[...truncated 1901 lines...]