You are viewing a plain text version of this content. The canonical link for it is here.
Posted to builds@cassandra.apache.org by Apache Jenkins Server <je...@builds.apache.org> on 2026/05/13 04:59:24 UTC

Build complete: Cassandra-trunk #2481 [FAILURE] 0625a4d525b8b1cf02c9345f3ba26ca40430ff6a

-------------------------------------------------------------------------------
  Build Cassandra-trunk #2481 Still Failing
  URL: https://ci-cassandra.apache.org/job/Cassandra-trunk/2481/
  -------------------------------------------------------------------------------
  Changes:
  No changes

  -------------------------------------------------------------------------------
  Failed Tests:
  4179 tests failed.
FAILED:  dtest-large.snitch_test.TestDynamicEndpointSnitch.Tests / dtest-large jdk21 6/6 / test_multidatacenter_local_quorum
FAILED:  junit.framework.TestSuite.Tests / test-latest jdk11 1/20 / org.apache.cassandra.audit.AuditLogEntryTest-latest_jdk11_x86_64
FAILED:  junit.framework.TestSuite.Tests / test-latest jdk17 1/20 / org.apache.cassandra.audit.AuditLogEntryTest-latest_jdk17_x86_64
FAILED:  junit.framework.TestSuite.Tests / test-latest jdk21 1/20 / org.apache.cassandra.audit.AuditLogEntryTest-latest_jdk21_x86_64
FAILED:  junit.framework.TestSuite.Tests / test-latest jdk11 3/20 / org.apache.cassandra.audit.AuditLoggerAuthTest-latest_jdk11_x86_64
FAILED:  junit.framework.TestSuite.Tests / test-latest jdk11 3/20 / org.apache.cassandra.audit.AuditLoggerAuthTest-latest_jdk11_x86_64
FAILED:  junit.framework.TestSuite.Tests / test-latest jdk17 3/20 / org.apache.cassandra.audit.AuditLoggerAuthTest-latest_jdk17_x86_64
FAILED:  junit.framework.TestSuite.Tests / test-latest jdk17 3/20 / org.apache.cassandra.audit.AuditLoggerAuthTest-latest_jdk17_x86_64
FAILED:  junit.framework.TestSuite.Tests / test-latest jdk21 3/20 / org.apache.cassandra.audit.AuditLoggerAuthTest-latest_jdk21_x86_64
FAILED:  junit.framework.TestSuite.Tests / test-latest jdk21 3/20 / org.apache.cassandra.audit.AuditLoggerAuthTest-latest_jdk21_x86_64
FAILED:  junit.framework.TestSuite.Tests / test-latest jdk11 5/20 / org.apache.cassandra.audit.AuditLoggerTest-latest_jdk11_x86_64
FAILED:  junit.framework.TestSuite.Tests / test-latest jdk17 5/20 / org.apache.cassandra.audit.AuditLoggerTest-latest_jdk17_x86_64
FAILED:  junit.framework.TestSuite.Tests / test-latest jdk21 5/20 / org.apache.cassandra.audit.AuditLoggerTest-latest_jdk21_x86_64
FAILED:  junit.framework.TestSuite.Tests / test-latest jdk11 7/20 / org.apache.cassandra.audit.BinAuditLoggerTest-latest_jdk11_x86_64
FAILED:  junit.framework.TestSuite.Tests / test-latest jdk17 7/20 / org.apache.cassandra.audit.BinAuditLoggerTest-latest_jdk17_x86_64
FAILED:  junit.framework.TestSuite.Tests / test-latest jdk21 7/20 / org.apache.cassandra.audit.BinAuditLoggerTest-latest_jdk21_x86_64
FAILED:  junit.framework.TestSuite.Tests / test-latest jdk11 9/20 / org.apache.cassandra.auth.AllowAllCIDRAuthorizerTest-latest_jdk11_x86_64
FAILED:  junit.framework.TestSuite.Tests / test-latest jdk17 9/20 / org.apache.cassandra.auth.AllowAllCIDRAuthorizerTest-latest_jdk17_x86_64
FAILED:  junit.framework.TestSuite.Tests / test-latest jdk21 9/20 / org.apache.cassandra.auth.AllowAllCIDRAuthorizerTest-latest_jdk21_x86_64
FAILED:  junit.framework.TestSuite.Tests / test-latest jdk11 12/20 / org.apache.cassandra.auth.AuthPropertiesTest-latest_jdk11_x86_64
FAILED:  junit.framework.TestSuite.Tests / test-latest jdk17 12/20 / org.apache.cassandra.auth.AuthPropertiesTest-latest_jdk17_x86_64
FAILED:  junit.framework.TestSuite.Tests / test-latest jdk21 12/20 / org.apache.cassandra.auth.AuthPropertiesTest-latest_jdk21_x86_64
FAILED:  junit.framework.TestSuite.Tests / test-latest jdk11 1/20 / org.apache.cassandra.auth.CIDRGroupsMappingManagerTest-latest_jdk11_x86_64
FAILED:  junit.framework.TestSuite.Tests / test-latest jdk17 1/20 / org.apache.cassandra.auth.CIDRGroupsMappingManagerTest-latest_jdk17_x86_64
FAILED:  junit.framework.TestSuite.Tests / test-latest jdk21 1/20 / org.apache.cassandra.auth.CIDRGroupsMappingManagerTest-latest_jdk21_x86_64
FAILED:  junit.framework.TestSuite.Tests / test-latest jdk11 14/20 / org.apache.cassandra.auth.CassandraAuthorizerTest-latest_jdk11_x86_64
FAILED:  junit.framework.TestSuite.Tests / test-latest jdk17 14/20 / org.apache.cassandra.auth.CassandraAuthorizerTest-latest_jdk17_x86_64
FAILED:  junit.framework.TestSuite.Tests / test-latest jdk21 14/20 / org.apache.cassandra.auth.CassandraAuthorizerTest-latest_jdk21_x86_64
FAILED:  junit.framework.TestSuite.Tests / test-latest jdk11 15/20 / org.apache.cassandra.auth.CassandraAuthorizerTruncatingTest-latest_jdk11_x86_64
FAILED:  junit.framework.TestSuite.Tests / test-latest jdk17 15/20 / org.apache.cassandra.auth.CassandraAuthorizerTruncatingTest-latest_jdk17_x86_64
FAILED:  junit.framework.TestSuite.Tests / test-latest jdk21 15/20 / org.apache.cassandra.auth.CassandraAuthorizerTruncatingTest-latest_jdk21_x86_64
FAILED:  junit.framework.TestSuite.Tests / test-latest jdk11 16/20 / org.apache.cassandra.auth.CassandraCIDRAuthorizerEnforceModeTest-latest_jdk11_x86_64
FAILED:  junit.framework.TestSuite.Tests / test-latest jdk17 16/20 / org.apache.cassandra.auth.CassandraCIDRAuthorizerEnforceModeTest-latest_jdk17_x86_64
FAILED:  junit.framework.TestSuite.Tests / test-latest jdk21 16/20 / org.apache.cassandra.auth.CassandraCIDRAuthorizerEnforceModeTest-latest_jdk21_x86_64
FAILED:  junit.framework.TestSuite.Tests / test-latest jdk11 17/20 / org.apache.cassandra.auth.CassandraCIDRAuthorizerMonitorModeTest-latest_jdk11_x86_64
FAILED:  junit.framework.TestSuite.Tests / test-latest jdk17 17/20 / org.apache.cassandra.auth.CassandraCIDRAuthorizerMonitorModeTest-latest_jdk17_x86_64
FAILED:  junit.framework.TestSuite.Tests / test-latest jdk21 17/20 / org.apache.cassandra.auth.CassandraCIDRAuthorizerMonitorModeTest-latest_jdk21_x86_64
FAILED:  junit.framework.TestSuite.Tests / test-latest jdk11 18/20 / org.apache.cassandra.auth.CassandraNetworkAuthorizerTest-latest_jdk11_x86_64
FAILED:  junit.framework.TestSuite.Tests / test-latest jdk17 18/20 / org.apache.cassandra.auth.CassandraNetworkAuthorizerTest-latest_jdk17_x86_64
FAILED:  junit.framework.TestSuite.Tests / test-latest jdk21 18/20 / org.apache.cassandra.auth.CassandraNetworkAuthorizerTest-latest_jdk21_x86_64
FAILED:  junit.framework.TestSuite.Tests / test-latest jdk11 19/20 / org.apache.cassandra.auth.CassandraRoleManagerTest-latest_jdk11_x86_64
FAILED:  junit.framework.TestSuite.Tests / test-latest jdk17 19/20 / org.apache.cassandra.auth.CassandraRoleManagerTest-latest_jdk17_x86_64
FAILED:  junit.framework.TestSuite.Tests / test-latest jdk21 19/20 / org.apache.cassandra.auth.CassandraRoleManagerTest-latest_jdk21_x86_64
FAILED:  junit.framework.TestSuite.Tests / test-latest jdk11 3/20 / org.apache.cassandra.auth.CreateAndAlterRoleTest-latest_jdk11_x86_64
FAILED:  junit.framework.TestSuite.Tests / test-latest jdk17 3/20 / org.apache.cassandra.auth.CreateAndAlterRoleTest-latest_jdk17_x86_64
FAILED:  junit.framework.TestSuite.Tests / test-latest jdk21 3/20 / org.apache.cassandra.auth.CreateAndAlterRoleTest-latest_jdk21_x86_64
FAILED:  junit.framework.TestSuite.Tests / test-latest jdk11 6/20 / org.apache.cassandra.auth.GrantAndRevokeTest-latest_jdk11_x86_64
FAILED:  junit.framework.TestSuite.Tests / test-latest jdk17 6/20 / org.apache.cassandra.auth.GrantAndRevokeTest-latest_jdk17_x86_64
FAILED:  junit.framework.TestSuite.Tests / test-latest jdk21 6/20 / org.apache.cassandra.auth.GrantAndRevokeTest-latest_jdk21_x86_64
FAILED:  junit.framework.TestSuite.Tests / test-latest jdk11 11/20 / org.apache.cassandra.auth.MutualTlsAuthenticatorTest-latest_jdk11_x86_64
FAILED:  junit.framework.TestSuite.Tests / test-latest jdk17 11/20 / org.apache.cassandra.auth.MutualTlsAuthenticatorTest-latest_jdk17_x86_64
FAILED:  junit.framework.TestSuite.Tests / test-latest jdk21 11/20 / org.apache.cassandra.auth.MutualTlsAuthenticatorTest-latest_jdk21_x86_64
FAILED:  junit.framework.TestSuite.Tests / test-latest jdk11 15/20 / org.apache.cassandra.auth.MutualTlsWithPasswordFallbackAuthenticatorTest-latest_jdk11_x86_64
FAILED:  junit.framework.TestSuite.Tests / test-latest jdk17 15/20 / org.apache.cassandra.auth.MutualTlsWithPasswordFallbackAuthenticatorTest-latest_jdk17_x86_64
FAILED:  junit.framework.TestSuite.Tests / test-latest jdk21 15/20 / org.apache.cassandra.auth.MutualTlsWithPasswordFallbackAuthenticatorTest-latest_jdk21_x86_64
FAILED:  junit.framework.TestSuite.Tests / test-latest jdk11 16/20 / org.apache.cassandra.auth.PasswordAuthenticatorTest-latest_jdk11_x86_64
FAILED:  junit.framework.TestSuite.Tests / test-latest jdk17 16/20 / org.apache.cassandra.auth.PasswordAuthenticatorTest-latest_jdk17_x86_64
FAILED:  junit.framework.TestSuite.Tests / test-latest jdk21 16/20 / org.apache.cassandra.auth.PasswordAuthenticatorTest-latest_jdk21_x86_64
FAILED:  junit.framework.TestSuite.Tests / test-latest jdk11 19/20 / org.apache.cassandra.auth.RolesTest-latest_jdk11_x86_64
FAILED:  junit.framework.TestSuite.Tests / test-latest jdk17 19/20 / org.apache.cassandra.auth.RolesTest-latest_jdk17_x86_64
FAILED:  junit.framework.TestSuite.Tests / test-latest jdk21 19/20 / org.apache.cassandra.auth.RolesTest-latest_jdk21_x86_64
FAILED:  junit.framework.TestSuite.Tests / test-latest jdk11 1/20 / org.apache.cassandra.auth.TxnAuthTest-latest_jdk11_x86_64
FAILED:  junit.framework.TestSuite.Tests / test-latest jdk17 1/20 / org.apache.cassandra.auth.TxnAuthTest-latest_jdk17_x86_64
FAILED:  junit.framework.TestSuite.Tests / test-latest jdk21 1/20 / org.apache.cassandra.auth.TxnAuthTest-latest_jdk21_x86_64
FAILED:  junit.framework.TestSuite.Tests / test-latest jdk11 8/20 / org.apache.cassandra.auth.jmx.AuthorizationProxyTest-latest_jdk11_x86_64
FAILED:  junit.framework.TestSuite.Tests / test-latest jdk17 8/20 / org.apache.cassandra.auth.jmx.AuthorizationProxyTest-latest_jdk17_x86_64
FAILED:  junit.framework.TestSuite.Tests / test-latest jdk21 8/20 / org.apache.cassandra.auth.jmx.AuthorizationProxyTest-latest_jdk21_x86_64
FAILED:  junit.framework.TestSuite.Tests / test-latest jdk11 9/20 / org.apache.cassandra.auth.jmx.JMXAuthJMXServerOptionsTest-latest_jdk11_x86_64
FAILED:  junit.framework.TestSuite.Tests / test-latest jdk17 9/20 / org.apache.cassandra.auth.jmx.JMXAuthJMXServerOptionsTest-latest_jdk17_x86_64
FAILED:  junit.framework.TestSuite.Tests / test-latest jdk21 9/20 / org.apache.cassandra.auth.jmx.JMXAuthJMXServerOptionsTest-latest_jdk21_x86_64
FAILED:  junit.framework.TestSuite.Tests / test-latest jdk11 10/20 / org.apache.cassandra.auth.jmx.JMXAuthSystemPropertiesTest-latest_jdk11_x86_64
FAILED:  junit.framework.TestSuite.Tests / test-latest jdk17 10/20 / org.apache.cassandra.auth.jmx.JMXAuthSystemPropertiesTest-latest_jdk17_x86_64
FAILED:  junit.framework.TestSuite.Tests / test-latest jdk21 10/20 / org.apache.cassandra.auth.jmx.JMXAuthSystemPropertiesTest-latest_jdk21_x86_64
FAILED:  junit.framework.TestSuite.Tests / test-latest jdk11 2/20 / org.apache.cassandra.batchlog.BatchlogEndpointFilterTest-latest_jdk11_x86_64
FAILED:  junit.framework.TestSuite.Tests / test-latest jdk17 2/20 / org.apache.cassandra.batchlog.BatchlogEndpointFilterTest-latest_jdk17_x86_64
FAILED:  junit.framework.TestSuite.Tests / test-latest jdk21 2/20 / org.apache.cassandra.batchlog.BatchlogEndpointFilterTest-latest_jdk21_x86_64
FAILED:  junit.framework.TestSuite.Tests / test-latest jdk11 3/20 / org.apache.cassandra.batchlog.BatchlogManagerTest-latest_jdk11_x86_64
FAILED:  junit.framework.TestSuite.Tests / test-latest jdk17 3/20 / org.apache.cassandra.batchlog.BatchlogManagerTest-latest_jdk17_x86_64
FAILED:  junit.framework.TestSuite.Tests / test-latest jdk21 3/20 / org.apache.cassandra.batchlog.BatchlogManagerTest-latest_jdk21_x86_64
FAILED:  junit.framework.TestSuite.Tests / test-latest jdk11 4/20 / org.apache.cassandra.batchlog.BatchlogTest-latest_jdk11_x86_64
FAILED:  junit.framework.TestSuite.Tests / test-latest jdk17 4/20 / org.apache.cassandra.batchlog.BatchlogTest-latest_jdk17_x86_64
FAILED:  junit.framework.TestSuite.Tests / test-latest jdk21 4/20 / org.apache.cassandra.batchlog.BatchlogTest-latest_jdk21_x86_64
FAILED:  junit.framework.TestSuite.Tests / test-latest jdk11 5/20 / org.apache.cassandra.cache.AutoSavingCacheTest-latest_jdk11_x86_64
FAILED:  junit.framework.TestSuite.Tests / test-latest jdk17 5/20 / org.apache.cassandra.cache.AutoSavingCacheTest-latest_jdk17_x86_64
FAILED:  junit.framework.TestSuite.Tests / test-latest jdk21 5/20 / org.apache.cassandra.cache.AutoSavingCacheTest-latest_jdk21_x86_64
FAILED:  junit.framework.TestSuite.Tests / test-latest jdk11 6/20 / org.apache.cassandra.cache.CacheProviderTest-latest_jdk11_x86_64
FAILED:  junit.framework.TestSuite.Tests / test-latest jdk17 6/20 / org.apache.cassandra.cache.CacheProviderTest-latest_jdk17_x86_64
FAILED:  junit.framework.TestSuite.Tests / test-latest jdk21 6/20 / org.apache.cassandra.cache.CacheProviderTest-latest_jdk21_x86_64
FAILED:  junit.framework.TestSuite.Tests / test-latest jdk11 9/20 / org.apache.cassandra.concurrent.DebuggableScheduledThreadPoolExecutorTest-latest_jdk11_x86_64
FAILED:  junit.framework.TestSuite.Tests / test-latest jdk17 9/20 / org.apache.cassandra.concurrent.DebuggableScheduledThreadPoolExecutorTest-latest_jdk17_x86_64
FAILED:  junit.framework.TestSuite.Tests / test-latest jdk21 9/20 / org.apache.cassandra.concurrent.DebuggableScheduledThreadPoolExecutorTest-latest_jdk21_x86_64
FAILED:  junit.framework.TestSuite.Tests / test-latest jdk11 10/20 / org.apache.cassandra.concurrent.DebuggableThreadPoolExecutorTest-latest_jdk11_x86_64
FAILED:  junit.framework.TestSuite.Tests / test-latest jdk17 10/20 / org.apache.cassandra.concurrent.DebuggableThreadPoolExecutorTest-latest_jdk17_x86_64
FAILED:  junit.framework.TestSuite.Tests / test-latest jdk21 10/20 / org.apache.cassandra.concurrent.DebuggableThreadPoolExecutorTest-latest_jdk21_x86_64
FAILED:  junit.framework.TestSuite.Tests / test-latest jdk11 15/20 / org.apache.cassandra.concurrent.SEPExecutorTest-latest_jdk11_x86_64
FAILED:  junit.framework.TestSuite.Tests / test-latest jdk17 15/20 / org.apache.cassandra.concurrent.SEPExecutorTest-latest_jdk17_x86_64
FAILED:  junit.framework.TestSuite.Tests / test-latest jdk21 15/20 / org.apache.cassandra.concurrent.SEPExecutorTest-latest_jdk21_x86_64
FAILED:  junit.framework.TestSuite.Tests / test-latest jdk11 1/20 / org.apache.cassandra.config.DatabaseDescriptorTest-latest_jdk11_x86_64
FAILED:  junit.framework.TestSuite.Tests / test-latest jdk17 1/20 / org.apache.cassandra.config.DatabaseDescriptorTest-latest_jdk17_x86_64
FAILED:  junit.framework.TestSuite.Tests / test-latest jdk21 1/20 / org.apache.cassandra.config.DatabaseDescriptorTest-latest_jdk21_x86_64
FAILED:  junit.framework.TestSuite.Tests / test-latest jdk11 12/20 / org.apache.cassandra.config.ParseAndConvertUnitsTest-latest_jdk11_x86_64
FAILED:  junit.framework.TestSuite.Tests / test-latest jdk17 12/20 / org.apache.cassandra.config.ParseAndConvertUnitsTest-latest_jdk17_x86_64
FAILED:  junit.framework.TestSuite.Tests / test-latest jdk21 12/20 / org.apache.cassandra.config.ParseAndConvertUnitsTest-latest_jdk21_x86_64
FAILED:  junit.framework.TestSuite.Tests / test-latest jdk11 17/20 / org.apache.cassandra.constraints.AlterTableWithTableConstraintValidationTest-latest_jdk11_x86_64
FAILED:  junit.framework.TestSuite.Tests / test-latest jdk17 17/20 / org.apache.cassandra.constraints.AlterTableWithTableConstraintValidationTest-latest_jdk17_x86_64
FAILED:  junit.framework.TestSuite.Tests / test-latest jdk21 17/20 / org.apache.cassandra.constraints.AlterTableWithTableConstraintValidationTest-latest_jdk21_x86_64
FAILED:  junit.framework.TestSuite.Tests / test-latest jdk11 2/20 / org.apache.cassandra.constraints.CreateTableWithColumnCqlConstraintValidationTest-latest_jdk11_x86_64
FAILED:  junit.framework.TestSuite.Tests / test-latest jdk17 2/20 / org.apache.cassandra.constraints.CreateTableWithColumnCqlConstraintValidationTest-latest_jdk17_x86_64
FAILED:  junit.framework.TestSuite.Tests / test-latest jdk21 2/20 / org.apache.cassandra.constraints.CreateTableWithColumnCqlConstraintValidationTest-latest_jdk21_x86_64
FAILED:  junit.framework.TestSuite.Tests / test-latest jdk11 3/20 / org.apache.cassandra.constraints.CreateTableWithColumnNotNullConstraintInvalidTest-latest_jdk11_x86_64
FAILED:  junit.framework.TestSuite.Tests / test-latest jdk17 3/20 / org.apache.cassandra.constraints.CreateTableWithColumnNotNullConstraintInvalidTest-latest_jdk17_x86_64
FAILED:  junit.framework.TestSuite.Tests / test-latest jdk21 3/20 / org.apache.cassandra.constraints.CreateTableWithColumnNotNullConstraintInvalidTest-latest_jdk21_x86_64
FAILED:  junit.framework.TestSuite.Tests / test-latest jdk11 4/20 / org.apache.cassandra.constraints.CreateTableWithColumnNotNullConstraintValidTest-latest_jdk11_x86_64
FAILED:  junit.framework.TestSuite.Tests / test-latest jdk17 4/20 / org.apache.cassandra.constraints.CreateTableWithColumnNotNullConstraintValidTest-latest_jdk17_x86_64
FAILED:  junit.framework.TestSuite.Tests / test-latest jdk21 4/20 / org.apache.cassandra.constraints.CreateTableWithColumnNotNullConstraintValidTest-latest_jdk21_x86_64
FAILED:  junit.framework.TestSuite.Tests / test-latest jdk11 5/20 / org.apache.cassandra.constraints.CreateTableWithColumnOctetLengthConstraintValidationTest-latest_jdk11_x86_64
FAILED:  junit.framework.TestSuite.Tests / test-latest jdk17 5/20 / org.apache.cassandra.constraints.CreateTableWithColumnOctetLengthConstraintValidationTest-latest_jdk17_x86_64
FAILED:  junit.framework.TestSuite.Tests / test-latest jdk21 5/20 / org.apache.cassandra.constraints.CreateTableWithColumnOctetLengthConstraintValidationTest-latest_jdk21_x86_64
FAILED:  junit.framework.TestSuite.Tests / test-latest jdk11 10/20 / org.apache.cassandra.cql3.AlterSchemaStatementNoOpTest-latest_jdk11_x86_64
FAILED:  junit.framework.TestSuite.Tests / test-latest jdk17 10/20 / org.apache.cassandra.cql3.AlterSchemaStatementNoOpTest-latest_jdk17_x86_64
FAILED:  junit.framework.TestSuite.Tests / test-latest jdk21 10/20 / org.apache.cassandra.cql3.AlterSchemaStatementNoOpTest-latest_jdk21_x86_64
FAILED:  junit.framework.TestSuite.Tests / test-latest jdk11 11/20 / org.apache.cassandra.cql3.AlterSchemaStatementTest-latest_jdk11_x86_64
FAILED:  junit.framework.TestSuite.Tests / test-latest jdk17 11/20 / org.apache.cassandra.cql3.AlterSchemaStatementTest-latest_jdk17_x86_64
FAILED:  junit.framework.TestSuite.Tests / test-latest jdk21 11/20 / org.apache.cassandra.cql3.AlterSchemaStatementTest-latest_jdk21_x86_64
FAILED:  junit.framework.TestSuite.Tests / test-latest jdk11 15/20 / org.apache.cassandra.cql3.BatchTest-latest_jdk11_x86_64
FAILED:  junit.framework.TestSuite.Tests / test-latest jdk17 15/20 / org.apache.cassandra.cql3.BatchTest-latest_jdk17_x86_64
FAILED:  junit.framework.TestSuite.Tests / test-latest jdk21 15/20 / org.apache.cassandra.cql3.BatchTest-latest_jdk21_x86_64
FAILED:  junit.framework.TestSuite.Tests / test-latest jdk11 16/20 / org.apache.cassandra.cql3.CDCStatementTest-latest_jdk11_x86_64
FAILED:  junit.framework.TestSuite.Tests / test-latest jdk17 16/20 / org.apache.cassandra.cql3.CDCStatementTest-latest_jdk17_x86_64
FAILED:  junit.framework.TestSuite.Tests / test-latest jdk21 16/20 / org.apache.cassandra.cql3.CDCStatementTest-latest_jdk21_x86_64
FAILED:  junit.framework.TestSuite.Tests / test-latest jdk11 3/20 / org.apache.cassandra.cql3.CQLTesterTest-latest_jdk11_x86_64
FAILED:  junit.framework.TestSuite.Tests / test-latest jdk17 3/20 / org.apache.cassandra.cql3.CQLTesterTest-latest_jdk17_x86_64
FAILED:  junit.framework.TestSuite.Tests / test-latest jdk21 3/20 / org.apache.cassandra.cql3.CQLTesterTest-latest_jdk21_x86_64
FAILED:  junit.framework.TestSuite.Tests / test-latest jdk11 19/20 / org.apache.cassandra.cql3.ColumnSpecificationTest-latest_jdk11_x86_64
FAILED:  junit.framework.TestSuite.Tests / test-latest jdk17 19/20 / org.apache.cassandra.cql3.ColumnSpecificationTest-latest_jdk17_x86_64
FAILED:  junit.framework.TestSuite.Tests / test-latest jdk21 19/20 / org.apache.cassandra.cql3.ColumnSpecificationTest-latest_jdk21_x86_64
FAILED:  junit.framework.TestSuite.Tests / test-latest jdk11 20/20 / org.apache.cassandra.cql3.CommentAndSecurityLabelClientTest-latest_jdk11_x86_64
FAILED:  junit.framework.TestSuite.Tests / test-latest jdk17 20/20 / org.apache.cassandra.cql3.CommentAndSecurityLabelClientTest-latest_jdk17_x86_64
FAILED:  junit.framework.TestSuite.Tests / test-latest jdk21 20/20 / org.apache.cassandra.cql3.CommentAndSecurityLabelClientTest-latest_jdk21_x86_64
FAILED:  junit.framework.TestSuite.Tests / test-latest jdk11 4/20 / org.apache.cassandra.cql3.CustomNowInSecondsTest-latest_jdk11_x86_64
FAILED:  junit.framework.TestSuite.Tests / test-latest jdk17 4/20 / org.apache.cassandra.cql3.CustomNowInSecondsTest-latest_jdk17_x86_64
FAILED:  junit.framework.TestSuite.Tests / test-latest jdk21 4/20 / org.apache.cassandra.cql3.CustomNowInSecondsTest-latest_jdk21_x86_64
FAILED:  junit.framework.TestSuite.Tests / test-latest jdk11 5/20 / org.apache.cassandra.cql3.DecoratedKeyPrefixesTest-latest_jdk11_x86_64
FAILED:  junit.framework.TestSuite.Tests / test-latest jdk17 5/20 / org.apache.cassandra.cql3.DecoratedKeyPrefixesTest-latest_jdk17_x86_64
FAILED:  junit.framework.TestSuite.Tests / test-latest jdk21 5/20 / org.apache.cassandra.cql3.DecoratedKeyPrefixesTest-latest_jdk21_x86_64
FAILED:  junit.framework.TestSuite.Tests / test-latest jdk11 6/20 / org.apache.cassandra.cql3.DeleteTest-latest_jdk11_x86_64
FAILED:  junit.framework.TestSuite.Tests / test-latest jdk17 6/20 / org.apache.cassandra.cql3.DeleteTest-latest_jdk17_x86_64
FAILED:  junit.framework.TestSuite.Tests / test-latest jdk21 6/20 / org.apache.cassandra.cql3.DeleteTest-latest_jdk21_x86_64
FAILED:  junit.framework.TestSuite.Tests / test-latest jdk11 7/20 / org.apache.cassandra.cql3.DistinctQueryPagingTest-latest_jdk11_x86_64
FAILED:  junit.framework.TestSuite.Tests / test-latest jdk17 7/20 / org.apache.cassandra.cql3.DistinctQueryPagingTest-latest_jdk17_x86_64
FAILED:  junit.framework.TestSuite.Tests / test-latest jdk21 7/20 / org.apache.cassandra.cql3.DistinctQueryPagingTest-latest_jdk21_x86_64
FAILED:  junit.framework.TestSuite.Tests / test-latest jdk11 9/20 / org.apache.cassandra.cql3.EarlyOpenCompactionTest-latest_jdk11_x86_64
FAILED:  junit.framework.TestSuite.Tests / test-latest jdk17 9/20 / org.apache.cassandra.cql3.EarlyOpenCompactionTest-latest_jdk17_x86_64
FAILED:  junit.framework.TestSuite.Tests / test-latest jdk21 9/20 / org.apache.cassandra.cql3.EarlyOpenCompactionTest-latest_jdk21_x86_64
FAILED:  junit.framework.TestSuite.Tests / test-latest jdk11 10/20 / org.apache.cassandra.cql3.EmptyValuesTest-latest_jdk11_x86_64
FAILED:  junit.framework.TestSuite.Tests / test-latest jdk17 10/20 / org.apache.cassandra.cql3.EmptyValuesTest-latest_jdk17_x86_64
FAILED:  junit.framework.TestSuite.Tests / test-latest jdk21 10/20 / org.apache.cassandra.cql3.EmptyValuesTest-latest_jdk21_x86_64
FAILED:  junit.framework.TestSuite.Tests / test-latest jdk11 6/20 / org.apache.cassandra.cql3.GcCompactionTest-latest_jdk11_x86_64
FAILED:  junit.framework.TestSuite.Tests / test-latest jdk17 6/20 / org.apache.cassandra.cql3.GcCompactionTest-latest_jdk17_x86_64
FAILED:  junit.framework.TestSuite.Tests / test-latest jdk21 6/20 / org.apache.cassandra.cql3.GcCompactionTest-latest_jdk21_x86_64
FAILED:  junit.framework.TestSuite.Tests / test-latest jdk11 7/20 / org.apache.cassandra.cql3.IndexQueryPagingTest-latest_jdk11_x86_64
FAILED:  junit.framework.TestSuite.Tests / test-latest jdk17 7/20 / org.apache.cassandra.cql3.IndexQueryPagingTest-latest_jdk17_x86_64
FAILED:  junit.framework.TestSuite.Tests / test-latest jdk21 7/20 / org.apache.cassandra.cql3.IndexQueryPagingTest-latest_jdk21_x86_64
FAILED:  junit.framework.TestSuite.Tests / test-latest jdk11 8/20 / org.apache.cassandra.cql3.KeyCacheCqlTest-latest_jdk11_x86_64
FAILED:  junit.framework.TestSuite.Tests / test-latest jdk17 8/20 / org.apache.cassandra.cql3.KeyCacheCqlTest-latest_jdk17_x86_64
FAILED:  junit.framework.TestSuite.Tests / test-latest jdk21 8/20 / org.apache.cassandra.cql3.KeyCacheCqlTest-latest_jdk21_x86_64
FAILED:  junit.framework.TestSuite.Tests / test-latest jdk11 9/20 / org.apache.cassandra.cql3.KeywordSplit1Test-latest_jdk11_x86_64
FAILED:  junit.framework.TestSuite.Tests / test-latest jdk17 9/20 / org.apache.cassandra.cql3.KeywordSplit1Test-latest_jdk17_x86_64
FAILED:  junit.framework.TestSuite.Tests / test-latest jdk21 9/20 / org.apache.cassandra.cql3.KeywordSplit1Test-latest_jdk21_x86_64
FAILED:  junit.framework.TestSuite.Tests / test-latest jdk11 10/20 / org.apache.cassandra.cql3.KeywordSplitTest-latest_jdk11_x86_64
FAILED:  junit.framework.TestSuite.Tests / test-latest jdk17 10/20 / org.apache.cassandra.cql3.KeywordSplitTest-latest_jdk17_x86_64
FAILED:  junit.framework.TestSuite.Tests / test-latest jdk21 10/20 / org.apache.cassandra.cql3.KeywordSplitTest-latest_jdk21_x86_64
FAILED:  junit.framework.TestSuite.Tests / test-latest jdk11 11/20 / org.apache.cassandra.cql3.NodeLocalConsistencyTest-latest_jdk11_x86_64
FAILED:  junit.framework.TestSuite.Tests / test-latest jdk17 11/20 / org.apache.cassandra.cql3.NodeLocalConsistencyTest-latest_jdk17_x86_64
FAILED:  junit.framework.TestSuite.Tests / test-latest jdk21 11/20 / org.apache.cassandra.cql3.NodeLocalConsistencyTest-latest_jdk21_x86_64
FAILED:  junit.framework.TestSuite.Tests / test-latest jdk11 12/20 / org.apache.cassandra.cql3.NonNativeTimestampTest-latest_jdk11_x86_64
FAILED:  junit.framework.TestSuite.Tests / test-latest jdk17 12/20 / org.apache.cassandra.cql3.NonNativeTimestampTest-latest_jdk17_x86_64
FAILED:  junit.framework.TestSuite.Tests / test-latest jdk21 12/20 / org.apache.cassandra.cql3.NonNativeTimestampTest-latest_jdk21_x86_64
FAILED:  junit.framework.TestSuite.Tests / test-latest jdk11 13/20 / org.apache.cassandra.cql3.OutOfSpaceTest-latest_jdk11_x86_64
FAILED:  junit.framework.TestSuite.Tests / test-latest jdk17 13/20 / org.apache.cassandra.cql3.OutOfSpaceTest-latest_jdk17_x86_64
FAILED:  junit.framework.TestSuite.Tests / test-latest jdk21 13/20 / org.apache.cassandra.cql3.OutOfSpaceTest-latest_jdk21_x86_64
FAILED:  junit.framework.TestSuite.Tests / test-latest jdk11 14/20 / org.apache.cassandra.cql3.PagingQueryTest-latest_jdk11_x86_64
FAILED:  junit.framework.TestSuite.Tests / test-latest jdk17 14/20 / org.apache.cassandra.cql3.PagingQueryTest-latest_jdk17_x86_64
FAILED:  junit.framework.TestSuite.Tests / test-latest jdk21 14/20 / org.apache.cassandra.cql3.PagingQueryTest-latest_jdk21_x86_64
FAILED:  junit.framework.TestSuite.Tests / test-latest jdk11 17/20 / org.apache.cassandra.cql3.PreparedStatementsTest-latest_jdk11_x86_64
FAILED:  junit.framework.TestSuite.Tests / test-latest jdk17 17/20 / org.apache.cassandra.cql3.PreparedStatementsTest-latest_jdk17_x86_64
FAILED:  junit.framework.TestSuite.Tests / test-latest jdk21 17/20 / org.apache.cassandra.cql3.PreparedStatementsTest-latest_jdk21_x86_64
FAILED:  junit.framework.TestSuite.Tests / test-latest jdk11 18/20 / org.apache.cassandra.cql3.PstmtPersistenceTest-latest_jdk11_x86_64
FAILED:  junit.framework.TestSuite.Tests / test-latest jdk17 18/20 / org.apache.cassandra.cql3.PstmtPersistenceTest-latest_jdk17_x86_64
FAILED:  junit.framework.TestSuite.Tests / test-latest jdk21 18/20 / org.apache.cassandra.cql3.PstmtPersistenceTest-latest_jdk21_x86_64
FAILED:  junit.framework.TestSuite.Tests / test-latest jdk11 19/20 / org.apache.cassandra.cql3.QueryEventsTest-latest_jdk11_x86_64
FAILED:  junit.framework.TestSuite.Tests / test-latest jdk17 19/20 / org.apache.cassandra.cql3.QueryEventsTest-latest_jdk17_x86_64
FAILED:  junit.framework.TestSuite.Tests / test-latest jdk21 19/20 / org.apache.cassandra.cql3.QueryEventsTest-latest_jdk21_x86_64
FAILED:  junit.framework.TestSuite.Tests / test-latest jdk11 1/20 / org.apache.cassandra.cql3.QueryWithIndexedSSTableTest-latest_jdk11_x86_64
FAILED:  junit.framework.TestSuite.Tests / test-latest jdk17 1/20 / org.apache.cassandra.cql3.QueryWithIndexedSSTableTest-latest_jdk17_x86_64
FAILED:  junit.framework.TestSuite.Tests / test-latest jdk21 1/20 / org.apache.cassandra.cql3.QueryWithIndexedSSTableTest-latest_jdk21_x86_64
FAILED:  junit.framework.TestSuite.Tests / test-latest jdk11 2/20 / org.apache.cassandra.cql3.RandomSchemaTest-latest_jdk11_x86_64
FAILED:  junit.framework.TestSuite.Tests / test-latest jdk17 2/20 / org.apache.cassandra.cql3.RandomSchemaTest-latest_jdk17_x86_64
FAILED:  junit.framework.TestSuite.Tests / test-latest jdk21 2/20 / org.apache.cassandra.cql3.RandomSchemaTest-latest_jdk21_x86_64
FAILED:  junit.framework.TestSuite.Tests / test-latest jdk11 3/20 / org.apache.cassandra.cql3.RangeTombstoneBoundaryTest-latest_jdk11_x86_64
FAILED:  junit.framework.TestSuite.Tests / test-latest jdk17 3/20 / org.apache.cassandra.cql3.RangeTombstoneBoundaryTest-latest_jdk17_x86_64
FAILED:  junit.framework.TestSuite.Tests / test-latest jdk21 3/20 / org.apache.cassandra.cql3.RangeTombstoneBoundaryTest-latest_jdk21_x86_64
FAILED:  junit.framework.TestSuite.Tests / test-latest jdk11 8/20 / org.apache.cassandra.cql3.SecondaryIndexSSTableExportTest-latest_jdk11_x86_64
FAILED:  junit.framework.TestSuite.Tests / test-latest jdk17 8/20 / org.apache.cassandra.cql3.SecondaryIndexSSTableExportTest-latest_jdk17_x86_64
FAILED:  junit.framework.TestSuite.Tests / test-latest jdk21 8/20 / org.apache.cassandra.cql3.SecondaryIndexSSTableExportTest-latest_jdk21_x86_64
FAILED:  junit.framework.TestSuite.Tests / test-latest jdk11 12/20 / org.apache.cassandra.cql3.SerializationMirrorTest-latest_jdk11_x86_64
FAILED:  junit.framework.TestSuite.Tests / test-latest jdk17 12/20 / org.apache.cassandra.cql3.SerializationMirrorTest-latest_jdk17_x86_64
FAILED:  junit.framework.TestSuite.Tests / test-latest jdk21 12/20 / org.apache.cassandra.cql3.SerializationMirrorTest-latest_jdk21_x86_64
FAILED:  junit.framework.TestSuite.Tests / test-latest jdk11 13/20 / org.apache.cassandra.cql3.SimpleCASTest-latest_jdk11_x86_64
FAILED:  junit.framework.TestSuite.Tests / test-latest jdk17 13/20 / org.apache.cassandra.cql3.SimpleCASTest-latest_jdk17_x86_64
FAILED:  junit.framework.TestSuite.Tests / test-latest jdk21 13/20 / org.apache.cassandra.cql3.SimpleCASTest-latest_jdk21_x86_64
FAILED:  junit.framework.TestSuite.Tests / test-latest jdk11 14/20 / org.apache.cassandra.cql3.SimpleQueryTest-latest_jdk11_x86_64
FAILED:  junit.framework.TestSuite.Tests / test-latest jdk17 14/20 / org.apache.cassandra.cql3.SimpleQueryTest-latest_jdk17_x86_64
FAILED:  junit.framework.TestSuite.Tests / test-latest jdk21 14/20 / org.apache.cassandra.cql3.SimpleQueryTest-latest_jdk21_x86_64
FAILED:  junit.framework.TestSuite.Tests / test-latest jdk11 7/20 / org.apache.cassandra.cql3.SystemKeyspaceQueryTest-latest_jdk11_x86_64
FAILED:  junit.framework.TestSuite.Tests / test-latest jdk17 7/20 / org.apache.cassandra.cql3.SystemKeyspaceQueryTest-latest_jdk17_x86_64
FAILED:  junit.framework.TestSuite.Tests / test-latest jdk21 7/20 / org.apache.cassandra.cql3.SystemKeyspaceQueryTest-latest_jdk21_x86_64
FAILED:  junit.framework.TestSuite.Tests / test-latest jdk11 8/20 / org.apache.cassandra.cql3.SystemKeyspaceTablesNamesTest-latest_jdk11_x86_64
FAILED:  junit.framework.TestSuite.Tests / test-latest jdk17 8/20 / org.apache.cassandra.cql3.SystemKeyspaceTablesNamesTest-latest_jdk17_x86_64
FAILED:  junit.framework.TestSuite.Tests / test-latest jdk21 8/20 / org.apache.cassandra.cql3.SystemKeyspaceTablesNamesTest-latest_jdk21_x86_64
FAILED:  junit.framework.TestSuite.Tests / test-latest jdk11 10/20 / org.apache.cassandra.cql3.TombstonesWithIndexedSSTableTest-latest_jdk11_x86_64
FAILED:  junit.framework.TestSuite.Tests / test-latest jdk17 10/20 / org.apache.cassandra.cql3.TombstonesWithIndexedSSTableTest-latest_jdk17_x86_64
FAILED:  junit.framework.TestSuite.Tests / test-latest jdk21 10/20 / org.apache.cassandra.cql3.TombstonesWithIndexedSSTableTest-latest_jdk21_x86_64
FAILED:  junit.framework.TestSuite.Tests / test-latest jdk11 11/20 / org.apache.cassandra.cql3.TraceCqlTest-latest_jdk11_x86_64
FAILED:  junit.framework.TestSuite.Tests / test-latest jdk17 11/20 / org.apache.cassandra.cql3.TraceCqlTest-latest_jdk17_x86_64
FAILED:  junit.framework.TestSuite.Tests / test-latest jdk21 11/20 / org.apache.cassandra.cql3.TraceCqlTest-latest_jdk21_x86_64
FAILED:  junit.framework.TestSuite.Tests / test-latest jdk11 18/20 / org.apache.cassandra.cql3.ViewCompactionTest-latest_jdk11_x86_64
FAILED:  junit.framework.TestSuite.Tests / test-latest jdk17 18/20 / org.apache.cassandra.cql3.ViewCompactionTest-latest_jdk17_x86_64
FAILED:  junit.framework.TestSuite.Tests / test-latest jdk21 18/20 / org.apache.cassandra.cql3.ViewCompactionTest-latest_jdk21_x86_64
FAILED:  junit.framework.TestSuite.Tests / test-latest jdk11 19/20 / org.apache.cassandra.cql3.ViewComplexDeletionsPartialTest-latest_jdk11_x86_64
FAILED:  junit.framework.TestSuite.Tests / test-latest jdk17 19/20 / org.apache.cassandra.cql3.ViewComplexDeletionsPartialTest-latest_jdk17_x86_64
FAILED:  junit.framework.TestSuite.Tests / test-latest jdk21 19/20 / org.apache.cassandra.cql3.ViewComplexDeletionsPartialTest-latest_jdk21_x86_64
FAILED:  junit.framework.TestSuite.Tests / test-latest jdk11 20/20 / org.apache.cassandra.cql3.ViewComplexDeletionsTest-latest_jdk11_x86_64
FAILED:  junit.framework.TestSuite.Tests / test-latest jdk17 20/20 / org.apache.cassandra.cql3.ViewComplexDeletionsTest-latest_jdk17_x86_64
FAILED:  junit.framework.TestSuite.Tests / test-latest jdk21 20/20 / org.apache.cassandra.cql3.ViewComplexDeletionsTest-latest_jdk21_x86_64
FAILED:  junit.framework.TestSuite.Tests / test-latest jdk11 1/20 / org.apache.cassandra.cql3.ViewComplexLivenessLimitTest-latest_jdk11_x86_64
FAILED:  junit.framework.TestSuite.Tests / test-latest jdk17 1/20 / org.apache.cassandra.cql3.ViewComplexLivenessLimitTest-latest_jdk17_x86_64
FAILED:  junit.framework.TestSuite.Tests / test-latest jdk21 1/20 / org.apache.cassandra.cql3.ViewComplexLivenessLimitTest-latest_jdk21_x86_64
FAILED:  junit.framework.TestSuite.Tests / test-latest jdk11 2/20 / org.apache.cassandra.cql3.ViewComplexLivenessTest-latest_jdk11_x86_64
FAILED:  junit.framework.TestSuite.Tests / test-latest jdk17 2/20 / org.apache.cassandra.cql3.ViewComplexLivenessTest-latest_jdk17_x86_64
FAILED:  junit.framework.TestSuite.Tests / test-latest jdk21 2/20 / org.apache.cassandra.cql3.ViewComplexLivenessTest-latest_jdk21_x86_64
FAILED:  junit.framework.TestSuite.Tests / test-latest jdk11 5/20 / org.apache.cassandra.cql3.ViewComplexTTLTest-latest_jdk11_x86_64
FAILED:  junit.framework.TestSuite.Tests / test-latest jdk17 5/20 / org.apache.cassandra.cql3.ViewComplexTTLTest-latest_jdk17_x86_64
FAILED:  junit.framework.TestSuite.Tests / test-latest jdk21 5/20 / org.apache.cassandra.cql3.ViewComplexTTLTest-latest_jdk21_x86_64
FAILED:  junit.framework.TestSuite.Tests / test-latest jdk11 3/20 / org.apache.cassandra.cql3.ViewComplexTest-latest_jdk11_x86_64
FAILED:  junit.framework.TestSuite.Tests / test-latest jdk17 3/20 / org.apache.cassandra.cql3.ViewComplexTest-latest_jdk17_x86_64
FAILED:  junit.framework.TestSuite.Tests / test-latest jdk21 3/20 / org.apache.cassandra.cql3.ViewComplexTest-latest_jdk21_x86_64
FAILED:  junit.framework.TestSuite.Tests / test-latest jdk11 4/20 / org.apache.cassandra.cql3.ViewComplexTombstoneTest-latest_jdk11_x86_64
FAILED:  junit.framework.TestSuite.Tests / test-latest jdk17 4/20 / org.apache.cassandra.cql3.ViewComplexTombstoneTest-latest_jdk17_x86_64
FAILED:  junit.framework.TestSuite.Tests / test-latest jdk21 4/20 / org.apache.cassandra.cql3.ViewComplexTombstoneTest-latest_jdk21_x86_64
FAILED:  junit.framework.TestSuite.Tests / test-latest jdk11 6/20 / org.apache.cassandra.cql3.ViewComplexUpdatesTest-latest_jdk11_x86_64
FAILED:  junit.framework.TestSuite.Tests / test-latest jdk17 6/20 / org.apache.cassandra.cql3.ViewComplexUpdatesTest-latest_jdk17_x86_64
FAILED:  junit.framework.TestSuite.Tests / test-latest jdk21 6/20 / org.apache.cassandra.cql3.ViewComplexUpdatesTest-latest_jdk21_x86_64
FAILED:  junit.framework.TestSuite.Tests / test-latest jdk11 7/20 / org.apache.cassandra.cql3.ViewFiltering1Test-latest_jdk11_x86_64
FAILED:  junit.framework.TestSuite.Tests / test-latest jdk17 7/20 / org.apache.cassandra.cql3.ViewFiltering1Test-latest_jdk17_x86_64
FAILED:  junit.framework.TestSuite.Tests / test-latest jdk21 7/20 / org.apache.cassandra.cql3.ViewFiltering1Test-latest_jdk21_x86_64
FAILED:  junit.framework.TestSuite.Tests / test-latest jdk11 8/20 / org.apache.cassandra.cql3.ViewFiltering2Test-latest_jdk11_x86_64
FAILED:  junit.framework.TestSuite.Tests / test-latest jdk17 8/20 / org.apache.cassandra.cql3.ViewFiltering2Test-latest_jdk17_x86_64
FAILED:  junit.framework.TestSuite.Tests / test-latest jdk21 8/20 / org.apache.cassandra.cql3.ViewFiltering2Test-latest_jdk21_x86_64
FAILED:  junit.framework.TestSuite.Tests / test-latest jdk11 9/20 / org.apache.cassandra.cql3.ViewFilteringClustering1Test-latest_jdk11_x86_64
FAILED:  junit.framework.TestSuite.Tests / test-latest jdk17 9/20 / org.apache.cassandra.cql3.ViewFilteringClustering1Test-latest_jdk17_x86_64
FAILED:  junit.framework.TestSuite.Tests / test-latest jdk21 9/20 / org.apache.cassandra.cql3.ViewFilteringClustering1Test-latest_jdk21_x86_64
FAILED:  junit.framework.TestSuite.Tests / test-latest jdk11 10/20 / org.apache.cassandra.cql3.ViewFilteringClustering2Test-latest_jdk11_x86_64
FAILED:  junit.framework.TestSuite.Tests / test-latest jdk17 10/20 / org.apache.cassandra.cql3.ViewFilteringClustering2Test-latest_jdk17_x86_64
FAILED:  junit.framework.TestSuite.Tests / test-latest jdk21 10/20 / org.apache.cassandra.cql3.ViewFilteringClustering2Test-latest_jdk21_x86_64
FAILED:  junit.framework.TestSuite.Tests / test-latest jdk11 11/20 / org.apache.cassandra.cql3.ViewFilteringComplexPKTest-latest_jdk11_x86_64
FAILED:  junit.framework.TestSuite.Tests / test-latest jdk17 11/20 / org.apache.cassandra.cql3.ViewFilteringComplexPKTest-latest_jdk17_x86_64
FAILED:  junit.framework.TestSuite.Tests / test-latest jdk21 11/20 / org.apache.cassandra.cql3.ViewFilteringComplexPKTest-latest_jdk21_x86_64
FAILED:  junit.framework.TestSuite.Tests / test-latest jdk11 12/20 / org.apache.cassandra.cql3.ViewFilteringSimplePKTest-latest_jdk11_x86_64
FAILED:  junit.framework.TestSuite.Tests / test-latest jdk17 12/20 / org.apache.cassandra.cql3.ViewFilteringSimplePKTest-latest_jdk17_x86_64
FAILED:  junit.framework.TestSuite.Tests / test-latest jdk21 12/20 / org.apache.cassandra.cql3.ViewFilteringSimplePKTest-latest_jdk21_x86_64
FAILED:  junit.framework.TestSuite.Tests / test-latest jdk11 13/20 / org.apache.cassandra.cql3.ViewPKTest-latest_jdk11_x86_64
FAILED:  junit.framework.TestSuite.Tests / test-latest jdk17 13/20 / org.apache.cassandra.cql3.ViewPKTest-latest_jdk17_x86_64
FAILED:  junit.framework.TestSuite.Tests / test-latest jdk21 13/20 / org.apache.cassandra.cql3.ViewPKTest-latest_jdk21_x86_64
FAILED:  junit.framework.TestSuite.Tests / test-latest jdk11 14/20 / org.apache.cassandra.cql3.ViewRangesTest-latest_jdk11_x86_64
FAILED:  junit.framework.TestSuite.Tests / test-latest jdk17 14/20 / org.apache.cassandra.cql3.ViewRangesTest-latest_jdk17_x86_64
FAILED:  junit.framework.TestSuite.Tests / test-latest jdk21 14/20 / org.apache.cassandra.cql3.ViewRangesTest-latest_jdk21_x86_64
FAILED:  junit.framework.TestSuite.Tests / test-latest jdk11 15/20 / org.apache.cassandra.cql3.ViewSchemaTest-latest_jdk11_x86_64
FAILED:  junit.framework.TestSuite.Tests / test-latest jdk17 15/20 / org.apache.cassandra.cql3.ViewSchemaTest-latest_jdk17_x86_64
FAILED:  junit.framework.TestSuite.Tests / test-latest jdk21 15/20 / org.apache.cassandra.cql3.ViewSchemaTest-latest_jdk21_x86_64
FAILED:  junit.framework.TestSuite.Tests / test-latest jdk11 16/20 / org.apache.cassandra.cql3.ViewTest-latest_jdk11_x86_64
FAILED:  junit.framework.TestSuite.Tests / test-latest jdk17 16/20 / org.apache.cassandra.cql3.ViewTest-latest_jdk17_x86_64
FAILED:  junit.framework.TestSuite.Tests / test-latest jdk21 16/20 / org.apache.cassandra.cql3.ViewTest-latest_jdk21_x86_64
FAILED:  junit.framework.TestSuite.Tests / test-latest jdk11 17/20 / org.apache.cassandra.cql3.ViewTimesTest-latest_jdk11_x86_64
FAILED:  junit.framework.TestSuite.Tests / test-latest jdk17 17/20 / org.apache.cassandra.cql3.ViewTimesTest-latest_jdk17_x86_64
FAILED:  junit.framework.TestSuite.Tests / test-latest jdk21 17/20 / org.apache.cassandra.cql3.ViewTimesTest-latest_jdk21_x86_64
FAILED:  junit.framework.TestSuite.Tests / test-latest jdk11 13/20 / org.apache.cassandra.cql3.functions.CastFctsTest-latest_jdk11_x86_64
FAILED:  junit.framework.TestSuite.Tests / test-latest jdk17 13/20 / org.apache.cassandra.cql3.functions.CastFctsTest-latest_jdk17_x86_64
FAILED:  junit.framework.TestSuite.Tests / test-latest jdk21 13/20 / org.apache.cassandra.cql3.functions.CastFctsTest-latest_jdk21_x86_64
FAILED:  junit.framework.TestSuite.Tests / test-latest jdk11 15/20 / org.apache.cassandra.cql3.functions.CollectionFctsTest-latest_jdk11_x86_64
FAILED:  junit.framework.TestSuite.Tests / test-latest jdk17 15/20 / org.apache.cassandra.cql3.functions.CollectionFctsTest-latest_jdk17_x86_64
FAILED:  junit.framework.TestSuite.Tests / test-latest jdk21 15/20 / org.apache.cassandra.cql3.functions.CollectionFctsTest-latest_jdk21_x86_64
FAILED:  junit.framework.TestSuite.Tests / test-latest jdk11 16/20 / org.apache.cassandra.cql3.functions.FormatBytesFctTest-latest_jdk11_x86_64
FAILED:  junit.framework.TestSuite.Tests / test-latest jdk17 16/20 / org.apache.cassandra.cql3.functions.FormatBytesFctTest-latest_jdk17_x86_64
FAILED:  junit.framework.TestSuite.Tests / test-latest jdk21 16/20 / org.apache.cassandra.cql3.functions.FormatBytesFctTest-latest_jdk21_x86_64
FAILED:  junit.framework.TestSuite.Tests / test-latest jdk11 17/20 / org.apache.cassandra.cql3.functions.FormatTimeFctTest-latest_jdk11_x86_64
FAILED:  junit.framework.TestSuite.Tests / test-latest jdk17 17/20 / org.apache.cassandra.cql3.functions.FormatTimeFctTest-latest_jdk17_x86_64
FAILED:  junit.framework.TestSuite.Tests / test-latest jdk21 17/20 / org.apache.cassandra.cql3.functions.FormatTimeFctTest-latest_jdk21_x86_64
FAILED:  junit.framework.TestSuite.Tests / test-latest jdk11 18/20 / org.apache.cassandra.cql3.functions.FunctionFactoryTest-latest_jdk11_x86_64
FAILED:  junit.framework.TestSuite.Tests / test-latest jdk17 18/20 / org.apache.cassandra.cql3.functions.FunctionFactoryTest-latest_jdk17_x86_64
FAILED:  junit.framework.TestSuite.Tests / test-latest jdk21 18/20 / org.apache.cassandra.cql3.functions.FunctionFactoryTest-latest_jdk21_x86_64
FAILED:  junit.framework.TestSuite.Tests / test-latest jdk11 19/20 / org.apache.cassandra.cql3.functions.LengthFctsTest-latest_jdk11_x86_64
FAILED:  junit.framework.TestSuite.Tests / test-latest jdk17 19/20 / org.apache.cassandra.cql3.functions.LengthFctsTest-latest_jdk17_x86_64
FAILED:  junit.framework.TestSuite.Tests / test-latest jdk21 19/20 / org.apache.cassandra.cql3.functions.LengthFctsTest-latest_jdk21_x86_64
FAILED:  junit.framework.TestSuite.Tests / test-latest jdk11 3/20 / org.apache.cassandra.cql3.functions.OperationFctsTest-latest_jdk11_x86_64
FAILED:  junit.framework.TestSuite.Tests / test-latest jdk17 3/20 / org.apache.cassandra.cql3.functions.OperationFctsTest-latest_jdk17_x86_64
FAILED:  junit.framework.TestSuite.Tests / test-latest jdk21 3/20 / org.apache.cassandra.cql3.functions.OperationFctsTest-latest_jdk21_x86_64
FAILED:  junit.framework.TestSuite.Tests / test-latest jdk11 5/20 / org.apache.cassandra.cql3.functions.VectorFctsTest-latest_jdk11_x86_64
FAILED:  junit.framework.TestSuite.Tests / test-latest jdk17 5/20 / org.apache.cassandra.cql3.functions.VectorFctsTest-latest_jdk17_x86_64
FAILED:  junit.framework.TestSuite.Tests / test-latest jdk21 5/20 / org.apache.cassandra.cql3.functions.VectorFctsTest-latest_jdk21_x86_64
FAILED:  junit.framework.TestSuite.Tests / test-latest jdk11 20/20 / org.apache.cassandra.cql3.functions.masking.ColumnMaskInAnyPositionWithDefaultTest-latest_jdk11_x86_64
FAILED:  junit.framework.TestSuite.Tests / test-latest jdk17 20/20 / org.apache.cassandra.cql3.functions.masking.ColumnMaskInAnyPositionWithDefaultTest-latest_jdk17_x86_64
FAILED:  junit.framework.TestSuite.Tests / test-latest jdk21 20/20 / org.apache.cassandra.cql3.functions.masking.ColumnMaskInAnyPositionWithDefaultTest-latest_jdk21_x86_64
FAILED:  junit.framework.TestSuite.Tests / test-latest jdk11 1/20 / org.apache.cassandra.cql3.functions.masking.ColumnMaskInAnyPositionWithNullTest-latest_jdk11_x86_64
FAILED:  junit.framework.TestSuite.Tests / test-latest jdk17 1/20 / org.apache.cassandra.cql3.functions.masking.ColumnMaskInAnyPositionWithNullTest-latest_jdk17_x86_64
FAILED:  junit.framework.TestSuite.Tests / test-latest jdk21 1/20 / org.apache.cassandra.cql3.functions.masking.ColumnMaskInAnyPositionWithNullTest-latest_jdk21_x86_64
FAILED:  junit.framework.TestSuite.Tests / test-latest jdk11 2/20 / org.apache.cassandra.cql3.functions.masking.ColumnMaskInAnyPositionWithPartialTest-latest_jdk11_x86_64
FAILED:  junit.framework.TestSuite.Tests / test-latest jdk17 2/20 / org.apache.cassandra.cql3.functions.masking.ColumnMaskInAnyPositionWithPartialTest-latest_jdk17_x86_64
FAILED:  junit.framework.TestSuite.Tests / test-latest jdk21 2/20 / org.apache.cassandra.cql3.functions.masking.ColumnMaskInAnyPositionWithPartialTest-latest_jdk21_x86_64
FAILED:  junit.framework.TestSuite.Tests / test-latest jdk11 3/20 / org.apache.cassandra.cql3.functions.masking.ColumnMaskInAnyPositionWithReplaceTest-latest_jdk11_x86_64
FAILED:  junit.framework.TestSuite.Tests / test-latest jdk17 3/20 / org.apache.cassandra.cql3.functions.masking.ColumnMaskInAnyPositionWithReplaceTest-latest_jdk17_x86_64
FAILED:  junit.framework.TestSuite.Tests / test-latest jdk21 3/20 / org.apache.cassandra.cql3.functions.masking.ColumnMaskInAnyPositionWithReplaceTest-latest_jdk21_x86_64
FAILED:  junit.framework.TestSuite.Tests / test-latest jdk11 4/20 / org.apache.cassandra.cql3.functions.masking.ColumnMaskInAnyPositionWithUDFTest-latest_jdk11_x86_64
FAILED:  junit.framework.TestSuite.Tests / test-latest jdk17 4/20 / org.apache.cassandra.cql3.functions.masking.ColumnMaskInAnyPositionWithUDFTest-latest_jdk17_x86_64
FAILED:  junit.framework.TestSuite.Tests / test-latest jdk21 4/20 / org.apache.cassandra.cql3.functions.masking.ColumnMaskInAnyPositionWithUDFTest-latest_jdk21_x86_64
FAILED:  junit.framework.TestSuite.Tests / test-latest jdk11 5/20 / org.apache.cassandra.cql3.functions.masking.ColumnMaskNativeTypesTest-latest_jdk11_x86_64
FAILED:  junit.framework.TestSuite.Tests / test-latest jdk17 5/20 / org.apache.cassandra.cql3.functions.masking.ColumnMaskNativeTypesTest-latest_jdk17_x86_64
FAILED:  junit.framework.TestSuite.Tests / test-latest jdk21 5/20 / org.apache.cassandra.cql3.functions.masking.ColumnMaskNativeTypesTest-latest_jdk21_x86_64
FAILED:  junit.framework.TestSuite.Tests / test-latest jdk11 6/20 / org.apache.cassandra.cql3.functions.masking.ColumnMaskQueryWithDefaultTest-latest_jdk11_x86_64
FAILED:  junit.framework.TestSuite.Tests / test-latest jdk17 6/20 / org.apache.cassandra.cql3.functions.masking.ColumnMaskQueryWithDefaultTest-latest_jdk17_x86_64
FAILED:  junit.framework.TestSuite.Tests / test-latest jdk21 6/20 / org.apache.cassandra.cql3.functions.masking.ColumnMaskQueryWithDefaultTest-latest_jdk21_x86_64
FAILED:  junit.framework.TestSuite.Tests / test-latest jdk11 7/20 / org.apache.cassandra.cql3.functions.masking.ColumnMaskQueryWithNullTest-latest_jdk11_x86_64
FAILED:  junit.framework.TestSuite.Tests / test-latest jdk17 7/20 / org.apache.cassandra.cql3.functions.masking.ColumnMaskQueryWithNullTest-latest_jdk17_x86_64
FAILED:  junit.framework.TestSuite.Tests / test-latest jdk21 7/20 / org.apache.cassandra.cql3.functions.masking.ColumnMaskQueryWithNullTest-latest_jdk21_x86_64
FAILED:  junit.framework.TestSuite.Tests / test-latest jdk11 8/20 / org.apache.cassandra.cql3.functions.masking.ColumnMaskQueryWithPartialTest-latest_jdk11_x86_64
FAILED:  junit.framework.TestSuite.Tests / test-latest jdk17 8/20 / org.apache.cassandra.cql3.functions.masking.ColumnMaskQueryWithPartialTest-latest_jdk17_x86_64
FAILED:  junit.framework.TestSuite.Tests / test-latest jdk21 8/20 / org.apache.cassandra.cql3.functions.masking.ColumnMaskQueryWithPartialTest-latest_jdk21_x86_64
FAILED:  junit.framework.TestSuite.Tests / test-latest jdk11 9/20 / org.apache.cassandra.cql3.functions.masking.ColumnMaskQueryWithReplaceTest-latest_jdk11_x86_64
FAILED:  junit.framework.TestSuite.Tests / test-latest jdk17 9/20 / org.apache.cassandra.cql3.functions.masking.ColumnMaskQueryWithReplaceTest-latest_jdk17_x86_64
FAILED:  junit.framework.TestSuite.Tests / test-latest jdk21 9/20 / org.apache.cassandra.cql3.functions.masking.ColumnMaskQueryWithReplaceTest-latest_jdk21_x86_64
FAILED:  junit.framework.TestSuite.Tests / test-latest jdk11 10/20 / org.apache.cassandra.cql3.functions.masking.ColumnMaskQueryWithUDFTest-latest_jdk11_x86_64
FAILED:  junit.framework.TestSuite.Tests / test-latest jdk17 10/20 / org.apache.cassandra.cql3.functions.masking.ColumnMaskQueryWithUDFTest-latest_jdk17_x86_64
FAILED:  junit.framework.TestSuite.Tests / test-latest jdk21 10/20 / org.apache.cassandra.cql3.functions.masking.ColumnMaskQueryWithUDFTest-latest_jdk21_x86_64
FAILED:  junit.framework.TestSuite.Tests / test-latest jdk11 11/20 / org.apache.cassandra.cql3.functions.masking.ColumnMaskTest-latest_jdk11_x86_64
FAILED:  junit.framework.TestSuite.Tests / test-latest jdk17 11/20 / org.apache.cassandra.cql3.functions.masking.ColumnMaskTest-latest_jdk17_x86_64
FAILED:  junit.framework.TestSuite.Tests / test-latest jdk21 11/20 / org.apache.cassandra.cql3.functions.masking.ColumnMaskTest-latest_jdk21_x86_64
FAILED:  junit.framework.TestSuite.Tests / test-latest jdk11 12/20 / org.apache.cassandra.cql3.functions.masking.ColumnMaskWithTypeAlteringFunctionTest-latest_jdk11_x86_64
FAILED:  junit.framework.TestSuite.Tests / test-latest jdk17 12/20 / org.apache.cassandra.cql3.functions.masking.ColumnMaskWithTypeAlteringFunctionTest-latest_jdk17_x86_64
FAILED:  junit.framework.TestSuite.Tests / test-latest jdk21 12/20 / org.apache.cassandra.cql3.functions.masking.ColumnMaskWithTypeAlteringFunctionTest-latest_jdk21_x86_64
FAILED:  junit.framework.TestSuite.Tests / test-latest jdk11 13/20 / org.apache.cassandra.cql3.functions.masking.ColumnMaskWithUDFTest-latest_jdk11_x86_64
FAILED:  junit.framework.TestSuite.Tests / test-latest jdk17 13/20 / org.apache.cassandra.cql3.functions.masking.ColumnMaskWithUDFTest-latest_jdk17_x86_64
FAILED:  junit.framework.TestSuite.Tests / test-latest jdk21 13/20 / org.apache.cassandra.cql3.functions.masking.ColumnMaskWithUDFTest-latest_jdk21_x86_64
FAILED:  junit.framework.TestSuite.Tests / test-latest jdk11 14/20 / org.apache.cassandra.cql3.functions.masking.DefaultMaskingFunctionTest-latest_jdk11_x86_64
FAILED:  junit.framework.TestSuite.Tests / test-latest jdk17 14/20 / org.apache.cassandra.cql3.functions.masking.DefaultMaskingFunctionTest-latest_jdk17_x86_64
FAILED:  junit.framework.TestSuite.Tests / test-latest jdk21 14/20 / org.apache.cassandra.cql3.functions.masking.DefaultMaskingFunctionTest-latest_jdk21_x86_64
FAILED:  junit.framework.TestSuite.Tests / test-latest jdk11 15/20 / org.apache.cassandra.cql3.functions.masking.HashMaskingFunctionTest-latest_jdk11_x86_64
FAILED:  junit.framework.TestSuite.Tests / test-latest jdk17 15/20 / org.apache.cassandra.cql3.functions.masking.HashMaskingFunctionTest-latest_jdk17_x86_64
FAILED:  junit.framework.TestSuite.Tests / test-latest jdk21 15/20 / org.apache.cassandra.cql3.functions.masking.HashMaskingFunctionTest-latest_jdk21_x86_64
FAILED:  junit.framework.TestSuite.Tests / test-latest jdk11 16/20 / org.apache.cassandra.cql3.functions.masking.NullMaskingFunctionTest-latest_jdk11_x86_64
FAILED:  junit.framework.TestSuite.Tests / test-latest jdk17 16/20 / org.apache.cassandra.cql3.functions.masking.NullMaskingFunctionTest-latest_jdk17_x86_64
FAILED:  junit.framework.TestSuite.Tests / test-latest jdk21 16/20 / org.apache.cassandra.cql3.functions.masking.NullMaskingFunctionTest-latest_jdk21_x86_64
FAILED:  junit.framework.TestSuite.Tests / test-latest jdk11 17/20 / org.apache.cassandra.cql3.functions.masking.PartialMaskingFunctionTest-latest_jdk11_x86_64
FAILED:  junit.framework.TestSuite.Tests / test-latest jdk17 17/20 / org.apache.cassandra.cql3.functions.masking.PartialMaskingFunctionTest-latest_jdk17_x86_64
FAILED:  junit.framework.TestSuite.Tests / test-latest jdk21 17/20 / org.apache.cassandra.cql3.functions.masking.PartialMaskingFunctionTest-latest_jdk21_x86_64
FAILED:  junit.framework.TestSuite.Tests / test-latest jdk11 18/20 / org.apache.cassandra.cql3.functions.masking.ReplaceMaskingFunctionTest-latest_jdk11_x86_64
FAILED:  junit.framework.TestSuite.Tests / test-latest jdk17 18/20 / org.apache.cassandra.cql3.functions.masking.ReplaceMaskingFunctionTest-latest_jdk17_x86_64
FAILED:  junit.framework.TestSuite.Tests / test-latest jdk21 18/20 / org.apache.cassandra.cql3.functions.masking.ReplaceMaskingFunctionTest-latest_jdk21_x86_64
FAILED:  junit.framework.TestSuite.Tests / test-latest jdk11 19/20 / org.apache.cassandra.cql3.functions.masking.SelectMaskedPermissionTest-latest_jdk11_x86_64
FAILED:  junit.framework.TestSuite.Tests / test-latest jdk17 19/20 / org.apache.cassandra.cql3.functions.masking.SelectMaskedPermissionTest-latest_jdk17_x86_64
FAILED:  junit.framework.TestSuite.Tests / test-latest jdk21 19/20 / org.apache.cassandra.cql3.functions.masking.SelectMaskedPermissionTest-latest_jdk21_x86_64
FAILED:  junit.framework.TestSuite.Tests / test-latest jdk11 20/20 / org.apache.cassandra.cql3.functions.masking.UnmaskPermissionTest-latest_jdk11_x86_64
FAILED:  junit.framework.TestSuite.Tests / test-latest jdk17 20/20 / org.apache.cassandra.cql3.functions.masking.UnmaskPermissionTest-latest_jdk17_x86_64
FAILED:  junit.framework.TestSuite.Tests / test-latest jdk21 20/20 / org.apache.cassandra.cql3.functions.masking.UnmaskPermissionTest-latest_jdk21_x86_64
FAILED:  junit.framework.TestSuite.Tests / test-latest jdk11 6/20 / org.apache.cassandra.cql3.restrictions.ClusteringColumnRestrictionsTest-latest_jdk11_x86_64
FAILED:  junit.framework.TestSuite.Tests / test-latest jdk17 6/20 / org.apache.cassandra.cql3.restrictions.ClusteringColumnRestrictionsTest-latest_jdk17_x86_64
FAILED:  junit.framework.TestSuite.Tests / test-latest jdk21 6/20 / org.apache.cassandra.cql3.restrictions.ClusteringColumnRestrictionsTest-latest_jdk21_x86_64
FAILED:  junit.framework.TestSuite.Tests / test-latest jdk11 9/20 / org.apache.cassandra.cql3.selection.SelectionColumnMappingTest-latest_jdk11_x86_64
FAILED:  junit.framework.TestSuite.Tests / test-latest jdk17 9/20 / org.apache.cassandra.cql3.selection.SelectionColumnMappingTest-latest_jdk17_x86_64
FAILED:  junit.framework.TestSuite.Tests / test-latest jdk21 9/20 / org.apache.cassandra.cql3.selection.SelectionColumnMappingTest-latest_jdk21_x86_64
FAILED:  junit.framework.TestSuite.Tests / test-latest jdk11 10/20 / org.apache.cassandra.cql3.selection.SelectorSerializationTest-latest_jdk11_x86_64
FAILED:  junit.framework.TestSuite.Tests / test-latest jdk17 10/20 / org.apache.cassandra.cql3.selection.SelectorSerializationTest-latest_jdk17_x86_64
FAILED:  junit.framework.TestSuite.Tests / test-latest jdk21 10/20 / org.apache.cassandra.cql3.selection.SelectorSerializationTest-latest_jdk21_x86_64
FAILED:  junit.framework.TestSuite.Tests / test-latest jdk11 11/20 / org.apache.cassandra.cql3.selection.TermSelectionTest-latest_jdk11_x86_64
FAILED:  junit.framework.TestSuite.Tests / test-latest jdk17 11/20 / org.apache.cassandra.cql3.selection.TermSelectionTest-latest_jdk17_x86_64
FAILED:  junit.framework.TestSuite.Tests / test-latest jdk21 11/20 / org.apache.cassandra.cql3.selection.TermSelectionTest-latest_jdk21_x86_64
FAILED:  junit.framework.TestSuite.Tests / test-latest jdk11 15/20 / org.apache.cassandra.cql3.statements.AddIdentityStatementTest-latest_jdk11_x86_64
FAILED:  junit.framework.TestSuite.Tests / test-latest jdk17 15/20 / org.apache.cassandra.cql3.statements.AddIdentityStatementTest-latest_jdk17_x86_64
FAILED:  junit.framework.TestSuite.Tests / test-latest jdk21 15/20 / org.apache.cassandra.cql3.statements.AddIdentityStatementTest-latest_jdk21_x86_64
FAILED:  junit.framework.TestSuite.Tests / test-latest jdk11 17/20 / org.apache.cassandra.cql3.statements.CreateRoleStatementTest-latest_jdk11_x86_64
FAILED:  junit.framework.TestSuite.Tests / test-latest jdk17 17/20 / org.apache.cassandra.cql3.statements.CreateRoleStatementTest-latest_jdk17_x86_64
FAILED:  junit.framework.TestSuite.Tests / test-latest jdk21 17/20 / org.apache.cassandra.cql3.statements.CreateRoleStatementTest-latest_jdk21_x86_64
FAILED:  junit.framework.TestSuite.Tests / test-latest jdk11 19/20 / org.apache.cassandra.cql3.statements.DescribeStatementTest-latest_jdk11_x86_64
FAILED:  junit.framework.TestSuite.Tests / test-latest jdk17 19/20 / org.apache.cassandra.cql3.statements.DescribeStatementTest-latest_jdk17_x86_64
FAILED:  junit.framework.TestSuite.Tests / test-latest jdk21 19/20 / org.apache.cassandra.cql3.statements.DescribeStatementTest-latest_jdk21_x86_64
FAILED:  junit.framework.TestSuite.Tests / test-latest jdk11 20/20 / org.apache.cassandra.cql3.statements.DropIdentityStatementTest-latest_jdk11_x86_64
FAILED:  junit.framework.TestSuite.Tests / test-latest jdk17 20/20 / org.apache.cassandra.cql3.statements.DropIdentityStatementTest-latest_jdk17_x86_64
FAILED:  junit.framework.TestSuite.Tests / test-latest jdk21 20/20 / org.apache.cassandra.cql3.statements.DropIdentityStatementTest-latest_jdk21_x86_64
FAILED:  junit.framework.TestSuite.Tests / test-latest jdk11 1/20 / org.apache.cassandra.cql3.statements.ListSuperUsersStatementTest-latest_jdk11_x86_64
FAILED:  junit.framework.TestSuite.Tests / test-latest jdk17 1/20 / org.apache.cassandra.cql3.statements.ListSuperUsersStatementTest-latest_jdk17_x86_64
FAILED:  junit.framework.TestSuite.Tests / test-latest jdk21 1/20 / org.apache.cassandra.cql3.statements.ListSuperUsersStatementTest-latest_jdk21_x86_64
FAILED:  junit.framework.TestSuite.Tests / test-latest jdk11 4/20 / org.apache.cassandra.cql3.statements.SelectStatementTest-latest_jdk11_x86_64
FAILED:  junit.framework.TestSuite.Tests / test-latest jdk17 4/20 / org.apache.cassandra.cql3.statements.SelectStatementTest-latest_jdk17_x86_64
FAILED:  junit.framework.TestSuite.Tests / test-latest jdk21 4/20 / org.apache.cassandra.cql3.statements.SelectStatementTest-latest_jdk21_x86_64
FAILED:  junit.framework.TestSuite.Tests / test-latest jdk11 5/20 / org.apache.cassandra.cql3.statements.TransactionStatementTest-latest_jdk11_x86_64
FAILED:  junit.framework.TestSuite.Tests / test-latest jdk17 5/20 / org.apache.cassandra.cql3.statements.TransactionStatementTest-latest_jdk17_x86_64
FAILED:  junit.framework.TestSuite.Tests / test-latest jdk21 5/20 / org.apache.cassandra.cql3.statements.TransactionStatementTest-latest_jdk21_x86_64
FAILED:  junit.framework.TestSuite.Tests / test-latest jdk11 9/20 / org.apache.cassandra.cql3.terms.ListsTest-latest_jdk11_x86_64
FAILED:  junit.framework.TestSuite.Tests / test-latest jdk17 9/20 / org.apache.cassandra.cql3.terms.ListsTest-latest_jdk17_x86_64
FAILED:  junit.framework.TestSuite.Tests / test-latest jdk21 9/20 / org.apache.cassandra.cql3.terms.ListsTest-latest_jdk21_x86_64
FAILED:  junit.framework.TestSuite.Tests / test-latest jdk11 13/20 / org.apache.cassandra.cql3.validation.entities.CollectionsTest-latest_jdk11_x86_64
FAILED:  junit.framework.TestSuite.Tests / test-latest jdk17 13/20 / org.apache.cassandra.cql3.validation.entities.CollectionsTest-latest_jdk17_x86_64
FAILED:  junit.framework.TestSuite.Tests / test-latest jdk21 13/20 / org.apache.cassandra.cql3.validation.entities.CollectionsTest-latest_jdk21_x86_64
FAILED:  junit.framework.TestSuite.Tests / test-latest jdk11 14/20 / org.apache.cassandra.cql3.validation.entities.CountersTest-latest_jdk11_x86_64
FAILED:  junit.framework.TestSuite.Tests / test-latest jdk17 14/20 / org.apache.cassandra.cql3.validation.entities.CountersTest-latest_jdk17_x86_64
FAILED:  junit.framework.TestSuite.Tests / test-latest jdk21 14/20 / org.apache.cassandra.cql3.validation.entities.CountersTest-latest_jdk21_x86_64
FAILED:  junit.framework.TestSuite.Tests / test-latest jdk11 15/20 / org.apache.cassandra.cql3.validation.entities.DateTypeTest-latest_jdk11_x86_64
FAILED:  junit.framework.TestSuite.Tests / test-latest jdk17 15/20 / org.apache.cassandra.cql3.validation.entities.DateTypeTest-latest_jdk17_x86_64
FAILED:  junit.framework.TestSuite.Tests / test-latest jdk21 15/20 / org.apache.cassandra.cql3.validation.entities.DateTypeTest-latest_jdk21_x86_64
FAILED:  junit.framework.TestSuite.Tests / test-latest jdk11 16/20 / org.apache.cassandra.cql3.validation.entities.FrozenCollectionsTest-latest_jdk11_x86_64
FAILED:  junit.framework.TestSuite.Tests / test-latest jdk17 16/20 / org.apache.cassandra.cql3.validation.entities.FrozenCollectionsTest-latest_jdk17_x86_64
FAILED:  junit.framework.TestSuite.Tests / test-latest jdk21 16/20 / org.apache.cassandra.cql3.validation.entities.FrozenCollectionsTest-latest_jdk21_x86_64
FAILED:  junit.framework.TestSuite.Tests / test-latest jdk11 17/20 / org.apache.cassandra.cql3.validation.entities.JsonTest-latest_jdk11_x86_64
FAILED:  junit.framework.TestSuite.Tests / test-latest jdk17 17/20 / org.apache.cassandra.cql3.validation.entities.JsonTest-latest_jdk17_x86_64
FAILED:  junit.framework.TestSuite.Tests / test-latest jdk21 17/20 / org.apache.cassandra.cql3.validation.entities.JsonTest-latest_jdk21_x86_64
FAILED:  junit.framework.TestSuite.Tests / test-latest jdk11 18/20 / org.apache.cassandra.cql3.validation.entities.SecondaryIndexOnMapEntriesTest-latest_jdk11_x86_64
FAILED:  junit.framework.TestSuite.Tests / test-latest jdk17 18/20 / org.apache.cassandra.cql3.validation.entities.SecondaryIndexOnMapEntriesTest-latest_jdk17_x86_64
FAILED:  junit.framework.TestSuite.Tests / test-latest jdk21 18/20 / org.apache.cassandra.cql3.validation.entities.SecondaryIndexOnMapEntriesTest-latest_jdk21_x86_64
FAILED:  junit.framework.TestSuite.Tests / test-latest jdk11 19/20 / org.apache.cassandra.cql3.validation.entities.SecondaryIndexOnStaticColumnTest-latest_jdk11_x86_64
FAILED:  junit.framework.TestSuite.Tests / test-latest jdk17 19/20 / org.apache.cassandra.cql3.validation.entities.SecondaryIndexOnStaticColumnTest-latest_jdk17_x86_64
FAILED:  junit.framework.TestSuite.Tests / test-latest jdk21 19/20 / org.apache.cassandra.cql3.validation.entities.SecondaryIndexOnStaticColumnTest-latest_jdk21_x86_64
FAILED:  junit.framework.TestSuite.Tests / test-latest jdk11 20/20 / org.apache.cassandra.cql3.validation.entities.SecondaryIndexTest-latest_jdk11_x86_64
FAILED:  junit.framework.TestSuite.Tests / test-latest jdk17 20/20 / org.apache.cassandra.cql3.validation.entities.SecondaryIndexTest-latest_jdk17_x86_64
FAILED:  junit.framework.TestSuite.Tests / test-latest jdk21 20/20 / org.apache.cassandra.cql3.validation.entities.SecondaryIndexTest-latest_jdk21_x86_64
FAILED:  junit.framework.TestSuite.Tests / test-latest jdk11 1/20 / org.apache.cassandra.cql3.validation.entities.StaticColumnsTest-latest_jdk11_x86_64
FAILED:  junit.framework.TestSuite.Tests / test-latest jdk17 1/20 / org.apache.cassandra.cql3.validation.entities.StaticColumnsTest-latest_jdk17_x86_64
FAILED:  junit.framework.TestSuite.Tests / test-latest jdk21 1/20 / org.apache.cassandra.cql3.validation.entities.StaticColumnsTest-latest_jdk21_x86_64
FAILED:  junit.framework.TestSuite.Tests / test-latest jdk11 2/20 / org.apache.cassandra.cql3.validation.entities.TimestampTest-latest_jdk11_x86_64
FAILED:  junit.framework.TestSuite.Tests / test-latest jdk17 2/20 / org.apache.cassandra.cql3.validation.entities.TimestampTest-latest_jdk17_x86_64
FAILED:  junit.framework.TestSuite.Tests / test-latest jdk21 2/20 / org.apache.cassandra.cql3.validation.entities.TimestampTest-latest_jdk21_x86_64
FAILED:  junit.framework.TestSuite.Tests / test-latest jdk11 3/20 / org.apache.cassandra.cql3.validation.entities.TimeuuidTest-latest_jdk11_x86_64
FAILED:  junit.framework.TestSuite.Tests / test-latest jdk17 3/20 / org.apache.cassandra.cql3.validation.entities.TimeuuidTest-latest_jdk17_x86_64
FAILED:  junit.framework.TestSuite.Tests / test-latest jdk21 3/20 / org.apache.cassandra.cql3.validation.entities.TimeuuidTest-latest_jdk21_x86_64
FAILED:  junit.framework.TestSuite.Tests / test-latest jdk11 4/20 / org.apache.cassandra.cql3.validation.entities.TupleTypeTest-latest_jdk11_x86_64
FAILED:  junit.framework.TestSuite.Tests / test-latest jdk17 4/20 / org.apache.cassandra.cql3.validation.entities.TupleTypeTest-latest_jdk17_x86_64
FAILED:  junit.framework.TestSuite.Tests / test-latest jdk21 4/20 / org.apache.cassandra.cql3.validation.entities.TupleTypeTest-latest_jdk21_x86_64
FAILED:  junit.framework.TestSuite.Tests / test-latest jdk11 5/20 / org.apache.cassandra.cql3.validation.entities.TypeTest-latest_jdk11_x86_64
FAILED:  junit.framework.TestSuite.Tests / test-latest jdk17 5/20 / org.apache.cassandra.cql3.validation.entities.TypeTest-latest_jdk17_x86_64
FAILED:  junit.framework.TestSuite.Tests / test-latest jdk21 5/20 / org.apache.cassandra.cql3.validation.entities.TypeTest-latest_jdk21_x86_64
FAILED:  junit.framework.TestSuite.Tests / test-latest jdk11 6/20 / org.apache.cassandra.cql3.validation.entities.UFAuthTest-latest_jdk11_x86_64
FAILED:  junit.framework.TestSuite.Tests / test-latest jdk17 6/20 / org.apache.cassandra.cql3.validation.entities.UFAuthTest-latest_jdk17_x86_64
FAILED:  junit.framework.TestSuite.Tests / test-latest jdk21 6/20 / org.apache.cassandra.cql3.validation.entities.UFAuthTest-latest_jdk21_x86_64
FAILED:  junit.framework.TestSuite.Tests / test-latest jdk11 7/20 / org.apache.cassandra.cql3.validation.entities.UFIdentificationTest-latest_jdk11_x86_64
FAILED:  junit.framework.TestSuite.Tests / test-latest jdk17 7/20 / org.apache.cassandra.cql3.validation.entities.UFIdentificationTest-latest_jdk17_x86_64
FAILED:  junit.framework.TestSuite.Tests / test-latest jdk21 7/20 / org.apache.cassandra.cql3.validation.entities.UFIdentificationTest-latest_jdk21_x86_64
FAILED:  junit.framework.TestSuite.Tests / test-latest jdk11 8/20 / org.apache.cassandra.cql3.validation.entities.UFJavaTest-latest_jdk11_x86_64
FAILED:  junit.framework.TestSuite.Tests / test-latest jdk17 8/20 / org.apache.cassandra.cql3.validation.entities.UFJavaTest-latest_jdk17_x86_64
FAILED:  junit.framework.TestSuite.Tests / test-latest jdk21 8/20 / org.apache.cassandra.cql3.validation.entities.UFJavaTest-latest_jdk21_x86_64
FAILED:  junit.framework.TestSuite.Tests / test-latest jdk11 9/20 / org.apache.cassandra.cql3.validation.entities.UFSecurityTest-latest_jdk11_x86_64
FAILED:  junit.framework.TestSuite.Tests / test-latest jdk17 9/20 / org.apache.cassandra.cql3.validation.entities.UFSecurityTest-latest_jdk17_x86_64
FAILED:  junit.framework.TestSuite.Tests / test-latest jdk21 9/20 / org.apache.cassandra.cql3.validation.entities.UFSecurityTest-latest_jdk21_x86_64
FAILED:  junit.framework.TestSuite.Tests / test-latest jdk11 10/20 / org.apache.cassandra.cql3.validation.entities.UFTest-latest_jdk11_x86_64
FAILED:  junit.framework.TestSuite.Tests / test-latest jdk17 10/20 / org.apache.cassandra.cql3.validation.entities.UFTest-latest_jdk17_x86_64
FAILED:  junit.framework.TestSuite.Tests / test-latest jdk21 10/20 / org.apache.cassandra.cql3.validation.entities.UFTest-latest_jdk21_x86_64
FAILED:  junit.framework.TestSuite.Tests / test-latest jdk11 11/20 / org.apache.cassandra.cql3.validation.entities.UFTypesTest-latest_jdk11_x86_64
FAILED:  junit.framework.TestSuite.Tests / test-latest jdk17 11/20 / org.apache.cassandra.cql3.validation.entities.UFTypesTest-latest_jdk17_x86_64
FAILED:  junit.framework.TestSuite.Tests / test-latest jdk21 11/20 / org.apache.cassandra.cql3.validation.entities.UFTypesTest-latest_jdk21_x86_64
FAILED:  junit.framework.TestSuite.Tests / test-latest jdk11 12/20 / org.apache.cassandra.cql3.validation.entities.UFVerifierTest-latest_jdk11_x86_64
FAILED:  junit.framework.TestSuite.Tests / test-latest jdk17 12/20 / org.apache.cassandra.cql3.validation.entities.UFVerifierTest-latest_jdk17_x86_64
FAILED:  junit.framework.TestSuite.Tests / test-latest jdk21 12/20 / org.apache.cassandra.cql3.validation.entities.UFVerifierTest-latest_jdk21_x86_64
FAILED:  junit.framework.TestSuite.Tests / test-latest jdk11 13/20 / org.apache.cassandra.cql3.validation.entities.UserTypesTest-latest_jdk11_x86_64
FAILED:  junit.framework.TestSuite.Tests / test-latest jdk17 13/20 / org.apache.cassandra.cql3.validation.entities.UserTypesTest-latest_jdk17_x86_64
FAILED:  junit.framework.TestSuite.Tests / test-latest jdk21 13/20 / org.apache.cassandra.cql3.validation.entities.UserTypesTest-latest_jdk21_x86_64
FAILED:  junit.framework.TestSuite.Tests / test-latest jdk11 14/20 / org.apache.cassandra.cql3.validation.entities.VectorsTest-latest_jdk11_x86_64
FAILED:  junit.framework.TestSuite.Tests / test-latest jdk17 14/20 / org.apache.cassandra.cql3.validation.entities.VectorsTest-latest_jdk17_x86_64
FAILED:  junit.framework.TestSuite.Tests / test-latest jdk21 14/20 / org.apache.cassandra.cql3.validation.entities.VectorsTest-latest_jdk21_x86_64
FAILED:  junit.framework.TestSuite.Tests / test-latest jdk11 15/20 / org.apache.cassandra.cql3.validation.entities.VirtualTableTest-latest_jdk11_x86_64
FAILED:  junit.framework.TestSuite.Tests / test-latest jdk17 15/20 / org.apache.cassandra.cql3.validation.entities.VirtualTableTest-latest_jdk17_x86_64
FAILED:  junit.framework.TestSuite.Tests / test-latest jdk21 15/20 / org.apache.cassandra.cql3.validation.entities.VirtualTableTest-latest_jdk21_x86_64
FAILED:  junit.framework.TestSuite.Tests / test-latest jdk11 16/20 / org.apache.cassandra.cql3.validation.entities.WritetimeOrTTLTest-latest_jdk11_x86_64
FAILED:  junit.framework.TestSuite.Tests / test-latest jdk17 16/20 / org.apache.cassandra.cql3.validation.entities.WritetimeOrTTLTest-latest_jdk17_x86_64
FAILED:  junit.framework.TestSuite.Tests / test-latest jdk21 16/20 / org.apache.cassandra.cql3.validation.entities.WritetimeOrTTLTest-latest_jdk21_x86_64
FAILED:  junit.framework.TestSuite.Tests / test-latest jdk11 17/20 / org.apache.cassandra.cql3.validation.miscellaneous.CommentAndSecurityLabelTest-latest_jdk11_x86_64
FAILED:  junit.framework.TestSuite.Tests / test-latest jdk17 17/20 / org.apache.cassandra.cql3.validation.miscellaneous.CommentAndSecurityLabelTest-latest_jdk17_x86_64
FAILED:  junit.framework.TestSuite.Tests / test-latest jdk21 17/20 / org.apache.cassandra.cql3.validation.miscellaneous.CommentAndSecurityLabelTest-latest_jdk21_x86_64
FAILED:  junit.framework.TestSuite.Tests / test-latest jdk11 18/20 / org.apache.cassandra.cql3.validation.miscellaneous.CrcCheckChanceTest-latest_jdk11_x86_64
FAILED:  junit.framework.TestSuite.Tests / test-latest jdk17 18/20 / org.apache.cassandra.cql3.validation.miscellaneous.CrcCheckChanceTest-latest_jdk17_x86_64
FAILED:  junit.framework.TestSuite.Tests / test-latest jdk21 18/20 / org.apache.cassandra.cql3.validation.miscellaneous.CrcCheckChanceTest-latest_jdk21_x86_64
FAILED:  junit.framework.TestSuite.Tests / test-latest jdk11 19/20 / org.apache.cassandra.cql3.validation.miscellaneous.OverflowTest-latest_jdk11_x86_64
FAILED:  junit.framework.TestSuite.Tests / test-latest jdk17 19/20 / org.apache.cassandra.cql3.validation.miscellaneous.OverflowTest-latest_jdk17_x86_64
FAILED:  junit.framework.TestSuite.Tests / test-latest jdk21 19/20 / org.apache.cassandra.cql3.validation.miscellaneous.OverflowTest-latest_jdk21_x86_64
FAILED:  junit.framework.TestSuite.Tests / test-latest jdk11 20/20 / org.apache.cassandra.cql3.validation.miscellaneous.PgStringTest-latest_jdk11_x86_64
FAILED:  junit.framework.TestSuite.Tests / test-latest jdk17 20/20 / org.apache.cassandra.cql3.validation.miscellaneous.PgStringTest-latest_jdk17_x86_64
FAILED:  junit.framework.TestSuite.Tests / test-latest jdk21 20/20 / org.apache.cassandra.cql3.validation.miscellaneous.PgStringTest-latest_jdk21_x86_64
FAILED:  junit.framework.TestSuite.Tests / test-latest jdk11 1/20 / org.apache.cassandra.cql3.validation.miscellaneous.PreparedStatementTest-latest_jdk11_x86_64
FAILED:  junit.framework.TestSuite.Tests / test-latest jdk17 1/20 / org.apache.cassandra.cql3.validation.miscellaneous.PreparedStatementTest-latest_jdk17_x86_64
FAILED:  junit.framework.TestSuite.Tests / test-latest jdk21 1/20 / org.apache.cassandra.cql3.validation.miscellaneous.PreparedStatementTest-latest_jdk21_x86_64
FAILED:  junit.framework.TestSuite.Tests / test-latest jdk11 2/20 / org.apache.cassandra.cql3.validation.miscellaneous.RoleSyntaxTest-latest_jdk11_x86_64
FAILED:  junit.framework.TestSuite.Tests / test-latest jdk17 2/20 / org.apache.cassandra.cql3.validation.miscellaneous.RoleSyntaxTest-latest_jdk17_x86_64
FAILED:  junit.framework.TestSuite.Tests / test-latest jdk21 2/20 / org.apache.cassandra.cql3.validation.miscellaneous.RoleSyntaxTest-latest_jdk21_x86_64
FAILED:  junit.framework.TestSuite.Tests / test-latest jdk11 3/20 / org.apache.cassandra.cql3.validation.miscellaneous.SSTableMetadataTrackingTest-latest_jdk11_x86_64
... and 3679 other failed tests.

  -------------------------------------------------------------------------------
  For complete test report and logs see https://nightlies.apache.org/cassandra/Cassandra-trunk/2481/