You are viewing a plain text version of this content. The canonical link for it is here.
Posted to issues@bookkeeper.apache.org by Apache Jenkins Server <je...@builds.apache.org> on 2020/08/18 12:54:18 UTC
Build failed in Jenkins: bookkeeper_postcommit_validation_master
#806
See <https://builds.apache.org/job/bookkeeper_postcommit_validation_master/806/display/redirect>
Changes:
------------------------------------------
Started by timer
Running as SYSTEM
[EnvInject] - Loading node environment variables.
Building remotely on H30 (ubuntu) in workspace /home/jenkins/jenkins-slave/workspace/bookkeeper_postcommit_validation_master
[WS-CLEANUP] Deleting project workspace...
[WS-CLEANUP] Deferred wipeout is used...
[WS-CLEANUP] Done
No credentials specified
Cloning the remote Git repository
Cloning repository https://github.com/apache/bookkeeper.git
> git init /home/jenkins/jenkins-slave/workspace/bookkeeper_postcommit_validation_master # timeout=10
Fetching upstream changes from https://github.com/apache/bookkeeper.git
> git --version # timeout=10
> git fetch --tags --progress -- https://github.com/apache/bookkeeper.git +refs/heads/*:refs/remotes/origin/*
> git config remote.origin.url https://github.com/apache/bookkeeper.git # timeout=10
> git config --add remote.origin.fetch +refs/heads/*:refs/remotes/origin/* # timeout=10
> git config remote.origin.url https://github.com/apache/bookkeeper.git # timeout=10
Fetching upstream changes from https://github.com/apache/bookkeeper.git
> git fetch --tags --progress -- https://github.com/apache/bookkeeper.git +refs/heads/*:refs/remotes/origin/* +refs/pull/${ghprbPullId}/*:refs/remotes/origin/pr/${ghprbPullId}/*
> git rev-parse origin/master^{commit} # timeout=10
Checking out Revision af13a89c9cc3a90e0da361c9488a1cceb19506f8 (origin/master)
> git config core.sparsecheckout # timeout=10
> git checkout -f af13a89c9cc3a90e0da361c9488a1cceb19506f8
Commit message: "Issue 2399 Move CI builds to ci-hadoop.apache.org - rename self job seed configuration in order to disable it temporary"
> git rev-list --no-walk af13a89c9cc3a90e0da361c9488a1cceb19506f8 # timeout=10
Cleaning workspace
> git rev-parse --verify HEAD # timeout=10
Resetting working tree
> git reset --hard # timeout=10
> git clean -fdx # timeout=10
Parsing POMs
ERROR: Processing failed due to a bug in the code. Please report this to the issue tracker (https://jenkins.io/redirect/report-an-issue).
hudson.remoting.RequestAbortedException: java.io.IOException: Unexpected termination of the channel
at hudson.remoting.Request.abort(Request.java:340)
at hudson.remoting.Channel.terminate(Channel.java:1040)
at hudson.remoting.SynchronousCommandTransport$ReaderThread.run(SynchronousCommandTransport.java:94)
Suppressed: hudson.remoting.Channel$CallSiteStackTrace: Remote call to H30
at hudson.remoting.Channel.attachCallSiteStackTrace(Channel.java:1743)
at hudson.remoting.Request.call(Request.java:202)
at hudson.remoting.Channel.call(Channel.java:956)
at hudson.FilePath.act(FilePath.java:1072)
at hudson.FilePath.act(FilePath.java:1061)
at hudson.maven.MavenModuleSetBuild$MavenModuleSetBuildExecution.parsePoms(MavenModuleSetBuild.java:987)
at hudson.maven.MavenModuleSetBuild$MavenModuleSetBuildExecution.doRun(MavenModuleSetBuild.java:691)
at hudson.model.AbstractBuild$AbstractBuildExecution.run(AbstractBuild.java:504)
at hudson.model.Run.execute(Run.java:1815)
at hudson.maven.MavenModuleSetBuild.run(MavenModuleSetBuild.java:543)
at hudson.model.ResourceController.execute(ResourceController.java:97)
at hudson.model.Executor.run(Executor.java:429)
Caused by: java.io.IOException: Unexpected termination of the channel
at hudson.remoting.SynchronousCommandTransport$ReaderThread.run(SynchronousCommandTransport.java:77)
Caused by: java.io.EOFException
at java.io.ObjectInputStream$PeekInputStream.readFully(ObjectInputStream.java:2681)
at java.io.ObjectInputStream$BlockDataInputStream.readShort(ObjectInputStream.java:3156)
at java.io.ObjectInputStream.readStreamHeader(ObjectInputStream.java:862)
at java.io.ObjectInputStream.<init>(ObjectInputStream.java:358)
at hudson.remoting.ObjectInputStreamEx.<init>(ObjectInputStreamEx.java:49)
at hudson.remoting.Command.readFrom(Command.java:140)
at hudson.remoting.Command.readFrom(Command.java:126)
at hudson.remoting.AbstractSynchronousByteArrayCommandTransport.read(AbstractSynchronousByteArrayCommandTransport.java:36)
at hudson.remoting.SynchronousCommandTransport$ReaderThread.run(SynchronousCommandTransport.java:63)
project=hudson.maven.MavenModuleSet@29882f24[bookkeeper_postcommit_validation_master]
project.getModules()=[hudson.maven.MavenModule@6ea58e6[bookkeeper_postcommit_validation_master/org.apache.bookkeeper:bk-grpc-name-resolver][bookkeeper_postcommit_validation_master/org.apache.bookkeeper:bk-grpc-name-resolver][relativePath:stream/bk-grpc-name-resolver], hudson.maven.MavenModule@36984039[bookkeeper_postcommit_validation_master/org.apache.bookkeeper:bkctl][bookkeeper_postcommit_validation_master/org.apache.bookkeeper:bkctl][relativePath:bookkeeper-dist/bkctl], hudson.maven.MavenModule@7a670fd9[bookkeeper_postcommit_validation_master/org.apache.bookkeeper:bookkeeper][bookkeeper_postcommit_validation_master/org.apache.bookkeeper:bookkeeper][relativePath:], hudson.maven.MavenModule@227da1d4[bookkeeper_postcommit_validation_master/org.apache.bookkeeper:bookkeeper-benchmark][bookkeeper_postcommit_validation_master/org.apache.bookkeeper:bookkeeper-benchmark][relativePath:bookkeeper-benchmark], hudson.maven.MavenModule@3c98e926[bookkeeper_postcommit_validation_master/org.apache.bookkeeper:bookkeeper-common][bookkeeper_postcommit_validation_master/org.apache.bookkeeper:bookkeeper-common][relativePath:bookkeeper-common], hudson.maven.MavenModule@20b2c6b4[bookkeeper_postcommit_validation_master/org.apache.bookkeeper:bookkeeper-common-allocator][bookkeeper_postcommit_validation_master/org.apache.bookkeeper:bookkeeper-common-allocator][relativePath:bookkeeper-common-allocator], hudson.maven.MavenModule@3cfbfe7f[bookkeeper_postcommit_validation_master/org.apache.bookkeeper:bookkeeper-dist][bookkeeper_postcommit_validation_master/org.apache.bookkeeper:bookkeeper-dist][relativePath:bookkeeper-dist], hudson.maven.MavenModule@1012e75f[bookkeeper_postcommit_validation_master/org.apache.bookkeeper:bookkeeper-dist-all][bookkeeper_postcommit_validation_master/org.apache.bookkeeper:bookkeeper-dist-all][relativePath:bookkeeper-dist/all], hudson.maven.MavenModule@3b137c7f[bookkeeper_postcommit_validation_master/org.apache.bookkeeper:bookkeeper-dist-server][bookkeeper_postcommit_validation_master/org.apache.bookkeeper:bookkeeper-dist-server][relativePath:bookkeeper-dist/server], hudson.maven.MavenModule@2b3b76d[bookkeeper_postcommit_validation_master/org.apache.bookkeeper:bookkeeper-perf][bookkeeper_postcommit_validation_master/org.apache.bookkeeper:bookkeeper-perf][relativePath:tools/perf], hudson.maven.MavenModule@3948d15b[bookkeeper_postcommit_validation_master/org.apache.bookkeeper:bookkeeper-proto][bookkeeper_postcommit_validation_master/org.apache.bookkeeper:bookkeeper-proto][relativePath:bookkeeper-proto], hudson.maven.MavenModule@47267238[bookkeeper_postcommit_validation_master/org.apache.bookkeeper:bookkeeper-server][bookkeeper_postcommit_validation_master/org.apache.bookkeeper:bookkeeper-server][relativePath:bookkeeper-server], hudson.maven.MavenModule@646bb0d9[bookkeeper_postcommit_validation_master/org.apache.bookkeeper:bookkeeper-server-shaded][bookkeeper_postcommit_validation_master/org.apache.bookkeeper:bookkeeper-server-shaded][relativePath:shaded/bookkeeper-server-shaded], hudson.maven.MavenModule@453824a3[bookkeeper_postcommit_validation_master/org.apache.bookkeeper:bookkeeper-server-tests-shaded][bookkeeper_postcommit_validation_master/org.apache.bookkeeper:bookkeeper-server-tests-shaded][relativePath:shaded/bookkeeper-server-tests-shaded], hudson.maven.MavenModule@54554514[bookkeeper_postcommit_validation_master/org.apache.bookkeeper:bookkeeper-stats-providers][bookkeeper_postcommit_validation_master/org.apache.bookkeeper:bookkeeper-stats-providers][relativePath:bookkeeper-stats-providers], hudson.maven.MavenModule@3867ad1f[bookkeeper_postcommit_validation_master/org.apache.bookkeeper:bookkeeper-tools][bookkeeper_postcommit_validation_master/org.apache.bookkeeper:bookkeeper-tools][relativePath:tools/all], hudson.maven.MavenModule@25eea57f[bookkeeper_postcommit_validation_master/org.apache.bookkeeper:bookkeeper-tools-framework][bookkeeper_postcommit_validation_master/org.apache.bookkeeper:bookkeeper-tools-framework][relativePath:tools/framework], hudson.maven.MavenModule@680a33d4[bookkeeper_postcommit_validation_master/org.apache.bookkeeper:bookkeeper-tools-ledger][bookkeeper_postcommit_validation_master/org.apache.bookkeeper:bookkeeper-tools-ledger][relativePath:tools/ledger], hudson.maven.MavenModule@af75966[bookkeeper_postcommit_validation_master/org.apache.bookkeeper:bookkeeper-tools-parent][bookkeeper_postcommit_validation_master/org.apache.bookkeeper:bookkeeper-tools-parent][relativePath:tools], hudson.maven.MavenModule@5d15e642[bookkeeper_postcommit_validation_master/org.apache.bookkeeper:buildtools][bookkeeper_postcommit_validation_master/org.apache.bookkeeper:buildtools][relativePath:buildtools], hudson.maven.MavenModule@21e702c0[bookkeeper_postcommit_validation_master/org.apache.bookkeeper:circe-checksum][bookkeeper_postcommit_validation_master/org.apache.bookkeeper:circe-checksum][relativePath:circe-checksum], hudson.maven.MavenModule@70c5eee5[bookkeeper_postcommit_validation_master/org.apache.bookkeeper:cpu-affinity][bookkeeper_postcommit_validation_master/org.apache.bookkeeper:cpu-affinity][relativePath:cpu-affinity], hudson.maven.MavenModule@22a21561[bookkeeper_postcommit_validation_master/org.apache.bookkeeper:microbenchmarks][bookkeeper_postcommit_validation_master/org.apache.bookkeeper:microbenchmarks][relativePath:microbenchmarks], hudson.maven.MavenModule@7e24be0b[bookkeeper_postcommit_validation_master/org.apache.bookkeeper:shaded-parent][bookkeeper_postcommit_validation_master/org.apache.bookkeeper:shaded-parent][relativePath:shaded], hudson.maven.MavenModule@20375209[bookkeeper_postcommit_validation_master/org.apache.bookkeeper:statelib][bookkeeper_postcommit_validation_master/org.apache.bookkeeper:statelib][relativePath:stream/statelib], hudson.maven.MavenModule@14ee12d9[bookkeeper_postcommit_validation_master/org.apache.bookkeeper:stream-storage-api][bookkeeper_postcommit_validation_master/org.apache.bookkeeper:stream-storage-api][relativePath:stream/api], hudson.maven.MavenModule@7e8e6891[bookkeeper_postcommit_validation_master/org.apache.bookkeeper:stream-storage-cli][bookkeeper_postcommit_validation_master/org.apache.bookkeeper:stream-storage-cli][relativePath:tools/stream], hudson.maven.MavenModule@5cfb046e[bookkeeper_postcommit_validation_master/org.apache.bookkeeper:stream-storage-clients-parent][bookkeeper_postcommit_validation_master/org.apache.bookkeeper:stream-storage-clients-parent][relativePath:stream/clients], hudson.maven.MavenModule@2b3d33a2[bookkeeper_postcommit_validation_master/org.apache.bookkeeper:stream-storage-common][bookkeeper_postcommit_validation_master/org.apache.bookkeeper:stream-storage-common][relativePath:stream/common], hudson.maven.MavenModule@2a885a5d[bookkeeper_postcommit_validation_master/org.apache.bookkeeper:stream-storage-java-client][bookkeeper_postcommit_validation_master/org.apache.bookkeeper:stream-storage-java-client][relativePath:stream/clients/java/all], hudson.maven.MavenModule@1e8e2861[bookkeeper_postcommit_validation_master/org.apache.bookkeeper:stream-storage-java-client-base][bookkeeper_postcommit_validation_master/org.apache.bookkeeper:stream-storage-java-client-base][relativePath:stream/clients/java/base], hudson.maven.MavenModule@7f7d0220[bookkeeper_postcommit_validation_master/org.apache.bookkeeper:stream-storage-java-client-parent][bookkeeper_postcommit_validation_master/org.apache.bookkeeper:stream-storage-java-client-parent][relativePath:stream/clients/java], hudson.maven.MavenModule@29894fee[bookkeeper_postcommit_validation_master/org.apache.bookkeeper:stream-storage-java-kv-client][bookkeeper_postcommit_validation_master/org.apache.bookkeeper:stream-storage-java-kv-client][relativePath:stream/clients/java/kv], hudson.maven.MavenModule@5614fa3e[bookkeeper_postcommit_validation_master/org.apache.bookkeeper:stream-storage-parent][bookkeeper_postcommit_validation_master/org.apache.bookkeeper:stream-storage-parent][relativePath:stream], hudson.maven.MavenModule@2ee2b213[bookkeeper_postcommit_validation_master/org.apache.bookkeeper:stream-storage-proto][bookkeeper_postcommit_validation_master/org.apache.bookkeeper:stream-storage-proto][relativePath:stream/proto], hudson.maven.MavenModule@6265e034[bookkeeper_postcommit_validation_master/org.apache.bookkeeper:stream-storage-server][bookkeeper_postcommit_validation_master/org.apache.bookkeeper:stream-storage-server][relativePath:stream/server], hudson.maven.MavenModule@2fbed0a1[bookkeeper_postcommit_validation_master/org.apache.bookkeeper:stream-storage-service-api][bookkeeper_postcommit_validation_master/org.apache.bookkeeper:stream-storage-service-api][relativePath:stream/storage/api], hudson.maven.MavenModule@78372006[bookkeeper_postcommit_validation_master/org.apache.bookkeeper:stream-storage-service-impl][bookkeeper_postcommit_validation_master/org.apache.bookkeeper:stream-storage-service-impl][relativePath:stream/storage/impl], hudson.maven.MavenModule@95a4b52[bookkeeper_postcommit_validation_master/org.apache.bookkeeper:stream-storage-service-parent][bookkeeper_postcommit_validation_master/org.apache.bookkeeper:stream-storage-service-parent][relativePath:stream/storage], hudson.maven.MavenModule@d61f626[bookkeeper_postcommit_validation_master/org.apache.bookkeeper.http:bookkeeper-http][bookkeeper_postcommit_validation_master/org.apache.bookkeeper.http:bookkeeper-http][relativePath:bookkeeper-http], hudson.maven.MavenModule@43865466[bookkeeper_postcommit_validation_master/org.apache.bookkeeper.http:http-server][bookkeeper_postcommit_validation_master/org.apache.bookkeeper.http:http-server][relativePath:bookkeeper-http/http-server], hudson.maven.MavenModule@5d9ba6a8[bookkeeper_postcommit_validation_master/org.apache.bookkeeper.http:twitter-http-server][bookkeeper_postcommit_validation_master/org.apache.bookkeeper.http:twitter-http-server][relativePath:bookkeeper-http/twitter-http-server], hudson.maven.MavenModule@33f44628[bookkeeper_postcommit_validation_master/org.apache.bookkeeper.http:vertx-http-server][bookkeeper_postcommit_validation_master/org.apache.bookkeeper.http:vertx-http-server][relativePath:bookkeeper-http/vertx-http-server], hudson.maven.MavenModule@366e0feb[bookkeeper_postcommit_validation_master/org.apache.bookkeeper.metadata.drivers:metadata-drivers-parent][bookkeeper_postcommit_validation_master/org.apache.bookkeeper.metadata.drivers:metadata-drivers-parent][relativePath:metadata-drivers], hudson.maven.MavenModule@24a86bed[bookkeeper_postcommit_validation_master/org.apache.bookkeeper.metadata.drivers:metadata-stores-etcd][bookkeeper_postcommit_validation_master/org.apache.bookkeeper.metadata.drivers:metadata-stores-etcd][relativePath:metadata-drivers/etcd], hudson.maven.MavenModule@77e083ca[bookkeeper_postcommit_validation_master/org.apache.bookkeeper.stats:bookkeeper-stats-api][bookkeeper_postcommit_validation_master/org.apache.bookkeeper.stats:bookkeeper-stats-api][relativePath:bookkeeper-stats], hudson.maven.MavenModule@402f2c8d[bookkeeper_postcommit_validation_master/org.apache.bookkeeper.stats:bookkeeper-stats-parent][bookkeeper_postcommit_validation_master/org.apache.bookkeeper.stats:bookkeeper-stats-parent][relativePath:stats], hudson.maven.MavenModule@3c00fe63[bookkeeper_postcommit_validation_master/org.apache.bookkeeper.stats:bookkeeper-stats-utils][bookkeeper_postcommit_validation_master/org.apache.bookkeeper.stats:bookkeeper-stats-utils][relativePath:stats/utils], hudson.maven.MavenModule@5cf0cdf2[bookkeeper_postcommit_validation_master/org.apache.bookkeeper.stats:codahale-metrics-provider][bookkeeper_postcommit_validation_master/org.apache.bookkeeper.stats:codahale-metrics-provider][relativePath:bookkeeper-stats-providers/codahale-metrics-provider], hudson.maven.MavenModule@46c08741[bookkeeper_postcommit_validation_master/org.apache.bookkeeper.stats:prometheus-metrics-provider][bookkeeper_postcommit_validation_master/org.apache.bookkeeper.stats:prometheus-metrics-provider][relativePath:bookkeeper-stats-providers/prometheus-metrics-provider], hudson.maven.MavenModule@ea4bca5[bookkeeper_postcommit_validation_master/org.apache.bookkeeper.stats:twitter-finagle-provider][bookkeeper_postcommit_validation_master/org.apache.bookkeeper.stats:twitter-finagle-provider][relativePath:bookkeeper-stats-providers/twitter-finagle-provider], hudson.maven.MavenModule@402c093[bookkeeper_postcommit_validation_master/org.apache.bookkeeper.stats:twitter-ostrich-provider][bookkeeper_postcommit_validation_master/org.apache.bookkeeper.stats:twitter-ostrich-provider][relativePath:bookkeeper-stats-providers/twitter-ostrich-provider], hudson.maven.MavenModule@4a93f49a[bookkeeper_postcommit_validation_master/org.apache.bookkeeper.stats:twitter-science-provider][bookkeeper_postcommit_validation_master/org.apache.bookkeeper.stats:twitter-science-provider][relativePath:bookkeeper-stats-providers/twitter-science-provider], hudson.maven.MavenModule@6f002b03[bookkeeper_postcommit_validation_master/org.apache.bookkeeper.tests:all-released-versions-image][bookkeeper_postcommit_validation_master/org.apache.bookkeeper.tests:all-released-versions-image][relativePath:tests/docker-images/all-released-versions-image], hudson.maven.MavenModule@14620fa6[bookkeeper_postcommit_validation_master/org.apache.bookkeeper.tests:all-versions-image][bookkeeper_postcommit_validation_master/org.apache.bookkeeper.tests:all-versions-image][relativePath:tests/docker-images/all-versions-image], hudson.maven.MavenModule@60731589[bookkeeper_postcommit_validation_master/org.apache.bookkeeper.tests:backward-compat][bookkeeper_postcommit_validation_master/org.apache.bookkeeper.tests:backward-compat][relativePath:tests/backward-compat], hudson.maven.MavenModule@61321260[bookkeeper_postcommit_validation_master/org.apache.bookkeeper.tests:current-version-image][bookkeeper_postcommit_validation_master/org.apache.bookkeeper.tests:current-version-image][relativePath:tests/docker-images/current-version-image], hudson.maven.MavenModule@3c0e5d11[bookkeeper_postcommit_validation_master/org.apache.bookkeeper.tests:docker-images][bookkeeper_postcommit_validation_master/org.apache.bookkeeper.tests:docker-images][relativePath:tests/docker-images], hudson.maven.MavenModule@61a9ee7f[bookkeeper_postcommit_validation_master/org.apache.bookkeeper.tests:integration][bookkeeper_postcommit_validation_master/org.apache.bookkeeper.tests:integration][relativePath:tests/integration], hudson.maven.MavenModule@2598186f[bookkeeper_postcommit_validation_master/org.apache.bookkeeper.tests:integration-tests-base][bookkeeper_postcommit_validation_master/org.apache.bookkeeper.tests:integration-tests-base][relativePath:tests/integration-tests-base], hudson.maven.MavenModule@51370180[bookkeeper_postcommit_validation_master/org.apache.bookkeeper.tests:integration-tests-base-groovy][bookkeeper_postcommit_validation_master/org.apache.bookkeeper.tests:integration-tests-base-groovy][relativePath:tests/integration-tests-base-groovy], hudson.maven.MavenModule@5e656f51[bookkeeper_postcommit_validation_master/org.apache.bookkeeper.tests:integration-tests-topologies][bookkeeper_postcommit_validation_master/org.apache.bookkeeper.tests:integration-tests-topologies][relativePath:tests/integration-tests-topologies], hudson.maven.MavenModule@5685402d[bookkeeper_postcommit_validation_master/org.apache.bookkeeper.tests:integration-tests-utils][bookkeeper_postcommit_validation_master/org.apache.bookkeeper.tests:integration-tests-utils][relativePath:tests/integration-tests-utils], hudson.maven.MavenModule@424c1de1[bookkeeper_postcommit_validation_master/org.apache.bookkeeper.tests:scripts][bookkeeper_postcommit_validation_master/org.apache.bookkeeper.tests:scripts][relativePath:tests/scripts], hudson.maven.MavenModule@3a8dd178[bookkeeper_postcommit_validation_master/org.apache.bookkeeper.tests:stream-storage-tests-common][bookkeeper_postcommit_validation_master/org.apache.bookkeeper.tests:stream-storage-tests-common][relativePath:stream/tests-common], hudson.maven.MavenModule@18372743[bookkeeper_postcommit_validation_master/org.apache.bookkeeper.tests:tests-parent][bookkeeper_postcommit_validation_master/org.apache.bookkeeper.tests:tests-parent][relativePath:tests], hudson.maven.MavenModule@215018d2[bookkeeper_postcommit_validation_master/org.apache.bookkeeper.tests.backward-compat:backward-compat-current-server-old-clients][bookkeeper_postcommit_validation_master/org.apache.bookkeeper.tests.backward-compat:backward-compat-current-server-old-clients][relativePath:tests/backward-compat/current-server-old-clients], hudson.maven.MavenModule@e73a400[bookkeeper_postcommit_validation_master/org.apache.bookkeeper.tests.backward-compat:hierarchical-ledger-manager][bookkeeper_postcommit_validation_master/org.apache.bookkeeper.tests.backward-compat:hierarchical-ledger-manager][relativePath:tests/backward-compat/hierarchical-ledger-manager], hudson.maven.MavenModule@4aabe525[bookkeeper_postcommit_validation_master/org.apache.bookkeeper.tests.backward-compat:hostname-bookieid][bookkeeper_postcommit_validation_master/org.apache.bookkeeper.tests.backward-compat:hostname-bookieid][relativePath:tests/backward-compat/hostname-bookieid], hudson.maven.MavenModule@a7be0df[bookkeeper_postcommit_validation_master/org.apache.bookkeeper.tests.backward-compat:old-cookie-new-cluster][bookkeeper_postcommit_validation_master/org.apache.bookkeeper.tests.backward-compat:old-cookie-new-cluster][relativePath:tests/backward-compat/old-cookie-new-cluster], hudson.maven.MavenModule@13cc04b9[bookkeeper_postcommit_validation_master/org.apache.bookkeeper.tests.backward-compat:recovery-no-password][bookkeeper_postcommit_validation_master/org.apache.bookkeeper.tests.backward-compat:recovery-no-password][relativePath:tests/backward-compat/recovery-no-password], hudson.maven.MavenModule@4a3db586[bookkeeper_postcommit_validation_master/org.apache.bookkeeper.tests.backward-compat:tests-parent][bookkeeper_postcommit_validation_master/org.apache.bookkeeper.tests.backward-compat:tests-parent][relativePath:tests/backward-compat], hudson.maven.MavenModule@7bc94ed[bookkeeper_postcommit_validation_master/org.apache.bookkeeper.tests.backward-compat:upgrade][bookkeeper_postcommit_validation_master/org.apache.bookkeeper.tests.backward-compat:upgrade][relativePath:tests/backward-compat/upgrade], hudson.maven.MavenModule@28fd3602[bookkeeper_postcommit_validation_master/org.apache.bookkeeper.tests.backward-compat:upgrade-direct][bookkeeper_postcommit_validation_master/org.apache.bookkeeper.tests.backward-compat:upgrade-direct][relativePath:tests/backward-compat/upgrade-direct], hudson.maven.MavenModule@3ebfbbe7[bookkeeper_postcommit_validation_master/org.apache.bookkeeper.tests.backward-compat:yahoo-custom-version][bookkeeper_postcommit_validation_master/org.apache.bookkeeper.tests.backward-compat:yahoo-custom-version][relativePath:tests/backward-compat/yahoo-custom-version], hudson.maven.MavenModule@1c773b70[bookkeeper_postcommit_validation_master/org.apache.bookkeeper.tests.integration:cluster][bookkeeper_postcommit_validation_master/org.apache.bookkeeper.tests.integration:cluster][relativePath:tests/integration/cluster], hudson.maven.MavenModule@38ce8e1e[bookkeeper_postcommit_validation_master/org.apache.bookkeeper.tests.integration:smoke][bookkeeper_postcommit_validation_master/org.apache.bookkeeper.tests.integration:smoke][relativePath:tests/integration/smoke], hudson.maven.MavenModule@1ae4ae49[bookkeeper_postcommit_validation_master/org.apache.bookkeeper.tests.integration:standalone][bookkeeper_postcommit_validation_master/org.apache.bookkeeper.tests.integration:standalone][relativePath:tests/integration/standalone], hudson.maven.MavenModule@615769f0[bookkeeper_postcommit_validation_master/org.apache.bookkeeper.tests.integration:tests-parent][bookkeeper_postcommit_validation_master/org.apache.bookkeeper.tests.integration:tests-parent][relativePath:tests/integration], hudson.maven.MavenModule@46fbcb69[bookkeeper_postcommit_validation_master/org.apache.bookkeeper.tests.shaded:bookkeeper-server-shaded-test][bookkeeper_postcommit_validation_master/org.apache.bookkeeper.tests.shaded:bookkeeper-server-shaded-test][relativePath:tests/shaded/bookkeeper-server-shaded-test], hudson.maven.MavenModule@2b1e69a6[bookkeeper_postcommit_validation_master/org.apache.bookkeeper.tests.shaded:bookkeeper-server-tests-shaded-test][bookkeeper_postcommit_validation_master/org.apache.bookkeeper.tests.shaded:bookkeeper-server-tests-shaded-test][relativePath:tests/shaded/bookkeeper-server-tests-shaded-test], hudson.maven.MavenModule@713f530d[bookkeeper_postcommit_validation_master/org.apache.bookkeeper.tests.shaded:distributedlog-core-shaded-test][bookkeeper_postcommit_validation_master/org.apache.bookkeeper.tests.shaded:distributedlog-core-shaded-test][relativePath:tests/shaded/distributedlog-core-shaded-test], hudson.maven.MavenModule@5f34406[bookkeeper_postcommit_validation_master/org.apache.bookkeeper.tests.shaded:shaded-tests-parent][bookkeeper_postcommit_validation_master/org.apache.bookkeeper.tests.shaded:shaded-tests-parent][relativePath:tests/shaded], hudson.maven.MavenModule@5c64fef5[bookkeeper_postcommit_validation_master/org.apache.distributedlog:distributedlog][bookkeeper_postcommit_validation_master/org.apache.distributedlog:distributedlog][relativePath:stream/distributedlog], hudson.maven.MavenModule@5c65ed5d[bookkeeper_postcommit_validation_master/org.apache.distributedlog:distributedlog-common][bookkeeper_postcommit_validation_master/org.apache.distributedlog:distributedlog-common][relativePath:stream/distributedlog/common], hudson.maven.MavenModule@33909b7f[bookkeeper_postcommit_validation_master/org.apache.distributedlog:distributedlog-core][bookkeeper_postcommit_validation_master/org.apache.distributedlog:distributedlog-core][relativePath:stream/distributedlog/core], hudson.maven.MavenModule@49de3949[bookkeeper_postcommit_validation_master/org.apache.distributedlog:distributedlog-core-shaded][bookkeeper_postcommit_validation_master/org.apache.distributedlog:distributedlog-core-shaded][relativePath:shaded/distributedlog-core-shaded], hudson.maven.MavenModule@74ee8910[bookkeeper_postcommit_validation_master/org.apache.distributedlog:distributedlog-io][bookkeeper_postcommit_validation_master/org.apache.distributedlog:distributedlog-io][relativePath:stream/distributedlog/io], hudson.maven.MavenModule@6769f514[bookkeeper_postcommit_validation_master/org.apache.distributedlog:distributedlog-protocol][bookkeeper_postcommit_validation_master/org.apache.distributedlog:distributedlog-protocol][relativePath:stream/distributedlog/protocol], hudson.maven.MavenModule@31c0c0eb[bookkeeper_postcommit_validation_master/org.apache.distributedlog:dlfs][bookkeeper_postcommit_validation_master/org.apache.distributedlog:dlfs][relativePath:stream/distributedlog/io/dlfs]]
project.getRootModule()=null
FATAL: java.io.IOException: Unexpected termination of the channel
java.io.EOFException
at java.io.ObjectInputStream$PeekInputStream.readFully(ObjectInputStream.java:2681)
at java.io.ObjectInputStream$BlockDataInputStream.readShort(ObjectInputStream.java:3156)
at java.io.ObjectInputStream.readStreamHeader(ObjectInputStream.java:862)
at java.io.ObjectInputStream.<init>(ObjectInputStream.java:358)
at hudson.remoting.ObjectInputStreamEx.<init>(ObjectInputStreamEx.java:49)
at hudson.remoting.Command.readFrom(Command.java:140)
at hudson.remoting.Command.readFrom(Command.java:126)
at hudson.remoting.AbstractSynchronousByteArrayCommandTransport.read(AbstractSynchronousByteArrayCommandTransport.java:36)
at hudson.remoting.SynchronousCommandTransport$ReaderThread.run(SynchronousCommandTransport.java:63)
Caused: java.io.IOException: Unexpected termination of the channel
at hudson.remoting.SynchronousCommandTransport$ReaderThread.run(SynchronousCommandTransport.java:77)
Also: hudson.remoting.Channel$CallSiteStackTrace: Remote call to H30
at hudson.remoting.Channel.attachCallSiteStackTrace(Channel.java:1743)
at hudson.remoting.Request.call(Request.java:202)
at hudson.remoting.Channel.call(Channel.java:956)
at hudson.FilePath.act(FilePath.java:1072)
at hudson.FilePath.act(FilePath.java:1061)
at hudson.maven.MavenModuleSetBuild$MavenModuleSetBuildExecution.parsePoms(MavenModuleSetBuild.java:987)
at hudson.maven.MavenModuleSetBuild$MavenModuleSetBuildExecution.doRun(MavenModuleSetBuild.java:691)
at hudson.model.AbstractBuild$AbstractBuildExecution.run(AbstractBuild.java:504)
at hudson.model.Run.execute(Run.java:1815)
at hudson.maven.MavenModuleSetBuild.run(MavenModuleSetBuild.java:543)
at hudson.model.ResourceController.execute(ResourceController.java:97)
at hudson.model.Executor.run(Executor.java:429)
Caused: hudson.remoting.RequestAbortedException
at hudson.remoting.Request.abort(Request.java:340)
at hudson.remoting.Channel.terminate(Channel.java:1040)
at hudson.remoting.SynchronousCommandTransport$ReaderThread.run(SynchronousCommandTransport.java:94)
ERROR: H30 is offline; cannot locate JDK 1.8 (latest)
ERROR: H30 is offline; cannot locate Maven 3.6.2
Jenkins build is back to normal :
bookkeeper_postcommit_validation_master #808
Posted by Apache Jenkins Server <je...@builds.apache.org>.
See <https://builds.apache.org/job/bookkeeper_postcommit_validation_master/808/display/redirect>
Build failed in Jenkins: bookkeeper_postcommit_validation_master
#807
Posted by Apache Jenkins Server <je...@builds.apache.org>.
See <https://builds.apache.org/job/bookkeeper_postcommit_validation_master/807/display/redirect>
Changes:
------------------------------------------
Started by timer
Running as SYSTEM
[EnvInject] - Loading node environment variables.
Building remotely on H30 (ubuntu) in workspace /home/jenkins/jenkins-slave/workspace/bookkeeper_postcommit_validation_master
[WS-CLEANUP] Deleting project workspace...
[WS-CLEANUP] Deferred wipeout is used...
[WS-CLEANUP] Done
No credentials specified
Cloning the remote Git repository
Cloning repository https://github.com/apache/bookkeeper.git
> git init /home/jenkins/jenkins-slave/workspace/bookkeeper_postcommit_validation_master # timeout=10
Fetching upstream changes from https://github.com/apache/bookkeeper.git
> git --version # timeout=10
> git fetch --tags --progress -- https://github.com/apache/bookkeeper.git +refs/heads/*:refs/remotes/origin/*
> git config remote.origin.url https://github.com/apache/bookkeeper.git # timeout=10
> git config --add remote.origin.fetch +refs/heads/*:refs/remotes/origin/* # timeout=10
> git config remote.origin.url https://github.com/apache/bookkeeper.git # timeout=10
Fetching upstream changes from https://github.com/apache/bookkeeper.git
> git fetch --tags --progress -- https://github.com/apache/bookkeeper.git +refs/heads/*:refs/remotes/origin/* +refs/pull/${ghprbPullId}/*:refs/remotes/origin/pr/${ghprbPullId}/*
> git rev-parse origin/master^{commit} # timeout=10
Checking out Revision af13a89c9cc3a90e0da361c9488a1cceb19506f8 (origin/master)
> git config core.sparsecheckout # timeout=10
> git checkout -f af13a89c9cc3a90e0da361c9488a1cceb19506f8
Commit message: "Issue 2399 Move CI builds to ci-hadoop.apache.org - rename self job seed configuration in order to disable it temporary"
> git rev-list --no-walk af13a89c9cc3a90e0da361c9488a1cceb19506f8 # timeout=10
Cleaning workspace
> git rev-parse --verify HEAD # timeout=10
Resetting working tree
> git reset --hard # timeout=10
> git clean -fdx # timeout=10
Parsing POMs
ERROR: Processing failed due to a bug in the code. Please report this to the issue tracker (https://jenkins.io/redirect/report-an-issue).
hudson.remoting.RequestAbortedException: java.io.IOException: Unexpected termination of the channel
at hudson.remoting.Request.abort(Request.java:340)
at hudson.remoting.Channel.terminate(Channel.java:1040)
at hudson.remoting.SynchronousCommandTransport$ReaderThread.run(SynchronousCommandTransport.java:94)
Suppressed: hudson.remoting.Channel$CallSiteStackTrace: Remote call to H30
at hudson.remoting.Channel.attachCallSiteStackTrace(Channel.java:1743)
at hudson.remoting.Request.call(Request.java:202)
at hudson.remoting.Channel.call(Channel.java:956)
at hudson.FilePath.act(FilePath.java:1072)
at hudson.FilePath.act(FilePath.java:1061)
at hudson.maven.MavenModuleSetBuild$MavenModuleSetBuildExecution.parsePoms(MavenModuleSetBuild.java:987)
at hudson.maven.MavenModuleSetBuild$MavenModuleSetBuildExecution.doRun(MavenModuleSetBuild.java:691)
at hudson.model.AbstractBuild$AbstractBuildExecution.run(AbstractBuild.java:504)
at hudson.model.Run.execute(Run.java:1815)
at hudson.maven.MavenModuleSetBuild.run(MavenModuleSetBuild.java:543)
at hudson.model.ResourceController.execute(ResourceController.java:97)
at hudson.model.Executor.run(Executor.java:429)
Caused by: java.io.IOException: Unexpected termination of the channel
at hudson.remoting.SynchronousCommandTransport$ReaderThread.run(SynchronousCommandTransport.java:77)
Caused by: java.io.EOFException
at java.io.ObjectInputStream$PeekInputStream.readFully(ObjectInputStream.java:2681)
at java.io.ObjectInputStream$BlockDataInputStream.readShort(ObjectInputStream.java:3156)
at java.io.ObjectInputStream.readStreamHeader(ObjectInputStream.java:862)
at java.io.ObjectInputStream.<init>(ObjectInputStream.java:358)
at hudson.remoting.ObjectInputStreamEx.<init>(ObjectInputStreamEx.java:49)
at hudson.remoting.Command.readFrom(Command.java:140)
at hudson.remoting.Command.readFrom(Command.java:126)
at hudson.remoting.AbstractSynchronousByteArrayCommandTransport.read(AbstractSynchronousByteArrayCommandTransport.java:36)
at hudson.remoting.SynchronousCommandTransport$ReaderThread.run(SynchronousCommandTransport.java:63)
project=hudson.maven.MavenModuleSet@29882f24[bookkeeper_postcommit_validation_master]
project.getModules()=[hudson.maven.MavenModule@6ea58e6[bookkeeper_postcommit_validation_master/org.apache.bookkeeper:bk-grpc-name-resolver][bookkeeper_postcommit_validation_master/org.apache.bookkeeper:bk-grpc-name-resolver][relativePath:stream/bk-grpc-name-resolver], hudson.maven.MavenModule@36984039[bookkeeper_postcommit_validation_master/org.apache.bookkeeper:bkctl][bookkeeper_postcommit_validation_master/org.apache.bookkeeper:bkctl][relativePath:bookkeeper-dist/bkctl], hudson.maven.MavenModule@7a670fd9[bookkeeper_postcommit_validation_master/org.apache.bookkeeper:bookkeeper][bookkeeper_postcommit_validation_master/org.apache.bookkeeper:bookkeeper][relativePath:], hudson.maven.MavenModule@227da1d4[bookkeeper_postcommit_validation_master/org.apache.bookkeeper:bookkeeper-benchmark][bookkeeper_postcommit_validation_master/org.apache.bookkeeper:bookkeeper-benchmark][relativePath:bookkeeper-benchmark], hudson.maven.MavenModule@3c98e926[bookkeeper_postcommit_validation_master/org.apache.bookkeeper:bookkeeper-common][bookkeeper_postcommit_validation_master/org.apache.bookkeeper:bookkeeper-common][relativePath:bookkeeper-common], hudson.maven.MavenModule@20b2c6b4[bookkeeper_postcommit_validation_master/org.apache.bookkeeper:bookkeeper-common-allocator][bookkeeper_postcommit_validation_master/org.apache.bookkeeper:bookkeeper-common-allocator][relativePath:bookkeeper-common-allocator], hudson.maven.MavenModule@3cfbfe7f[bookkeeper_postcommit_validation_master/org.apache.bookkeeper:bookkeeper-dist][bookkeeper_postcommit_validation_master/org.apache.bookkeeper:bookkeeper-dist][relativePath:bookkeeper-dist], hudson.maven.MavenModule@1012e75f[bookkeeper_postcommit_validation_master/org.apache.bookkeeper:bookkeeper-dist-all][bookkeeper_postcommit_validation_master/org.apache.bookkeeper:bookkeeper-dist-all][relativePath:bookkeeper-dist/all], hudson.maven.MavenModule@3b137c7f[bookkeeper_postcommit_validation_master/org.apache.bookkeeper:bookkeeper-dist-server][bookkeeper_postcommit_validation_master/org.apache.bookkeeper:bookkeeper-dist-server][relativePath:bookkeeper-dist/server], hudson.maven.MavenModule@2b3b76d[bookkeeper_postcommit_validation_master/org.apache.bookkeeper:bookkeeper-perf][bookkeeper_postcommit_validation_master/org.apache.bookkeeper:bookkeeper-perf][relativePath:tools/perf], hudson.maven.MavenModule@3948d15b[bookkeeper_postcommit_validation_master/org.apache.bookkeeper:bookkeeper-proto][bookkeeper_postcommit_validation_master/org.apache.bookkeeper:bookkeeper-proto][relativePath:bookkeeper-proto], hudson.maven.MavenModule@47267238[bookkeeper_postcommit_validation_master/org.apache.bookkeeper:bookkeeper-server][bookkeeper_postcommit_validation_master/org.apache.bookkeeper:bookkeeper-server][relativePath:bookkeeper-server], hudson.maven.MavenModule@646bb0d9[bookkeeper_postcommit_validation_master/org.apache.bookkeeper:bookkeeper-server-shaded][bookkeeper_postcommit_validation_master/org.apache.bookkeeper:bookkeeper-server-shaded][relativePath:shaded/bookkeeper-server-shaded], hudson.maven.MavenModule@453824a3[bookkeeper_postcommit_validation_master/org.apache.bookkeeper:bookkeeper-server-tests-shaded][bookkeeper_postcommit_validation_master/org.apache.bookkeeper:bookkeeper-server-tests-shaded][relativePath:shaded/bookkeeper-server-tests-shaded], hudson.maven.MavenModule@54554514[bookkeeper_postcommit_validation_master/org.apache.bookkeeper:bookkeeper-stats-providers][bookkeeper_postcommit_validation_master/org.apache.bookkeeper:bookkeeper-stats-providers][relativePath:bookkeeper-stats-providers], hudson.maven.MavenModule@3867ad1f[bookkeeper_postcommit_validation_master/org.apache.bookkeeper:bookkeeper-tools][bookkeeper_postcommit_validation_master/org.apache.bookkeeper:bookkeeper-tools][relativePath:tools/all], hudson.maven.MavenModule@25eea57f[bookkeeper_postcommit_validation_master/org.apache.bookkeeper:bookkeeper-tools-framework][bookkeeper_postcommit_validation_master/org.apache.bookkeeper:bookkeeper-tools-framework][relativePath:tools/framework], hudson.maven.MavenModule@680a33d4[bookkeeper_postcommit_validation_master/org.apache.bookkeeper:bookkeeper-tools-ledger][bookkeeper_postcommit_validation_master/org.apache.bookkeeper:bookkeeper-tools-ledger][relativePath:tools/ledger], hudson.maven.MavenModule@af75966[bookkeeper_postcommit_validation_master/org.apache.bookkeeper:bookkeeper-tools-parent][bookkeeper_postcommit_validation_master/org.apache.bookkeeper:bookkeeper-tools-parent][relativePath:tools], hudson.maven.MavenModule@5d15e642[bookkeeper_postcommit_validation_master/org.apache.bookkeeper:buildtools][bookkeeper_postcommit_validation_master/org.apache.bookkeeper:buildtools][relativePath:buildtools], hudson.maven.MavenModule@21e702c0[bookkeeper_postcommit_validation_master/org.apache.bookkeeper:circe-checksum][bookkeeper_postcommit_validation_master/org.apache.bookkeeper:circe-checksum][relativePath:circe-checksum], hudson.maven.MavenModule@70c5eee5[bookkeeper_postcommit_validation_master/org.apache.bookkeeper:cpu-affinity][bookkeeper_postcommit_validation_master/org.apache.bookkeeper:cpu-affinity][relativePath:cpu-affinity], hudson.maven.MavenModule@22a21561[bookkeeper_postcommit_validation_master/org.apache.bookkeeper:microbenchmarks][bookkeeper_postcommit_validation_master/org.apache.bookkeeper:microbenchmarks][relativePath:microbenchmarks], hudson.maven.MavenModule@7e24be0b[bookkeeper_postcommit_validation_master/org.apache.bookkeeper:shaded-parent][bookkeeper_postcommit_validation_master/org.apache.bookkeeper:shaded-parent][relativePath:shaded], hudson.maven.MavenModule@20375209[bookkeeper_postcommit_validation_master/org.apache.bookkeeper:statelib][bookkeeper_postcommit_validation_master/org.apache.bookkeeper:statelib][relativePath:stream/statelib], hudson.maven.MavenModule@14ee12d9[bookkeeper_postcommit_validation_master/org.apache.bookkeeper:stream-storage-api][bookkeeper_postcommit_validation_master/org.apache.bookkeeper:stream-storage-api][relativePath:stream/api], hudson.maven.MavenModule@7e8e6891[bookkeeper_postcommit_validation_master/org.apache.bookkeeper:stream-storage-cli][bookkeeper_postcommit_validation_master/org.apache.bookkeeper:stream-storage-cli][relativePath:tools/stream], hudson.maven.MavenModule@5cfb046e[bookkeeper_postcommit_validation_master/org.apache.bookkeeper:stream-storage-clients-parent][bookkeeper_postcommit_validation_master/org.apache.bookkeeper:stream-storage-clients-parent][relativePath:stream/clients], hudson.maven.MavenModule@2b3d33a2[bookkeeper_postcommit_validation_master/org.apache.bookkeeper:stream-storage-common][bookkeeper_postcommit_validation_master/org.apache.bookkeeper:stream-storage-common][relativePath:stream/common], hudson.maven.MavenModule@2a885a5d[bookkeeper_postcommit_validation_master/org.apache.bookkeeper:stream-storage-java-client][bookkeeper_postcommit_validation_master/org.apache.bookkeeper:stream-storage-java-client][relativePath:stream/clients/java/all], hudson.maven.MavenModule@1e8e2861[bookkeeper_postcommit_validation_master/org.apache.bookkeeper:stream-storage-java-client-base][bookkeeper_postcommit_validation_master/org.apache.bookkeeper:stream-storage-java-client-base][relativePath:stream/clients/java/base], hudson.maven.MavenModule@7f7d0220[bookkeeper_postcommit_validation_master/org.apache.bookkeeper:stream-storage-java-client-parent][bookkeeper_postcommit_validation_master/org.apache.bookkeeper:stream-storage-java-client-parent][relativePath:stream/clients/java], hudson.maven.MavenModule@29894fee[bookkeeper_postcommit_validation_master/org.apache.bookkeeper:stream-storage-java-kv-client][bookkeeper_postcommit_validation_master/org.apache.bookkeeper:stream-storage-java-kv-client][relativePath:stream/clients/java/kv], hudson.maven.MavenModule@5614fa3e[bookkeeper_postcommit_validation_master/org.apache.bookkeeper:stream-storage-parent][bookkeeper_postcommit_validation_master/org.apache.bookkeeper:stream-storage-parent][relativePath:stream], hudson.maven.MavenModule@2ee2b213[bookkeeper_postcommit_validation_master/org.apache.bookkeeper:stream-storage-proto][bookkeeper_postcommit_validation_master/org.apache.bookkeeper:stream-storage-proto][relativePath:stream/proto], hudson.maven.MavenModule@6265e034[bookkeeper_postcommit_validation_master/org.apache.bookkeeper:stream-storage-server][bookkeeper_postcommit_validation_master/org.apache.bookkeeper:stream-storage-server][relativePath:stream/server], hudson.maven.MavenModule@2fbed0a1[bookkeeper_postcommit_validation_master/org.apache.bookkeeper:stream-storage-service-api][bookkeeper_postcommit_validation_master/org.apache.bookkeeper:stream-storage-service-api][relativePath:stream/storage/api], hudson.maven.MavenModule@78372006[bookkeeper_postcommit_validation_master/org.apache.bookkeeper:stream-storage-service-impl][bookkeeper_postcommit_validation_master/org.apache.bookkeeper:stream-storage-service-impl][relativePath:stream/storage/impl], hudson.maven.MavenModule@95a4b52[bookkeeper_postcommit_validation_master/org.apache.bookkeeper:stream-storage-service-parent][bookkeeper_postcommit_validation_master/org.apache.bookkeeper:stream-storage-service-parent][relativePath:stream/storage], hudson.maven.MavenModule@d61f626[bookkeeper_postcommit_validation_master/org.apache.bookkeeper.http:bookkeeper-http][bookkeeper_postcommit_validation_master/org.apache.bookkeeper.http:bookkeeper-http][relativePath:bookkeeper-http], hudson.maven.MavenModule@43865466[bookkeeper_postcommit_validation_master/org.apache.bookkeeper.http:http-server][bookkeeper_postcommit_validation_master/org.apache.bookkeeper.http:http-server][relativePath:bookkeeper-http/http-server], hudson.maven.MavenModule@5d9ba6a8[bookkeeper_postcommit_validation_master/org.apache.bookkeeper.http:twitter-http-server][bookkeeper_postcommit_validation_master/org.apache.bookkeeper.http:twitter-http-server][relativePath:bookkeeper-http/twitter-http-server], hudson.maven.MavenModule@33f44628[bookkeeper_postcommit_validation_master/org.apache.bookkeeper.http:vertx-http-server][bookkeeper_postcommit_validation_master/org.apache.bookkeeper.http:vertx-http-server][relativePath:bookkeeper-http/vertx-http-server], hudson.maven.MavenModule@366e0feb[bookkeeper_postcommit_validation_master/org.apache.bookkeeper.metadata.drivers:metadata-drivers-parent][bookkeeper_postcommit_validation_master/org.apache.bookkeeper.metadata.drivers:metadata-drivers-parent][relativePath:metadata-drivers], hudson.maven.MavenModule@24a86bed[bookkeeper_postcommit_validation_master/org.apache.bookkeeper.metadata.drivers:metadata-stores-etcd][bookkeeper_postcommit_validation_master/org.apache.bookkeeper.metadata.drivers:metadata-stores-etcd][relativePath:metadata-drivers/etcd], hudson.maven.MavenModule@77e083ca[bookkeeper_postcommit_validation_master/org.apache.bookkeeper.stats:bookkeeper-stats-api][bookkeeper_postcommit_validation_master/org.apache.bookkeeper.stats:bookkeeper-stats-api][relativePath:bookkeeper-stats], hudson.maven.MavenModule@402f2c8d[bookkeeper_postcommit_validation_master/org.apache.bookkeeper.stats:bookkeeper-stats-parent][bookkeeper_postcommit_validation_master/org.apache.bookkeeper.stats:bookkeeper-stats-parent][relativePath:stats], hudson.maven.MavenModule@3c00fe63[bookkeeper_postcommit_validation_master/org.apache.bookkeeper.stats:bookkeeper-stats-utils][bookkeeper_postcommit_validation_master/org.apache.bookkeeper.stats:bookkeeper-stats-utils][relativePath:stats/utils], hudson.maven.MavenModule@5cf0cdf2[bookkeeper_postcommit_validation_master/org.apache.bookkeeper.stats:codahale-metrics-provider][bookkeeper_postcommit_validation_master/org.apache.bookkeeper.stats:codahale-metrics-provider][relativePath:bookkeeper-stats-providers/codahale-metrics-provider], hudson.maven.MavenModule@46c08741[bookkeeper_postcommit_validation_master/org.apache.bookkeeper.stats:prometheus-metrics-provider][bookkeeper_postcommit_validation_master/org.apache.bookkeeper.stats:prometheus-metrics-provider][relativePath:bookkeeper-stats-providers/prometheus-metrics-provider], hudson.maven.MavenModule@ea4bca5[bookkeeper_postcommit_validation_master/org.apache.bookkeeper.stats:twitter-finagle-provider][bookkeeper_postcommit_validation_master/org.apache.bookkeeper.stats:twitter-finagle-provider][relativePath:bookkeeper-stats-providers/twitter-finagle-provider], hudson.maven.MavenModule@402c093[bookkeeper_postcommit_validation_master/org.apache.bookkeeper.stats:twitter-ostrich-provider][bookkeeper_postcommit_validation_master/org.apache.bookkeeper.stats:twitter-ostrich-provider][relativePath:bookkeeper-stats-providers/twitter-ostrich-provider], hudson.maven.MavenModule@4a93f49a[bookkeeper_postcommit_validation_master/org.apache.bookkeeper.stats:twitter-science-provider][bookkeeper_postcommit_validation_master/org.apache.bookkeeper.stats:twitter-science-provider][relativePath:bookkeeper-stats-providers/twitter-science-provider], hudson.maven.MavenModule@6f002b03[bookkeeper_postcommit_validation_master/org.apache.bookkeeper.tests:all-released-versions-image][bookkeeper_postcommit_validation_master/org.apache.bookkeeper.tests:all-released-versions-image][relativePath:tests/docker-images/all-released-versions-image], hudson.maven.MavenModule@14620fa6[bookkeeper_postcommit_validation_master/org.apache.bookkeeper.tests:all-versions-image][bookkeeper_postcommit_validation_master/org.apache.bookkeeper.tests:all-versions-image][relativePath:tests/docker-images/all-versions-image], hudson.maven.MavenModule@60731589[bookkeeper_postcommit_validation_master/org.apache.bookkeeper.tests:backward-compat][bookkeeper_postcommit_validation_master/org.apache.bookkeeper.tests:backward-compat][relativePath:tests/backward-compat], hudson.maven.MavenModule@61321260[bookkeeper_postcommit_validation_master/org.apache.bookkeeper.tests:current-version-image][bookkeeper_postcommit_validation_master/org.apache.bookkeeper.tests:current-version-image][relativePath:tests/docker-images/current-version-image], hudson.maven.MavenModule@3c0e5d11[bookkeeper_postcommit_validation_master/org.apache.bookkeeper.tests:docker-images][bookkeeper_postcommit_validation_master/org.apache.bookkeeper.tests:docker-images][relativePath:tests/docker-images], hudson.maven.MavenModule@61a9ee7f[bookkeeper_postcommit_validation_master/org.apache.bookkeeper.tests:integration][bookkeeper_postcommit_validation_master/org.apache.bookkeeper.tests:integration][relativePath:tests/integration], hudson.maven.MavenModule@2598186f[bookkeeper_postcommit_validation_master/org.apache.bookkeeper.tests:integration-tests-base][bookkeeper_postcommit_validation_master/org.apache.bookkeeper.tests:integration-tests-base][relativePath:tests/integration-tests-base], hudson.maven.MavenModule@51370180[bookkeeper_postcommit_validation_master/org.apache.bookkeeper.tests:integration-tests-base-groovy][bookkeeper_postcommit_validation_master/org.apache.bookkeeper.tests:integration-tests-base-groovy][relativePath:tests/integration-tests-base-groovy], hudson.maven.MavenModule@5e656f51[bookkeeper_postcommit_validation_master/org.apache.bookkeeper.tests:integration-tests-topologies][bookkeeper_postcommit_validation_master/org.apache.bookkeeper.tests:integration-tests-topologies][relativePath:tests/integration-tests-topologies], hudson.maven.MavenModule@5685402d[bookkeeper_postcommit_validation_master/org.apache.bookkeeper.tests:integration-tests-utils][bookkeeper_postcommit_validation_master/org.apache.bookkeeper.tests:integration-tests-utils][relativePath:tests/integration-tests-utils], hudson.maven.MavenModule@424c1de1[bookkeeper_postcommit_validation_master/org.apache.bookkeeper.tests:scripts][bookkeeper_postcommit_validation_master/org.apache.bookkeeper.tests:scripts][relativePath:tests/scripts], hudson.maven.MavenModule@3a8dd178[bookkeeper_postcommit_validation_master/org.apache.bookkeeper.tests:stream-storage-tests-common][bookkeeper_postcommit_validation_master/org.apache.bookkeeper.tests:stream-storage-tests-common][relativePath:stream/tests-common], hudson.maven.MavenModule@18372743[bookkeeper_postcommit_validation_master/org.apache.bookkeeper.tests:tests-parent][bookkeeper_postcommit_validation_master/org.apache.bookkeeper.tests:tests-parent][relativePath:tests], hudson.maven.MavenModule@215018d2[bookkeeper_postcommit_validation_master/org.apache.bookkeeper.tests.backward-compat:backward-compat-current-server-old-clients][bookkeeper_postcommit_validation_master/org.apache.bookkeeper.tests.backward-compat:backward-compat-current-server-old-clients][relativePath:tests/backward-compat/current-server-old-clients], hudson.maven.MavenModule@e73a400[bookkeeper_postcommit_validation_master/org.apache.bookkeeper.tests.backward-compat:hierarchical-ledger-manager][bookkeeper_postcommit_validation_master/org.apache.bookkeeper.tests.backward-compat:hierarchical-ledger-manager][relativePath:tests/backward-compat/hierarchical-ledger-manager], hudson.maven.MavenModule@4aabe525[bookkeeper_postcommit_validation_master/org.apache.bookkeeper.tests.backward-compat:hostname-bookieid][bookkeeper_postcommit_validation_master/org.apache.bookkeeper.tests.backward-compat:hostname-bookieid][relativePath:tests/backward-compat/hostname-bookieid], hudson.maven.MavenModule@a7be0df[bookkeeper_postcommit_validation_master/org.apache.bookkeeper.tests.backward-compat:old-cookie-new-cluster][bookkeeper_postcommit_validation_master/org.apache.bookkeeper.tests.backward-compat:old-cookie-new-cluster][relativePath:tests/backward-compat/old-cookie-new-cluster], hudson.maven.MavenModule@13cc04b9[bookkeeper_postcommit_validation_master/org.apache.bookkeeper.tests.backward-compat:recovery-no-password][bookkeeper_postcommit_validation_master/org.apache.bookkeeper.tests.backward-compat:recovery-no-password][relativePath:tests/backward-compat/recovery-no-password], hudson.maven.MavenModule@4a3db586[bookkeeper_postcommit_validation_master/org.apache.bookkeeper.tests.backward-compat:tests-parent][bookkeeper_postcommit_validation_master/org.apache.bookkeeper.tests.backward-compat:tests-parent][relativePath:tests/backward-compat], hudson.maven.MavenModule@7bc94ed[bookkeeper_postcommit_validation_master/org.apache.bookkeeper.tests.backward-compat:upgrade][bookkeeper_postcommit_validation_master/org.apache.bookkeeper.tests.backward-compat:upgrade][relativePath:tests/backward-compat/upgrade], hudson.maven.MavenModule@28fd3602[bookkeeper_postcommit_validation_master/org.apache.bookkeeper.tests.backward-compat:upgrade-direct][bookkeeper_postcommit_validation_master/org.apache.bookkeeper.tests.backward-compat:upgrade-direct][relativePath:tests/backward-compat/upgrade-direct], hudson.maven.MavenModule@3ebfbbe7[bookkeeper_postcommit_validation_master/org.apache.bookkeeper.tests.backward-compat:yahoo-custom-version][bookkeeper_postcommit_validation_master/org.apache.bookkeeper.tests.backward-compat:yahoo-custom-version][relativePath:tests/backward-compat/yahoo-custom-version], hudson.maven.MavenModule@1c773b70[bookkeeper_postcommit_validation_master/org.apache.bookkeeper.tests.integration:cluster][bookkeeper_postcommit_validation_master/org.apache.bookkeeper.tests.integration:cluster][relativePath:tests/integration/cluster], hudson.maven.MavenModule@38ce8e1e[bookkeeper_postcommit_validation_master/org.apache.bookkeeper.tests.integration:smoke][bookkeeper_postcommit_validation_master/org.apache.bookkeeper.tests.integration:smoke][relativePath:tests/integration/smoke], hudson.maven.MavenModule@1ae4ae49[bookkeeper_postcommit_validation_master/org.apache.bookkeeper.tests.integration:standalone][bookkeeper_postcommit_validation_master/org.apache.bookkeeper.tests.integration:standalone][relativePath:tests/integration/standalone], hudson.maven.MavenModule@615769f0[bookkeeper_postcommit_validation_master/org.apache.bookkeeper.tests.integration:tests-parent][bookkeeper_postcommit_validation_master/org.apache.bookkeeper.tests.integration:tests-parent][relativePath:tests/integration], hudson.maven.MavenModule@46fbcb69[bookkeeper_postcommit_validation_master/org.apache.bookkeeper.tests.shaded:bookkeeper-server-shaded-test][bookkeeper_postcommit_validation_master/org.apache.bookkeeper.tests.shaded:bookkeeper-server-shaded-test][relativePath:tests/shaded/bookkeeper-server-shaded-test], hudson.maven.MavenModule@2b1e69a6[bookkeeper_postcommit_validation_master/org.apache.bookkeeper.tests.shaded:bookkeeper-server-tests-shaded-test][bookkeeper_postcommit_validation_master/org.apache.bookkeeper.tests.shaded:bookkeeper-server-tests-shaded-test][relativePath:tests/shaded/bookkeeper-server-tests-shaded-test], hudson.maven.MavenModule@713f530d[bookkeeper_postcommit_validation_master/org.apache.bookkeeper.tests.shaded:distributedlog-core-shaded-test][bookkeeper_postcommit_validation_master/org.apache.bookkeeper.tests.shaded:distributedlog-core-shaded-test][relativePath:tests/shaded/distributedlog-core-shaded-test], hudson.maven.MavenModule@5f34406[bookkeeper_postcommit_validation_master/org.apache.bookkeeper.tests.shaded:shaded-tests-parent][bookkeeper_postcommit_validation_master/org.apache.bookkeeper.tests.shaded:shaded-tests-parent][relativePath:tests/shaded], hudson.maven.MavenModule@5c64fef5[bookkeeper_postcommit_validation_master/org.apache.distributedlog:distributedlog][bookkeeper_postcommit_validation_master/org.apache.distributedlog:distributedlog][relativePath:stream/distributedlog], hudson.maven.MavenModule@5c65ed5d[bookkeeper_postcommit_validation_master/org.apache.distributedlog:distributedlog-common][bookkeeper_postcommit_validation_master/org.apache.distributedlog:distributedlog-common][relativePath:stream/distributedlog/common], hudson.maven.MavenModule@33909b7f[bookkeeper_postcommit_validation_master/org.apache.distributedlog:distributedlog-core][bookkeeper_postcommit_validation_master/org.apache.distributedlog:distributedlog-core][relativePath:stream/distributedlog/core], hudson.maven.MavenModule@49de3949[bookkeeper_postcommit_validation_master/org.apache.distributedlog:distributedlog-core-shaded][bookkeeper_postcommit_validation_master/org.apache.distributedlog:distributedlog-core-shaded][relativePath:shaded/distributedlog-core-shaded], hudson.maven.MavenModule@74ee8910[bookkeeper_postcommit_validation_master/org.apache.distributedlog:distributedlog-io][bookkeeper_postcommit_validation_master/org.apache.distributedlog:distributedlog-io][relativePath:stream/distributedlog/io], hudson.maven.MavenModule@6769f514[bookkeeper_postcommit_validation_master/org.apache.distributedlog:distributedlog-protocol][bookkeeper_postcommit_validation_master/org.apache.distributedlog:distributedlog-protocol][relativePath:stream/distributedlog/protocol], hudson.maven.MavenModule@31c0c0eb[bookkeeper_postcommit_validation_master/org.apache.distributedlog:dlfs][bookkeeper_postcommit_validation_master/org.apache.distributedlog:dlfs][relativePath:stream/distributedlog/io/dlfs]]
project.getRootModule()=null
FATAL: java.io.IOException: Unexpected termination of the channel
java.io.EOFException
at java.io.ObjectInputStream$PeekInputStream.readFully(ObjectInputStream.java:2681)
at java.io.ObjectInputStream$BlockDataInputStream.readShort(ObjectInputStream.java:3156)
at java.io.ObjectInputStream.readStreamHeader(ObjectInputStream.java:862)
at java.io.ObjectInputStream.<init>(ObjectInputStream.java:358)
at hudson.remoting.ObjectInputStreamEx.<init>(ObjectInputStreamEx.java:49)
at hudson.remoting.Command.readFrom(Command.java:140)
at hudson.remoting.Command.readFrom(Command.java:126)
at hudson.remoting.AbstractSynchronousByteArrayCommandTransport.read(AbstractSynchronousByteArrayCommandTransport.java:36)
at hudson.remoting.SynchronousCommandTransport$ReaderThread.run(SynchronousCommandTransport.java:63)
Caused: java.io.IOException: Unexpected termination of the channel
at hudson.remoting.SynchronousCommandTransport$ReaderThread.run(SynchronousCommandTransport.java:77)
Also: hudson.remoting.Channel$CallSiteStackTrace: Remote call to H30
at hudson.remoting.Channel.attachCallSiteStackTrace(Channel.java:1743)
at hudson.remoting.Request.call(Request.java:202)
at hudson.remoting.Channel.call(Channel.java:956)
at hudson.FilePath.act(FilePath.java:1072)
at hudson.FilePath.act(FilePath.java:1061)
at hudson.maven.MavenModuleSetBuild$MavenModuleSetBuildExecution.parsePoms(MavenModuleSetBuild.java:987)
at hudson.maven.MavenModuleSetBuild$MavenModuleSetBuildExecution.doRun(MavenModuleSetBuild.java:691)
at hudson.model.AbstractBuild$AbstractBuildExecution.run(AbstractBuild.java:504)
at hudson.model.Run.execute(Run.java:1815)
at hudson.maven.MavenModuleSetBuild.run(MavenModuleSetBuild.java:543)
at hudson.model.ResourceController.execute(ResourceController.java:97)
at hudson.model.Executor.run(Executor.java:429)
Caused: hudson.remoting.RequestAbortedException
at hudson.remoting.Request.abort(Request.java:340)
at hudson.remoting.Channel.terminate(Channel.java:1040)
at hudson.remoting.SynchronousCommandTransport$ReaderThread.run(SynchronousCommandTransport.java:94)
ERROR: H30 is offline; cannot locate JDK 1.8 (latest)
ERROR: H30 is offline; cannot locate Maven 3.6.2