You are viewing a plain text version of this content. The canonical link for it is here.
Posted to notifications@maven.apache.org by Apache Jenkins Server <je...@builds.apache.org> on 2018/08/17 05:30:05 UTC

Build unstable in Jenkins: Maven TLP » maven-enforcer » MENFORCER-294 #9

See https://builds.apache.org/job/maven-box/job/maven-enforcer/job/MENFORCER-294/9/

Changes:

* Upgrade latest version of Maven
* [INFRA-16893] set Windows to windows-2016-1 node
* Back to Windows label
* Windows + M3.5.x = M3.5.2
* [INFRA-16893] Trying workaround
* Revert "[INFRA-16893] Trying workaround"
* Try to display PATH value

4 tests failed.
FAILED:  org.apache.maven.plugins.enforcer.TestRequireEnvironmentVariable.testRuleWithRegex

Error Message:
This should not throw an exception

Stack Trace:
junit.framework.AssertionFailedError: This should not throw an exception
	at org.apache.maven.plugins.enforcer.TestRequireEnvironmentVariable.testRuleWithRegex(TestRequireEnvironmentVariable.java:107)


FAILED:  org.apache.maven.plugins.enforcer.TestRequireEnvironmentVariable.testRuleWithRegex

Error Message:
This should not throw an exception

Stack Trace:
junit.framework.AssertionFailedError: This should not throw an exception
	at org.apache.maven.plugins.enforcer.TestRequireEnvironmentVariable.testRuleWithRegex(TestRequireEnvironmentVariable.java:107)


FAILED:  org.apache.maven.plugins.enforcer.TestRequireEnvironmentVariable.testRuleWithRegex

Error Message:
This should not throw an exception

Stack Trace:
junit.framework.AssertionFailedError: This should not throw an exception
	at org.apache.maven.plugins.enforcer.TestRequireEnvironmentVariable.testRuleWithRegex(TestRequireEnvironmentVariable.java:107)


FAILED:  org.apache.maven.plugins.enforcer.TestRequireEnvironmentVariable.testRuleWithRegex

Error Message:
This should not throw an exception

Stack Trace:
junit.framework.AssertionFailedError: This should not throw an exception
	at org.apache.maven.plugins.enforcer.TestRequireEnvironmentVariable.testRuleWithRegex(TestRequireEnvironmentVariable.java:107)




Build log:
[...truncated 3.09 MB...]
[windows-jdk10] [INFO] run post-build script verify.groovy
[windows-jdk10] [INFO]           require-no-repositories_failure_repositories\pom.xml SUCCESS (5.4 s)
[windows-jdk10] [INFO] Building: require-no-repositories_mm\pom.xml
[Pipeline] [windows-jdk7] }
[windows-jdk7] [withMaven] invokerPublisher - Archive invoker results for Maven artifact MavenArtifact{org.apache.maven.plugins:maven-enforcer-plugin::3.0.0-SNAPSHOT(version: 3.0.0-SNAPSHOT, snapshot:false) } generated by PluginInvocation{org.apache.maven.plugins:maven-invoker-plugin:3.0.1@run  integration-test}: m\maven-enforcer-plugin\target\invoker-reports\*.xml
[windows-jdk7] performing MavenInvokerRecorder, reportsFilenamePattern:'**/m\maven-enforcer-plugin\target\invoker-reports/BUILD*.xml', invokerBuildDir:'**/m\maven-enforcer-plugin\target\it'
[windows-jdk7] Found reports:[f:\jenkins\jenkins-slave\workspace\aven-enforcer_MENFORCER-294-IBUS6H5LUW3LLGQ77JNQBEL74UE2BN3AO433QECSA2A76NFISVIQ\m\maven-enforcer-plugin\target\invoker-reports\BUILD-always-fail-warn.xml, f:\jenkins\jenkins-slave\workspace\aven-enforcer_MENFORCER-294-IBUS6H5LUW3LLGQ77JNQBEL74UE2BN3AO433QECSA2A76NFISVIQ\m\maven-enforcer-plugin\target\invoker-reports\BUILD-always-fail.xml, f:\jenkins\jenkins-slave\workspace\aven-enforcer_MENFORCER-294-IBUS6H5LUW3LLGQ77JNQBEL74UE2BN3AO433QECSA2A76NFISVIQ\m\maven-enforcer-plugin\target\invoker-reports\BUILD-always-pass.xml, f:\jenkins\jenkins-slave\workspace\aven-enforcer_MENFORCER-294-IBUS6H5LUW3LLGQ77JNQBEL74UE2BN3AO433QECSA2A76NFISVIQ\m\maven-enforcer-plugin\target\invoker-reports\BUILD-ban-distribution-management-multi-module-build.xml, f:\jenkins\jenkins-slave\workspace\aven-enforcer_MENFORCER-294-IBUS6H5LUW3LLGQ77JNQBEL74UE2BN3AO433QECSA2A76NFISVIQ\m\maven-enforcer-plugin\target\invoker-reports\BUILD-ban-distribution-management-multi-module-except-site.xml, f:\jenkins\jenkins-slave\workspace\aven-enforcer_MENFORCER-294-IBUS6H5LUW3LLGQ77JNQBEL74UE2BN3AO433QECSA2A76NFISVIQ\m\maven-enforcer-plugin\target\invoker-reports\BUILD-ban-distribution-management.xml, f:\jenkins\jenkins-slave\workspace\aven-enforcer_MENFORCER-294-IBUS6H5LUW3LLGQ77JNQBEL74UE2BN3AO433QECSA2A76NFISVIQ\m\maven-enforcer-plugin\target\invoker-reports\BUILD-ban-pom-dependency-version.xml, f:\jenkins\jenkins-slave\workspace\aven-enforcer_MENFORCER-294-IBUS6H5LUW3LLGQ77JNQBEL74UE2BN3AO433QECSA2A76NFISVIQ\m\maven-enforcer-plugin\target\invoker-reports\BUILD-ban-transitive-dependencies-fail.xml, f:\jenkins\jenkins-slave\workspace\aven-enforcer_MENFORCER-294-IBUS6H5LUW3LLGQ77JNQBEL74UE2BN3AO433QECSA2A76NFISVIQ\m\maven-enforcer-plugin\target\invoker-reports\BUILD-ban-transitive-dependencies.xml, f:\jenkins\jenkins-slave\workspace\aven-enforcer_MENFORCER-294-IBUS6H5LUW3LLGQ77JNQBEL74UE2BN3AO433QECSA2A76NFISVIQ\m\maven-enforcer-plugin\target\invoker-reports\BUILD-banned-dependencies-versionrange-fail.xml, f:\jenkins\jenkins-slave\workspace\aven-enforcer_MENFORCER-294-IBUS6H5LUW3LLGQ77JNQBEL74UE2BN3AO433QECSA2A76NFISVIQ\m\maven-enforcer-plugin\target\invoker-reports\BUILD-banned-dependencies-versionrange.xml, f:\jenkins\jenkins-slave\workspace\aven-enforcer_MENFORCER-294-IBUS6H5LUW3LLGQ77JNQBEL74UE2BN3AO433QECSA2A76NFISVIQ\m\maven-enforcer-plugin\target\invoker-reports\BUILD-banned-dependencies-wildcards.xml, f:\jenkins\jenkins-slave\workspace\aven-enforcer_MENFORCER-294-IBUS6H5LUW3LLGQ77JNQBEL74UE2BN3AO433QECSA2A76NFISVIQ\m\maven-enforcer-plugin\target\invoker-reports\BUILD-banned-dependencies.xml, f:\jenkins\jenkins-slave\workspace\aven-enforcer_MENFORCER-294-IBUS6H5LUW3LLGQ77JNQBEL74UE2BN3AO433QECSA2A76NFISVIQ\m\maven-enforcer-plugin\target\invoker-reports\BUILD-banned-plugins.xml, f:\jenkins\jenkins-slave\workspace\aven-enforcer_MENFORCER-294-IBUS6H5LUW3LLGQ77JNQBEL74UE2BN3AO433QECSA2A76NFISVIQ\m\maven-enforcer-plugin\target\invoker-reports\BUILD-builds_a_pom_noop.xml, f:\jenkins\jenkins-slave\workspace\aven-enforcer_MENFORCER-294-IBUS6H5LUW3LLGQ77JNQBEL74UE2BN3AO433QECSA2A76NFISVIQ\m\maven-enforcer-plugin\target\invoker-reports\BUILD-cli-always-fail.xml, f:\jenkins\jenkins-slave\workspace\aven-enforcer_MENFORCER-294-IBUS6H5LUW3LLGQ77JNQBEL74UE2BN3AO433QECSA2A76NFISVIQ\m\maven-enforcer-plugin\target\invoker-reports\BUILD-cli-always-pass.xml, f:\jenkins\jenkins-slave\workspace\aven-enforcer_MENFORCER-294-IBUS6H5LUW3LLGQ77JNQBEL74UE2BN3AO433QECSA2A76NFISVIQ\m\maven-enforcer-plugin\target\invoker-reports\BUILD-dependencies_converge.xml, f:\jenkins\jenkins-slave\workspace\aven-enforcer_MENFORCER-294-IBUS6H5LUW3LLGQ77JNQBEL74UE2BN3AO433QECSA2A76NFISVIQ\m\maven-enforcer-plugin\target\invoker-reports\BUILD-dependencies_not_converging.xml, f:\jenkins\jenkins-slave\workspace\aven-enforcer_MENFORCER-294-IBUS6H5LUW3LLGQ77JNQBEL74UE2BN3AO433QECSA2A76NFISVIQ\m\maven-enforcer-plugin\target\invoker-reports\BUILD-dependencies_not_converging_test_scope.xml, f:\jenkins\jenkins-slave\workspace\aven-enforcer_MENFORCER-294-IBUS6H5LUW3LLGQ77JNQBEL74UE2BN3AO433QECSA2A76NFISVIQ\m\maven-enforcer-plugin\target\invoker-reports\BUILD-display-info.xml, f:\jenkins\jenkins-slave\workspace\aven-enforcer_MENFORCER-294-IBUS6H5LUW3LLGQ77JNQBEL74UE2BN3AO433QECSA2A76NFISVIQ\m\maven-enforcer-plugin\target\invoker-reports\BUILD-evaluate-beanshell.xml, f:\jenkins\jenkins-slave\workspace\aven-enforcer_MENFORCER-294-IBUS6H5LUW3LLGQ77JNQBEL74UE2BN3AO433QECSA2A76NFISVIQ\m\maven-enforcer-plugin\target\invoker-reports\BUILD-multimodule.xml, f:\jenkins\jenkins-slave\workspace\aven-enforcer_MENFORCER-294-IBUS6H5LUW3LLGQ77JNQBEL74UE2BN3AO433QECSA2A76NFISVIQ\m\maven-enforcer-plugin\target\invoker-reports\BUILD-require-active-profile-all.xml, f:\jenkins\jenkins-slave\workspace\aven-enforcer_MENFORCER-294-IBUS6H5LUW3LLGQ77JNQBEL74UE2BN3AO433QECSA2A76NFISVIQ\m\maven-enforcer-plugin\target\invoker-reports\BUILD-require-active-profile-from-settings.xml, f:\jenkins\jenkins-slave\workspace\aven-enforcer_MENFORCER-294-IBUS6H5LUW3LLGQ77JNQBEL74UE2BN3AO433QECSA2A76NFISVIQ\m\maven-enforcer-plugin\target\invoker-reports\BUILD-require-active-profile.xml, f:\jenkins\jenkins-slave\workspace\aven-enforcer_MENFORCER-294-IBUS6H5LUW3LLGQ77JNQBEL74UE2BN3AO433QECSA2A76NFISVIQ\m\maven-enforcer-plugin\target\invoker-reports\BUILD-require-file-checksum.xml, f:\jenkins\jenkins-slave\workspace\aven-enforcer_MENFORCER-294-IBUS6H5LUW3LLGQ77JNQBEL74UE2BN3AO433QECSA2A76NFISVIQ\m\maven-enforcer-plugin\target\invoker-reports\BUILD-require-files-dont-exist.xml, f:\jenkins\jenkins-slave\workspace\aven-enforcer_MENFORCER-294-IBUS6H5LUW3LLGQ77JNQBEL74UE2BN3AO433QECSA2A76NFISVIQ\m\maven-enforcer-plugin\target\invoker-reports\BUILD-require-files-exist.xml, f:\jenkins\jenkins-slave\workspace\aven-enforcer_MENFORCER-294-IBUS6H5LUW3LLGQ77JNQBEL74UE2BN3AO433QECSA2A76NFISVIQ\m\maven-enforcer-plugin\target\invoker-reports\BUILD-require-files-size.xml, f:\jenkins\jenkins-slave\workspace\aven-enforcer_MENFORCER-294-IBUS6H5LUW3LLGQ77JNQBEL74UE2BN3AO433QECSA2A76NFISVIQ\m\maven-enforcer-plugin\target\invoker-reports\BUILD-require-java-version.xml, f:\jenkins\jenkins-slave\workspace\aven-enforcer_MENFORCER-294-IBUS6H5LUW3LLGQ77JNQBEL74UE2BN3AO433QECSA2A76NFISVIQ\m\maven-enforcer-plugin\target\invoker-reports\BUILD-require-maven-version.xml, f:\jenkins\jenkins-slave\workspace\aven-enforcer_MENFORCER-294-IBUS6H5LUW3LLGQ77JNQBEL74UE2BN3AO433QECSA2A76NFISVIQ\m\maven-enforcer-plugin\target\invoker-reports\BUILD-require-no-repositories-allow-plugin-repo.xml, f:\jenkins\jenkins-slave\workspace\aven-enforcer_MENFORCER-294-IBUS6H5LUW3LLGQ77JNQBEL74UE2BN3AO433QECSA2A76NFISVIQ\m\maven-enforcer-plugin\target\invoker-reports\BUILD-require-no-repositories-allow-repo.xml, f:\jenkins\jenkins-slave\workspace\aven-enforcer_MENFORCER-294-IBUS6H5LUW3LLGQ77JNQBEL74UE2BN3AO433QECSA2A76NFISVIQ\m\maven-enforcer-plugin\target\invoker-reports\BUILD-require-no-repositories.xml, f:\jenkins\jenkins-slave\workspace\aven-enforcer_MENFORCER-294-IBUS6H5LUW3LLGQ77JNQBEL74UE2BN3AO433QECSA2A76NFISVIQ\m\maven-enforcer-plugin\target\invoker-reports\BUILD-require-no-repositories_failure.xml, f:\jenkins\jenkins-slave\workspace\aven-enforcer_MENFORCER-294-IBUS6H5LUW3LLGQ77JNQBEL74UE2BN3AO433QECSA2A76NFISVIQ\m\maven-enforcer-plugin\target\invoker-reports\BUILD-require-no-repositories_failure_allowed-plugin-repo.xml, f:\jenkins\jenkins-slave\workspace\aven-enforcer_MENFORCER-294-IBUS6H5LUW3LLGQ77JNQBEL74UE2BN3AO433QECSA2A76NFISVIQ\m\maven-enforcer-plugin\target\invoker-reports\BUILD-require-no-repositories_failure_plugin-repositories.xml, f:\jenkins\jenkins-slave\workspace\aven-enforcer_MENFORCER-294-IBUS6H5LUW3LLGQ77JNQBEL74UE2BN3AO433QECSA2A76NFISVIQ\m\maven-enforcer-plugin\target\invoker-reports\BUILD-require-no-repositories_failure_repositories.xml, f:\jenkins\jenkins-slave\workspace\aven-enforcer_MENFORCER-294-IBUS6H5LUW3LLGQ77JNQBEL74UE2BN3AO433QECSA2A76NFISVIQ\m\maven-enforcer-plugin\target\invoker-reports\BUILD-require-no-repositories_mm.xml, f:\jenkins\jenkins-slave\workspace\aven-enforcer_MENFORCER-294-IBUS6H5LUW3LLGQ77JNQBEL74UE2BN3AO433QECSA2A76NFISVIQ\m\maven-enforcer-plugin\target\invoker-reports\BUILD-require-no-repositories_mm_ci.xml, f:\jenkins\jenkins-slave\workspace\aven-enforcer_MENFORCER-294-IBUS6H5LUW3LLGQ77JNQBEL74UE2BN3AO433QECSA2A76NFISVIQ\m\maven-enforcer-plugin\target\invoker-reports\BUILD-require-plugin-versions-ci.xml, f:\jenkins\jenkins-slave\workspace\aven-enforcer_MENFORCER-294-IBUS6H5LUW3LLGQ77JNQBEL74UE2BN3AO433QECSA2A76NFISVIQ\m\maven-enforcer-plugin\target\invoker-reports\BUILD-require-plugin-versions-custom-packaging.xml, f:\jenkins\jenkins-slave\workspace\aven-enforcer_MENFORCER-294-IBUS6H5LUW3LLGQ77JNQBEL74UE2BN3AO433QECSA2A76NFISVIQ\m\maven-enforcer-plugin\target\invoker-reports\BUILD-require-plugin-versions-expressions.xml, f:\jenkins\jenkins-slave\workspace\aven-enforcer_MENFORCER-294-IBUS6H5LUW3LLGQ77JNQBEL74UE2BN3AO433QECSA2A76NFISVIQ\m\maven-enforcer-plugin\target\invoker-reports\BUILD-require-plugin-versions-mm-ci-friendly.xml, f:\jenkins\jenkins-slave\workspace\aven-enforcer_MENFORCER-294-IBUS6H5LUW3LLGQ77JNQBEL74UE2BN3AO433QECSA2A76NFISVIQ\m\maven-enforcer-plugin\target\invoker-reports\BUILD-require-plugin-versions-plugin-with-extensions.xml, f:\jenkins\jenkins-slave\workspace\aven-enforcer_MENFORCER-294-IBUS6H5LUW3LLGQ77JNQBEL74UE2BN3AO433QECSA2A76NFISVIQ\m\maven-enforcer-plugin\target\invoker-reports\BUILD-require-plugin-versions-plugin-with-integration-test-lifecycle.xml, f:\jenkins\jenkins-slave\workspace\aven-enforcer_MENFORCER-294-IBUS6H5LUW3LLGQ77JNQBEL74UE2BN3AO433QECSA2A76NFISVIQ\m\maven-enforcer-plugin\target\invoker-reports\BUILD-require-plugin-versions-projectGAVexpressions.xml, f:\jenkins\jenkins-slave\workspace\aven-enforcer_MENFORCER-294-IBUS6H5LUW3LLGQ77JNQBEL74UE2BN3AO433QECSA2A76NFISVIQ\m\maven-enforcer-plugin\target\invoker-reports\BUILD-require-plugin-versions.xml, f:\jenkins\jenkins-slave\workspace\aven-enforcer_MENFORCER-294-IBUS6H5LUW3LLGQ77JNQBEL74UE2BN3AO433QECSA2A76NFISVIQ\m\maven-enforcer-plugin\target\invoker-reports\BUILD-require-profile-ids-exist_failure.xml, f:\jenkins\jenkins-slave\workspace\aven-enforcer_MENFORCER-294-IBUS6H5LUW3LLGQ77JNQBEL74UE2BN3AO433QECSA2A76NFISVIQ\m\maven-enforcer-plugin\target\invoker-reports\BUILD-require-profile-ids-exist_success.xml, f:\jenkins\jenkins-slave\workspace\aven-enforcer_MENFORCER-294-IBUS6H5LUW3LLGQ77JNQBEL74UE2BN3AO433QECSA2A76NFISVIQ\m\maven-enforcer-plugin\target\invoker-reports\BUILD-require-property.xml, f:\jenkins\jenkins-slave\workspace\aven-enforcer_MENFORCER-294-IBUS6H5LUW3LLGQ77JNQBEL74UE2BN3AO433QECSA2A76NFISVIQ\m\maven-enforcer-plugin\target\invoker-reports\BUILD-require-release-dependencies-excludes.xml, f:\jenkins\jenkins-slave\workspace\aven-enforcer_MENFORCER-294-IBUS6H5LUW3LLGQ77JNQBEL74UE2BN3AO433QECSA2A76NFISVIQ\m\maven-enforcer-plugin\target\invoker-reports\BUILD-require-release-dependencies-excludes_failure.xml, f:\jenkins\jenkins-slave\workspace\aven-enforcer_MENFORCER-294-IBUS6H5LUW3LLGQ77JNQBEL74UE2BN3AO433QECSA2A76NFISVIQ\m\maven-enforcer-plugin\target\invoker-reports\BUILD-require-release-dependencies.xml, f:\jenkins\jenkins-slave\workspace\aven-enforcer_MENFORCER-294-IBUS6H5LUW3LLGQ77JNQBEL74UE2BN3AO433QECSA2A76NFISVIQ\m\maven-enforcer-plugin\target\invoker-reports\BUILD-require-release-version.xml, f:\jenkins\jenkins-slave\workspace\aven-enforcer_MENFORCER-294-IBUS6H5LUW3LLGQ77JNQBEL74UE2BN3AO433QECSA2A76NFISVIQ\m\maven-enforcer-plugin\target\invoker-reports\BUILD-require-same-versions_failure.xml, f:\jenkins\jenkins-slave\workspace\aven-enforcer_MENFORCER-294-IBUS6H5LUW3LLGQ77JNQBEL74UE2BN3AO433QECSA2A76NFISVIQ\m\maven-enforcer-plugin\target\invoker-reports\BUILD-require-same-versions_success.xml, f:\jenkins\jenkins-slave\workspace\aven-enforcer_MENFORCER-294-IBUS6H5LUW3LLGQ77JNQBEL74UE2BN3AO433QECSA2A76NFISVIQ\m\maven-enforcer-plugin\target\invoker-reports\BUILD-require-snapshot-version_failure.xml, f:\jenkins\jenkins-slave\workspace\aven-enforcer_MENFORCER-294-IBUS6H5LUW3LLGQ77JNQBEL74UE2BN3AO433QECSA2A76NFISVIQ\m\maven-enforcer-plugin\target\invoker-reports\BUILD-require-snapshot-version_success.xml, f:\jenkins\jenkins-slave\workspace\aven-enforcer_MENFORCER-294-IBUS6H5LUW3LLGQ77JNQBEL74UE2BN3AO433QECSA2A76NFISVIQ\m\maven-enforcer-plugin\target\invoker-reports\BUILD-require-upper-bound-dependencies-managed_failure.xml, f:\jenkins\jenkins-slave\workspace\aven-enforcer_MENFORCER-294-IBUS6H5LUW3LLGQ77JNQBEL74UE2BN3AO433QECSA2A76NFISVIQ\m\maven-enforcer-plugin\target\invoker-reports\BUILD-require-upper-bound-dependencies-managed_success.xml, f:\jenkins\jenkins-slave\workspace\aven-enforcer_MENFORCER-294-IBUS6H5LUW3LLGQ77JNQBEL74UE2BN3AO433QECSA2A76NFISVIQ\m\maven-enforcer-plugin\target\invoker-reports\BUILD-require-upper-bound-dependencies-unique_failure.xml, f:\jenkins\jenkins-slave\workspace\aven-enforcer_MENFORCER-294-IBUS6H5LUW3LLGQ77JNQBEL74UE2BN3AO433QECSA2A76NFISVIQ\m\maven-enforcer-plugin\target\invoker-reports\BUILD-require-upper-bound-dependencies-unique_success.xml, f:\jenkins\jenkins-slave\workspace\aven-enforcer_MENFORCER-294-IBUS6H5LUW3LLGQ77JNQBEL74UE2BN3AO433QECSA2A76NFISVIQ\m\maven-enforcer-plugin\target\invoker-reports\BUILD-require-upper-bound-deps_failure.xml, f:\jenkins\jenkins-slave\workspace\aven-enforcer_MENFORCER-294-IBUS6H5LUW3LLGQ77JNQBEL74UE2BN3AO433QECSA2A76NFISVIQ\m\maven-enforcer-plugin\target\invoker-reports\BUILD-require-upper-bound-deps_ignored.xml, f:\jenkins\jenkins-slave\workspace\aven-enforcer_MENFORCER-294-IBUS6H5LUW3LLGQ77JNQBEL74UE2BN3AO433QECSA2A76NFISVIQ\m\maven-enforcer-plugin\target\invoker-reports\BUILD-require-upper-bound-deps_success.xml, f:\jenkins\jenkins-slave\workspace\aven-enforcer_MENFORCER-294-IBUS6H5LUW3LLGQ77JNQBEL74UE2BN3AO433QECSA2A76NFISVIQ\m\maven-enforcer-plugin\target\invoker-reports\BUILD-resolve_collect_dependencies.xml]
[windows-jdk7] Found logs:[f:\jenkins\jenkins-slave\workspace\aven-enforcer_MENFORCER-294-IBUS6H5LUW3LLGQ77JNQBEL74UE2BN3AO433QECSA2A76NFISVIQ\m\maven-enforcer-plugin\target\it\always-fail-warn\build.log, f:\jenkins\jenkins-slave\workspace\aven-enforcer_MENFORCER-294-IBUS6H5LUW3LLGQ77JNQBEL74UE2BN3AO433QECSA2A76NFISVIQ\m\maven-enforcer-plugin\target\it\always-fail\build.log, f:\jenkins\jenkins-slave\workspace\aven-enforcer_MENFORCER-294-IBUS6H5LUW3LLGQ77JNQBEL74UE2BN3AO433QECSA2A76NFISVIQ\m\maven-enforcer-plugin\target\it\always-pass\build.log, f:\jenkins\jenkins-slave\workspace\aven-enforcer_MENFORCER-294-IBUS6H5LUW3LLGQ77JNQBEL74UE2BN3AO433QECSA2A76NFISVIQ\m\maven-enforcer-plugin\target\it\ban-distribution-management-multi-module-build\build.log, f:\jenkins\jenkins-slave\workspace\aven-enforcer_MENFORCER-294-IBUS6H5LUW3LLGQ77JNQBEL74UE2BN3AO433QECSA2A76NFISVIQ\m\maven-enforcer-plugin\target\it\ban-distribution-management-multi-module-except-site\build.log, f:\jenkins\jenkins-slave\workspace\aven-enforcer_MENFORCER-294-IBUS6H5LUW3LLGQ77JNQBEL74UE2BN3AO433QECSA2A76NFISVIQ\m\maven-enforcer-plugin\target\it\ban-distribution-management\build.log, f:\jenkins\jenkins-slave\workspace\aven-enforcer_MENFORCER-294-IBUS6H5LUW3LLGQ77JNQBEL74UE2BN3AO433QECSA2A76NFISVIQ\m\maven-enforcer-plugin\target\it\ban-pom-dependency-version\build.log, f:\jenkins\jenkins-slave\workspace\aven-enforcer_MENFORCER-294-IBUS6H5LUW3LLGQ77JNQBEL74UE2BN3AO433QECSA2A76NFISVIQ\m\maven-enforcer-plugin\target\it\ban-transitive-dependencies-fail\build.log, f:\jenkins\jenkins-slave\workspace\aven-enforcer_MENFORCER-294-IBUS6H5LUW3LLGQ77JNQBEL74UE2BN3AO433QECSA2A76NFISVIQ\m\maven-enforcer-plugin\target\it\ban-transitive-dependencies\build.log, f:\jenkins\jenkins-slave\workspace\aven-enforcer_MENFORCER-294-IBUS6H5LUW3LLGQ77JNQBEL74UE2BN3AO433QECSA2A76NFISVIQ\m\maven-enforcer-plugin\target\it\banned-dependencies-versionrange-fail\build.log, f:\jenkins\jenkins-slave\workspace\aven-enforcer_MENFORCER-294-IBUS6H5LUW3LLGQ77JNQBEL74UE2BN3AO433QECSA2A76NFISVIQ\m\maven-enforcer-plugin\target\it\banned-dependencies-versionrange\build.log, f:\jenkins\jenkins-slave\workspace\aven-enforcer_MENFORCER-294-IBUS6H5LUW3LLGQ77JNQBEL74UE2BN3AO433QECSA2A76NFISVIQ\m\maven-enforcer-plugin\target\it\banned-dependencies-wildcards\build.log, f:\jenkins\jenkins-slave\workspace\aven-enforcer_MENFORCER-294-IBUS6H5LUW3LLGQ77JNQBEL74UE2BN3AO433QECSA2A76NFISVIQ\m\maven-enforcer-plugin\target\it\banned-dependencies\build.log, f:\jenkins\jenkins-slave\workspace\aven-enforcer_MENFORCER-294-IBUS6H5LUW3LLGQ77JNQBEL74UE2BN3AO433QECSA2A76NFISVIQ\m\maven-enforcer-plugin\target\it\banned-plugins\build.log, f:\jenkins\jenkins-slave\workspace\aven-enforcer_MENFORCER-294-IBUS6H5LUW3LLGQ77JNQBEL74UE2BN3AO433QECSA2A76NFISVIQ\m\maven-enforcer-plugin\target\it\builds_a_pom_noop\build.log, f:\jenkins\jenkins-slave\workspace\aven-enforcer_MENFORCER-294-IBUS6H5LUW3LLGQ77JNQBEL74UE2BN3AO433QECSA2A76NFISVIQ\m\maven-enforcer-plugin\target\it\cli-always-fail\build.log, f:\jenkins\jenkins-slave\workspace\aven-enforcer_MENFORCER-294-IBUS6H5LUW3LLGQ77JNQBEL74UE2BN3AO433QECSA2A76NFISVIQ\m\maven-enforcer-plugin\target\it\cli-always-pass\build.log, f:\jenkins\jenkins-slave\workspace\aven-enforcer_MENFORCER-294-IBUS6H5LUW3LLGQ77JNQBEL74UE2BN3AO433QECSA2A76NFISVIQ\m\maven-enforcer-plugin\target\it\dependencies_converge\build.log, f:\jenkins\jenkins-slave\workspace\aven-enforcer_MENFORCER-294-IBUS6H5LUW3LLGQ77JNQBEL74UE2BN3AO433QECSA2A76NFISVIQ\m\maven-enforcer-plugin\target\it\dependencies_not_converging\build.log, f:\jenkins\jenkins-slave\workspace\aven-enforcer_MENFORCER-294-IBUS6H5LUW3LLGQ77JNQBEL74UE2BN3AO433QECSA2A76NFISVIQ\m\maven-enforcer-plugin\target\it\dependencies_not_converging_test_scope\build.log, f:\jenkins\jenkins-slave\workspace\aven-enforcer_MENFORCER-294-IBUS6H5LUW3LLGQ77JNQBEL74UE2BN3AO433QECSA2A76NFISVIQ\m\maven-enforcer-plugin\target\it\display-info\build.log, f:\jenkins\jenkins-slave\workspace\aven-enforcer_MENFORCER-294-IBUS6H5LUW3LLGQ77JNQBEL74UE2BN3AO433QECSA2A76NFISVIQ\m\maven-enforcer-plugin\target\it\evaluate-beanshell\build.log, f:\jenkins\jenkins-slave\workspace\aven-enforcer_MENFORCER-294-IBUS6H5LUW3LLGQ77JNQBEL74UE2BN3AO433QECSA2A76NFISVIQ\m\maven-enforcer-plugin\target\it\multimodule\build.log, f:\jenkins\jenkins-slave\workspace\aven-enforcer_MENFORCER-294-IBUS6H5LUW3LLGQ77JNQBEL74UE2BN3AO433QECSA2A76NFISVIQ\m\maven-enforcer-plugin\target\it\require-active-profile-all\build.log, f:\jenkins\jenkins-slave\workspace\aven-enforcer_MENFORCER-294-IBUS6H5LUW3LLGQ77JNQBEL74UE2BN3AO433QECSA2A76NFISVIQ\m\maven-enforcer-plugin\target\it\require-active-profile-from-settings\build.log, f:\jenkins\jenkins-slave\workspace\aven-enforcer_MENFORCER-294-IBUS6H5LUW3LLGQ77JNQBEL74UE2BN3AO433QECSA2A76NFISVIQ\m\maven-enforcer-plugin\target\it\require-active-profile\build.log, f:\jenkins\jenkins-slave\workspace\aven-enforcer_MENFORCER-294-IBUS6H5LUW3LLGQ77JNQBEL74UE2BN3AO433QECSA2A76NFISVIQ\m\maven-enforcer-plugin\target\it\require-file-checksum\build.log, f:\jenkins\jenkins-slave\workspace\aven-enforcer_MENFORCER-294-IBUS6H5LUW3LLGQ77JNQBEL74UE2BN3AO433QECSA2A76NFISVIQ\m\maven-enforcer-plugin\target\it\require-files-dont-exist\build.log, f:\jenkins\jenkins-slave\workspace\aven-enforcer_MENFORCER-294-IBUS6H5LUW3LLGQ77JNQBEL74UE2BN3AO433QECSA2A76NFISVIQ\m\maven-enforcer-plugin\target\it\require-files-exist\build.log, f:\jenkins\jenkins-slave\workspace\aven-enforcer_MENFORCER-294-IBUS6H5LUW3LLGQ77JNQBEL74UE2BN3AO433QECSA2A76NFISVIQ\m\maven-enforcer-plugin\target\it\require-files-size\build.log, f:\jenkins\jenkins-slave\workspace\aven-enforcer_MENFORCER-294-IBUS6H5LUW3LLGQ77JNQBEL74UE2BN3AO433QECSA2A76NFISVIQ\m\maven-enforcer-plugin\target\it\require-java-version\build.log, f:\jenkins\jenkins-slave\workspace\aven-enforcer_MENFORCER-294-IBUS6H5LUW3LLGQ77JNQBEL74UE2BN3AO433QECSA2A76NFISVIQ\m\maven-enforcer-plugin\target\it\require-maven-version\build.log, f:\jenkins\jenkins-slave\workspace\aven-enforcer_MENFORCER-294-IBUS6H5LUW3LLGQ77JNQBEL74UE2BN3AO433QECSA2A76NFISVIQ\m\maven-enforcer-plugin\target\it\require-no-repositories-allow-plugin-repo\build.log, f:\jenkins\jenkins-slave\workspace\aven-enforcer_MENFORCER-294-IBUS6H5LUW3LLGQ77JNQBEL74UE2BN3AO433QECSA2A76NFISVIQ\m\maven-enforcer-plugin\target\it\require-no-repositories-allow-repo\build.log, f:\jenkins\jenkins-slave\workspace\aven-enforcer_MENFORCER-294-IBUS6H5LUW3LLGQ77JNQBEL74UE2BN3AO433QECSA2A76NFISVIQ\m\maven-enforcer-plugin\target\it\require-no-repositories\build.log, f:\jenkins\jenkins-slave\workspace\aven-enforcer_MENFORCER-294-IBUS6H5LUW3LLGQ77JNQBEL74UE2BN3AO433QECSA2A76NFISVIQ\m\maven-enforcer-plugin\target\it\require-no-repositories_failure\build.log, f:\jenkins\jenkins-slave\workspace\aven-enforcer_MENFORCER-294-IBUS6H5LUW3LLGQ77JNQBEL74UE2BN3AO433QECSA2A76NFISVIQ\m\maven-enforcer-plugin\target\it\require-no-repositories_failure_allowed-plugin-repo\build.log, f:\jenkins\jenkins-slave\workspace\aven-enforcer_MENFORCER-294-IBUS6H5LUW3LLGQ77JNQBEL74UE2BN3AO433QECSA2A76NFISVIQ\m\maven-enforcer-plugin\target\it\require-no-repositories_failure_plugin-repositories\build.log, f:\jenkins\jenkins-slave\workspace\aven-enforcer_MENFORCER-294-IBUS6H5LUW3LLGQ77JNQBEL74UE2BN3AO433QECSA2A76NFISVIQ\m\maven-enforcer-plugin\target\it\require-no-repositories_failure_repositories\build.log, f:\jenkins\jenkins-slave\workspace\aven-enforcer_MENFORCER-294-IBUS6H5LUW3LLGQ77JNQBEL74UE2BN3AO433QECSA2A76NFISVIQ\m\maven-enforcer-plugin\target\it\require-no-repositories_mm\build.log, f:\jenkins\jenkins-slave\workspace\aven-enforcer_MENFORCER-294-IBUS6H5LUW3LLGQ77JNQBEL74UE2BN3AO433QECSA2A76NFISVIQ\m\maven-enforcer-plugin\target\it\require-no-repositories_mm_ci\build.log, f:\jenkins\jenkins-slave\workspace\aven-enforcer_MENFORCER-294-IBUS6H5LUW3LLGQ77JNQBEL74UE2BN3AO433QECSA2A76NFISVIQ\m\maven-enforcer-plugin\target\it\require-plugin-versions-ci\build.log, f:\jenkins\jenkins-slave\workspace\aven-enforcer_MENFORCER-294-IBUS6H5LUW3LLGQ77JNQBEL74UE2BN3AO433QECSA2A76NFISVIQ\m\maven-enforcer-plugin\target\it\require-plugin-versions-custom-packaging\build.log, f:\jenkins\jenkins-slave\workspace\aven-enforcer_MENFORCER-294-IBUS6H5LUW3LLGQ77JNQBEL74UE2BN3AO433QECSA2A76NFISVIQ\m\maven-enforcer-plugin\target\it\require-plugin-versions-expressions\build.log, f:\jenkins\jenkins-slave\workspace\aven-enforcer_MENFORCER-294-IBUS6H5LUW3LLGQ77JNQBEL74UE2BN3AO433QECSA2A76NFISVIQ\m\maven-enforcer-plugin\target\it\require-plugin-versions-mm-ci-friendly\build.log, f:\jenkins\jenkins-slave\workspace\aven-enforcer_MENFORCER-294-IBUS6H5LUW3LLGQ77JNQBEL74UE2BN3AO433QECSA2A76NFISVIQ\m\maven-enforcer-plugin\target\it\require-plugin-versions-plugin-with-extensions\build.log, f:\jenkins\jenkins-slave\workspace\aven-enforcer_MENFORCER-294-IBUS6H5LUW3LLGQ77JNQBEL74UE2BN3AO433QECSA2A76NFISVIQ\m\maven-enforcer-plugin\target\it\require-plugin-versions-plugin-with-integration-test-lifecycle\build.log, f:\jenkins\jenkins-slave\workspace\aven-enforcer_MENFORCER-294-IBUS6H5LUW3LLGQ77JNQBEL74UE2BN3AO433QECSA2A76NFISVIQ\m\maven-enforcer-plugin\target\it\require-plugin-versions-projectGAVexpressions\build.log, f:\jenkins\jenkins-slave\workspace\aven-enforcer_MENFORCER-294-IBUS6H5LUW3LLGQ77JNQBEL74UE2BN3AO433QECSA2A76NFISVIQ\m\maven-enforcer-plugin\target\it\require-plugin-versions\build.log, f:\jenkins\jenkins-slave\workspace\aven-enforcer_MENFORCER-294-IBUS6H5LUW3LLGQ77JNQBEL74UE2BN3AO433QECSA2A76NFISVIQ\m\maven-enforcer-plugin\target\it\require-profile-ids-exist_failure\build.log, f:\jenkins\jenkins-slave\workspace\aven-enforcer_MENFORCER-294-IBUS6H5LUW3LLGQ77JNQBEL74UE2BN3AO433QECSA2A76NFISVIQ\m\maven-enforcer-plugin\target\it\require-profile-ids-exist_success\build.log, f:\jenkins\jenkins-slave\workspace\aven-enforcer_MENFORCER-294-IBUS6H5LUW3LLGQ77JNQBEL74UE2BN3AO433QECSA2A76NFISVIQ\m\maven-enforcer-plugin\target\it\require-property\build.log, f:\jenkins\jenkins-slave\workspace\aven-enforcer_MENFORCER-294-IBUS6H5LUW3LLGQ77JNQBEL74UE2BN3AO433QECSA2A76NFISVIQ\m\maven-enforcer-plugin\target\it\require-release-dependencies-excludes\build.log, f:\jenkins\jenkins-slave\workspace\aven-enforcer_MENFORCER-294-IBUS6H5LUW3LLGQ77JNQBEL74UE2BN3AO433QECSA2A76NFISVIQ\m\maven-enforcer-plugin\target\it\require-release-dependencies-excludes_failure\build.log, f:\jenkins\jenkins-slave\workspace\aven-enforcer_MENFORCER-294-IBUS6H5LUW3LLGQ77JNQBEL74UE2BN3AO433QECSA2A76NFISVIQ\m\maven-enforcer-plugin\target\it\require-release-dependencies\build.log, f:\jenkins\jenkins-slave\workspace\aven-enforcer_MENFORCER-294-IBUS6H5LUW3LLGQ77JNQBEL74UE2BN3AO433QECSA2A76NFISVIQ\m\maven-enforcer-plugin\target\it\require-release-version\build.log, f:\jenkins\jenkins-slave\workspace\aven-enforcer_MENFORCER-294-IBUS6H5LUW3LLGQ77JNQBEL74UE2BN3AO433QECSA2A76NFISVIQ\m\maven-enforcer-plugin\target\it\require-same-versions_failure\build.log, f:\jenkins\jenkins-slave\workspace\aven-enforcer_MENFORCER-294-IBUS6H5LUW3LLGQ77JNQBEL74UE2BN3AO433QECSA2A76NFISVIQ\m\maven-enforcer-plugin\target\it\require-same-versions_success\build.log, f:\jenkins\jenkins-slave\workspace\aven-enforcer_MENFORCER-294-IBUS6H5LUW3LLGQ77JNQBEL74UE2BN3AO433QECSA2A76NFISVIQ\m\maven-enforcer-plugin\target\it\require-snapshot-version_failure\build.log, f:\jenkins\jenkins-slave\workspace\aven-enforcer_MENFORCER-294-IBUS6H5LUW3LLGQ77JNQBEL74UE2BN3AO433QECSA2A76NFISVIQ\m\maven-enforcer-plugin\target\it\require-snapshot-version_success\build.log, f:\jenkins\jenkins-slave\workspace\aven-enforcer_MENFORCER-294-IBUS6H5LUW3LLGQ77JNQBEL74UE2BN3AO433QECSA2A76NFISVIQ\m\maven-enforcer-plugin\target\it\require-upper-bound-dependencies-managed_failure\build.log, f:\jenkins\jenkins-slave\workspace\aven-enforcer_MENFORCER-294-IBUS6H5LUW3LLGQ77JNQBEL74UE2BN3AO433QECSA2A76NFISVIQ\m\maven-enforcer-plugin\target\it\require-upper-bound-dependencies-managed_success\build.log, f:\jenkins\jenkins-slave\workspace\aven-enforcer_MENFORCER-294-IBUS6H5LUW3LLGQ77JNQBEL74UE2BN3AO433QECSA2A76NFISVIQ\m\maven-enforcer-plugin\target\it\require-upper-bound-dependencies-unique_failure\build.log, f:\jenkins\jenkins-slave\workspace\aven-enforcer_MENFORCER-294-IBUS6H5LUW3LLGQ77JNQBEL74UE2BN3AO433QECSA2A76NFISVIQ\m\maven-enforcer-plugin\target\it\require-upper-bound-dependencies-unique_success\build.log, f:\jenkins\jenkins-slave\workspace\aven-enforcer_MENFORCER-294-IBUS6H5LUW3LLGQ77JNQBEL74UE2BN3AO433QECSA2A76NFISVIQ\m\maven-enforcer-plugin\target\it\require-upper-bound-deps_failure\build.log, f:\jenkins\jenkins-slave\workspace\aven-enforcer_MENFORCER-294-IBUS6H5LUW3LLGQ77JNQBEL74UE2BN3AO433QECSA2A76NFISVIQ\m\maven-enforcer-plugin\target\it\require-upper-bound-deps_ignored\build.log, f:\jenkins\jenkins-slave\workspace\aven-enforcer_MENFORCER-294-IBUS6H5LUW3LLGQ77JNQBEL74UE2BN3AO433QECSA2A76NFISVIQ\m\maven-enforcer-plugin\target\it\require-upper-bound-deps_success\build.log, f:\jenkins\jenkins-slave\workspace\aven-enforcer_MENFORCER-294-IBUS6H5LUW3LLGQ77JNQBEL74UE2BN3AO433QECSA2A76NFISVIQ\m\maven-enforcer-plugin\target\it\resolve_collect_dependencies\build.log]
[windows-jdk7] Finished parsing Maven Invoker results (found 68)
[windows-jdk7] [withMaven] junitPublisher - Archive test results for Maven artifact org.apache.maven.enforcer:enforcer-api:3.0.0-SNAPSHOT generated by maven-surefire-plugin:test (default-test): m\enforcer-api\target\surefire-reports\*.xml
[windows-jdk7] Recording test results
[windows-jdk7] None of the test reports contained any result
[windows-jdk7] [withMaven] junitPublisher - Archive test results for Maven artifact org.apache.maven.enforcer:enforcer-rules:3.0.0-SNAPSHOT generated by maven-surefire-plugin:test (default-test): m\enforcer-rules\target\surefire-reports\*.xml
[windows-jdk7] Recording test results
[windows-jdk7] [withMaven] junitPublisher - Archive test results for Maven artifact org.apache.maven.plugins:maven-enforcer-plugin:3.0.0-SNAPSHOT generated by maven-surefire-plugin:test (default-test): m\maven-enforcer-plugin\target\surefire-reports\*.xml
[windows-jdk7] Recording test results
[Pipeline] [windows-jdk7] // withMaven
[Pipeline] [windows-jdk7] cleanWs
[Pipeline] [windows-jdk8] }
[Pipeline] [windows-jdk8] // stage
[Pipeline] [windows-jdk8] }
[Pipeline] [windows-jdk8] // node
[Pipeline] [windows-jdk8] }
[windows-jdk7] [WS-CLEANUP] Deleting project workspace...[WS-CLEANUP] done
[Pipeline] [windows-jdk7] }
[Pipeline] [windows-jdk7] // stage
[Pipeline] [windows-jdk7] }
[Pipeline] [windows-jdk7] // node
[Pipeline] [windows-jdk7] }
[windows-jdk9] [INFO] run post-build script verify.groovy
[windows-jdk9] [INFO]           require-upper-bound-dependencies-managed_failure\pom.xml SUCCESS (5.7 s)
[windows-jdk9] [INFO] Building: require-upper-bound-dependencies-managed_success\pom.xml
[windows-jdk10] [INFO]           require-no-repositories_mm\pom.xml ............... SUCCESS (5.5 s)
[windows-jdk10] [INFO] Building: require-no-repositories_mm_ci\pom.xml
[windows-jdk9] [INFO]           require-upper-bound-dependencies-managed_success\pom.xml SUCCESS (4.9 s)
[windows-jdk9] [INFO] Building: require-upper-bound-dependencies-unique_failure\pom.xml
[windows-jdk10] [INFO]           require-no-repositories_mm_ci\pom.xml ............ SUCCESS (6.1 s)
[windows-jdk10] [INFO] Building: require-plugin-versions\pom.xml
[windows-jdk9] [INFO] snapshot org.apache.maven.plugins.enforcer.its:menforcer134_project:1.0-SNAPSHOT: checking for updates from apache-snapshots
[windows-jdk9] [INFO] snapshot org.apache.maven.plugins.enforcer.its:menforcer134_project:1.0-SNAPSHOT: checking for updates from Nexus
[windows-jdk9] [INFO] artifact org.apache.maven.plugins.enforcer.its.menforcer134_project:1.0-SNAPSHOT: checking for updates from central
[windows-jdk9] [INFO] org.apache.maven.plugins.enforcer.its.menforcer134_project.1.0-SNAPSHOT: checking for updates from central
[windows-jdk9] [INFO] snapshot org.apache.maven.plugins.enforcer.its:menforcer134_modelbuilder:1.0-SNAPSHOT: checking for updates from apache-snapshots
[windows-jdk9] [INFO] snapshot org.apache.maven.plugins.enforcer.its:menforcer134_modelbuilder:1.0-SNAPSHOT: checking for updates from Nexus
[windows-jdk9] [INFO] artifact org.apache.maven.plugins.enforcer.its.menforcer134_modelbuilder:1.0-SNAPSHOT: checking for updates from central
[windows-jdk9] [INFO] org.apache.maven.plugins.enforcer.its.menforcer134_modelbuilder.1.0-SNAPSHOT: checking for updates from central
[windows-jdk9] [INFO] snapshot org.apache.maven.plugins.enforcer.its:menforcer134_model:1.0-SNAPSHOT: checking for updates from apache-snapshots
[windows-jdk9] [INFO] snapshot org.apache.maven.plugins.enforcer.its:menforcer134_model:1.0-SNAPSHOT: checking for updates from Nexus
[windows-jdk9] [INFO] artifact org.apache.maven.plugins.enforcer.its.menforcer134_model:1.0-SNAPSHOT: checking for updates from central
[windows-jdk9] [INFO] org.apache.maven.plugins.enforcer.its.menforcer134_model.1.0-SNAPSHOT: checking for updates from central
[windows-jdk9] [INFO] run post-build script verify.groovy
[windows-jdk9] [INFO]           require-upper-bound-dependencies-unique_failure\pom.xml SUCCESS (5.6 s)
[windows-jdk9] [INFO] Building: require-upper-bound-dependencies-unique_success\pom.xml
[windows-jdk10] [INFO]           require-plugin-versions\pom.xml .................. SUCCESS (5.6 s)
[windows-jdk10] [INFO] Building: require-plugin-versions-ci\pom.xml
[windows-jdk9] [INFO]           require-upper-bound-dependencies-unique_success\pom.xml SUCCESS (4.3 s)
[windows-jdk9] [INFO] Building: require-upper-bound-deps_failure\pom.xml
[windows-jdk10] [INFO] run post-build script verify.groovy
[windows-jdk10] [INFO]           require-plugin-versions-ci\pom.xml ............... SUCCESS (5.6 s)
[windows-jdk10] [INFO] Building: require-plugin-versions-custom-packaging\pom.xml
[windows-jdk9] [INFO] run post-build script verify.groovy
[windows-jdk9] [INFO]           require-upper-bound-deps_failure\pom.xml ......... SUCCESS (5.2 s)
[windows-jdk9] [INFO] Building: require-upper-bound-deps_ignored\pom.xml
[windows-jdk9] [INFO] run post-build script verify.groovy
[windows-jdk9] [INFO]           require-upper-bound-deps_ignored\pom.xml ......... SUCCESS (4.1 s)
[windows-jdk9] [INFO] Building: require-upper-bound-deps_success\pom.xml
[windows-jdk10] [INFO] artifact org.apache.maven.plugins:maven-resources-plugin: checking for updates from central
[windows-jdk10] [INFO] artifact org.apache.maven.plugins:maven-compiler-plugin: checking for updates from central
[windows-jdk10] [INFO] artifact org.apache.maven.plugins:maven-surefire-plugin: checking for updates from central
[windows-jdk10] [INFO] artifact org.apache.maven.plugins:maven-install-plugin: checking for updates from central
[windows-jdk10] [INFO] artifact org.apache.maven.plugins:maven-deploy-plugin: checking for updates from central
[windows-jdk9] [INFO]           require-upper-bound-deps_success\pom.xml ......... SUCCESS (4.3 s)
[windows-jdk9] [INFO] Building: resolve_collect_dependencies\pom.xml
[windows-jdk10] [INFO]           require-plugin-versions-custom-packaging\pom.xml . SUCCESS (11.9 s)
[windows-jdk10] [INFO] Building: require-plugin-versions-expressions\pom.xml
[windows-jdk9] [INFO] run post-build script verify.groovy
[windows-jdk9] [INFO]           resolve_collect_dependencies\pom.xml ............. SUCCESS (6.4 s)
[windows-jdk9] [INFO] -------------------------------------------------
[windows-jdk9] [INFO] Build Summary:
[windows-jdk9] [INFO]   Passed: 68, Failed: 0, Errors: 0, Skipped: 0
[windows-jdk9] [INFO] -------------------------------------------------
[windows-jdk9] [INFO] 
[windows-jdk9] [INFO] --- mrm-maven-plugin:1.0.0:stop (default) @ maven-enforcer-plugin ---
[windows-jdk9] [INFO] Stopping Mock Repository Manager on http://localhost:63855
[windows-jdk9] [INFO] Mock Repository Manager http://localhost:63855 is stopped.
[windows-jdk9] [INFO] 
[windows-jdk9] [INFO] --- maven-checkstyle-plugin:3.0.0:check (checkstyle-check) @ maven-enforcer-plugin ---
[windows-jdk9] [INFO] ------------------------------------------------------------------------
[windows-jdk9] [INFO] Reactor Summary:
[windows-jdk9] [INFO] 
[windows-jdk9] [INFO] Apache Maven Enforcer .............................. SUCCESS [ 13.603 s]
[windows-jdk9] [INFO] Apache Maven Enforcer API .......................... SUCCESS [  5.177 s]
[windows-jdk9] [INFO] Apache Maven Enforcer Built-In Rules ............... SUCCESS [ 11.847 s]
[windows-jdk9] [INFO] Apache Maven Enforcer Plugin ....................... SUCCESS [05:44 min]
[windows-jdk9] [INFO] ------------------------------------------------------------------------
[windows-jdk9] [INFO] BUILD SUCCESS
[windows-jdk9] [INFO] ------------------------------------------------------------------------
[windows-jdk9] [INFO] Total time: 06:16 min
[windows-jdk9] [INFO] Finished at: 2018-08-17T05:27:20Z
[windows-jdk9] [INFO] Final Memory: 52M/175M
[windows-jdk9] [INFO] ------------------------------------------------------------------------
[windows-jdk9] [INFO] [jenkins-event-spy] Generated F:\jenkins\jenkins-slave\workspace\aven-enforcer_MENFORCER-294-IBUS6H5LUW3LLGQ77JNQBEL74UE2BN3AO433QECSA2A76NFISVIQ@tmp\withMaven38bb8f53\maven-spy-20180817-052104-2315578667855736106667.log
[windows-jdk10] [INFO]           require-plugin-versions-expressions\pom.xml ...... SUCCESS (5.3 s)
[windows-jdk10] [INFO] Building: require-plugin-versions-mm-ci-friendly\pom.xml
[Pipeline] [windows-jdk9] }
[Pipeline] [windows-jdk9] // dir
[Pipeline] [windows-jdk9] }
[windows-jdk9] [withMaven] invokerPublisher - Archive invoker results for Maven artifact MavenArtifact{org.apache.maven.plugins:maven-enforcer-plugin::3.0.0-SNAPSHOT(version: 3.0.0-SNAPSHOT, snapshot:false) } generated by PluginInvocation{org.apache.maven.plugins:maven-invoker-plugin:3.0.1@run  integration-test}: m\maven-enforcer-plugin\target\invoker-reports\*.xml
[windows-jdk9] performing MavenInvokerRecorder, reportsFilenamePattern:'**/m\maven-enforcer-plugin\target\invoker-reports/BUILD*.xml', invokerBuildDir:'**/m\maven-enforcer-plugin\target\it'
[windows-jdk9] Found reports:[f:\jenkins\jenkins-slave\workspace\aven-enforcer_MENFORCER-294-IBUS6H5LUW3LLGQ77JNQBEL74UE2BN3AO433QECSA2A76NFISVIQ\m\maven-enforcer-plugin\target\invoker-reports\BUILD-always-fail-warn.xml, f:\jenkins\jenkins-slave\workspace\aven-enforcer_MENFORCER-294-IBUS6H5LUW3LLGQ77JNQBEL74UE2BN3AO433QECSA2A76NFISVIQ\m\maven-enforcer-plugin\target\invoker-reports\BUILD-always-fail.xml, f:\jenkins\jenkins-slave\workspace\aven-enforcer_MENFORCER-294-IBUS6H5LUW3LLGQ77JNQBEL74UE2BN3AO433QECSA2A76NFISVIQ\m\maven-enforcer-plugin\target\invoker-reports\BUILD-always-pass.xml, f:\jenkins\jenkins-slave\workspace\aven-enforcer_MENFORCER-294-IBUS6H5LUW3LLGQ77JNQBEL74UE2BN3AO433QECSA2A76NFISVIQ\m\maven-enforcer-plugin\target\invoker-reports\BUILD-ban-distribution-management-multi-module-build.xml, f:\jenkins\jenkins-slave\workspace\aven-enforcer_MENFORCER-294-IBUS6H5LUW3LLGQ77JNQBEL74UE2BN3AO433QECSA2A76NFISVIQ\m\maven-enforcer-plugin\target\invoker-reports\BUILD-ban-distribution-management-multi-module-except-site.xml, f:\jenkins\jenkins-slave\workspace\aven-enforcer_MENFORCER-294-IBUS6H5LUW3LLGQ77JNQBEL74UE2BN3AO433QECSA2A76NFISVIQ\m\maven-enforcer-plugin\target\invoker-reports\BUILD-ban-distribution-management.xml, f:\jenkins\jenkins-slave\workspace\aven-enforcer_MENFORCER-294-IBUS6H5LUW3LLGQ77JNQBEL74UE2BN3AO433QECSA2A76NFISVIQ\m\maven-enforcer-plugin\target\invoker-reports\BUILD-ban-pom-dependency-version.xml, f:\jenkins\jenkins-slave\workspace\aven-enforcer_MENFORCER-294-IBUS6H5LUW3LLGQ77JNQBEL74UE2BN3AO433QECSA2A76NFISVIQ\m\maven-enforcer-plugin\target\invoker-reports\BUILD-ban-transitive-dependencies-fail.xml, f:\jenkins\jenkins-slave\workspace\aven-enforcer_MENFORCER-294-IBUS6H5LUW3LLGQ77JNQBEL74UE2BN3AO433QECSA2A76NFISVIQ\m\maven-enforcer-plugin\target\invoker-reports\BUILD-ban-transitive-dependencies.xml, f:\jenkins\jenkins-slave\workspace\aven-enforcer_MENFORCER-294-IBUS6H5LUW3LLGQ77JNQBEL74UE2BN3AO433QECSA2A76NFISVIQ\m\maven-enforcer-plugin\target\invoker-reports\BUILD-banned-dependencies-versionrange-fail.xml, f:\jenkins\jenkins-slave\workspace\aven-enforcer_MENFORCER-294-IBUS6H5LUW3LLGQ77JNQBEL74UE2BN3AO433QECSA2A76NFISVIQ\m\maven-enforcer-plugin\target\invoker-reports\BUILD-banned-dependencies-versionrange.xml, f:\jenkins\jenkins-slave\workspace\aven-enforcer_MENFORCER-294-IBUS6H5LUW3LLGQ77JNQBEL74UE2BN3AO433QECSA2A76NFISVIQ\m\maven-enforcer-plugin\target\invoker-reports\BUILD-banned-dependencies-wildcards.xml, f:\jenkins\jenkins-slave\workspace\aven-enforcer_MENFORCER-294-IBUS6H5LUW3LLGQ77JNQBEL74UE2BN3AO433QECSA2A76NFISVIQ\m\maven-enforcer-plugin\target\invoker-reports\BUILD-banned-dependencies.xml, f:\jenkins\jenkins-slave\workspace\aven-enforcer_MENFORCER-294-IBUS6H5LUW3LLGQ77JNQBEL74UE2BN3AO433QECSA2A76NFISVIQ\m\maven-enforcer-plugin\target\invoker-reports\BUILD-banned-plugins.xml, f:\jenkins\jenkins-slave\workspace\aven-enforcer_MENFORCER-294-IBUS6H5LUW3LLGQ77JNQBEL74UE2BN3AO433QECSA2A76NFISVIQ\m\maven-enforcer-plugin\target\invoker-reports\BUILD-builds_a_pom_noop.xml, f:\jenkins\jenkins-slave\workspace\aven-enforcer_MENFORCER-294-IBUS6H5LUW3LLGQ77JNQBEL74UE2BN3AO433QECSA2A76NFISVIQ\m\maven-enforcer-plugin\target\invoker-reports\BUILD-cli-always-fail.xml, f:\jenkins\jenkins-slave\workspace\aven-enforcer_MENFORCER-294-IBUS6H5LUW3LLGQ77JNQBEL74UE2BN3AO433QECSA2A76NFISVIQ\m\maven-enforcer-plugin\target\invoker-reports\BUILD-cli-always-pass.xml, f:\jenkins\jenkins-slave\workspace\aven-enforcer_MENFORCER-294-IBUS6H5LUW3LLGQ77JNQBEL74UE2BN3AO433QECSA2A76NFISVIQ\m\maven-enforcer-plugin\target\invoker-reports\BUILD-dependencies_converge.xml, f:\jenkins\jenkins-slave\workspace\aven-enforcer_MENFORCER-294-IBUS6H5LUW3LLGQ77JNQBEL74UE2BN3AO433QECSA2A76NFISVIQ\m\maven-enforcer-plugin\target\invoker-reports\BUILD-dependencies_not_converging.xml, f:\jenkins\jenkins-slave\workspace\aven-enforcer_MENFORCER-294-IBUS6H5LUW3LLGQ77JNQBEL74UE2BN3AO433QECSA2A76NFISVIQ\m\maven-enforcer-plugin\target\invoker-reports\BUILD-dependencies_not_converging_test_scope.xml, f:\jenkins\jenkins-slave\workspace\aven-enforcer_MENFORCER-294-IBUS6H5LUW3LLGQ77JNQBEL74UE2BN3AO433QECSA2A76NFISVIQ\m\maven-enforcer-plugin\target\invoker-reports\BUILD-display-info.xml, f:\jenkins\jenkins-slave\workspace\aven-enforcer_MENFORCER-294-IBUS6H5LUW3LLGQ77JNQBEL74UE2BN3AO433QECSA2A76NFISVIQ\m\maven-enforcer-plugin\target\invoker-reports\BUILD-evaluate-beanshell.xml, f:\jenkins\jenkins-slave\workspace\aven-enforcer_MENFORCER-294-IBUS6H5LUW3LLGQ77JNQBEL74UE2BN3AO433QECSA2A76NFISVIQ\m\maven-enforcer-plugin\target\invoker-reports\BUILD-multimodule.xml, f:\jenkins\jenkins-slave\workspace\aven-enforcer_MENFORCER-294-IBUS6H5LUW3LLGQ77JNQBEL74UE2BN3AO433QECSA2A76NFISVIQ\m\maven-enforcer-plugin\target\invoker-reports\BUILD-require-active-profile-all.xml, f:\jenkins\jenkins-slave\workspace\aven-enforcer_MENFORCER-294-IBUS6H5LUW3LLGQ77JNQBEL74UE2BN3AO433QECSA2A76NFISVIQ\m\maven-enforcer-plugin\target\invoker-reports\BUILD-require-active-profile-from-settings.xml, f:\jenkins\jenkins-slave\workspace\aven-enforcer_MENFORCER-294-IBUS6H5LUW3LLGQ77JNQBEL74UE2BN3AO433QECSA2A76NFISVIQ\m\maven-enforcer-plugin\target\invoker-reports\BUILD-require-active-profile.xml, f:\jenkins\jenkins-slave\workspace\aven-enforcer_MENFORCER-294-IBUS6H5LUW3LLGQ77JNQBEL74UE2BN3AO433QECSA2A76NFISVIQ\m\maven-enforcer-plugin\target\invoker-reports\BUILD-require-file-checksum.xml, f:\jenkins\jenkins-slave\workspace\aven-enforcer_MENFORCER-294-IBUS6H5LUW3LLGQ77JNQBEL74UE2BN3AO433QECSA2A76NFISVIQ\m\maven-enforcer-plugin\target\invoker-reports\BUILD-require-files-dont-exist.xml, f:\jenkins\jenkins-slave\workspace\aven-enforcer_MENFORCER-294-IBUS6H5LUW3LLGQ77JNQBEL74UE2BN3AO433QECSA2A76NFISVIQ\m\maven-enforcer-plugin\target\invoker-reports\BUILD-require-files-exist.xml, f:\jenkins\jenkins-slave\workspace\aven-enforcer_MENFORCER-294-IBUS6H5LUW3LLGQ77JNQBEL74UE2BN3AO433QECSA2A76NFISVIQ\m\maven-enforcer-plugin\target\invoker-reports\BUILD-require-files-size.xml, f:\jenkins\jenkins-slave\workspace\aven-enforcer_MENFORCER-294-IBUS6H5LUW3LLGQ77JNQBEL74UE2BN3AO433QECSA2A76NFISVIQ\m\maven-enforcer-plugin\target\invoker-reports\BUILD-require-java-version.xml, f:\jenkins\jenkins-slave\workspace\aven-enforcer_MENFORCER-294-IBUS6H5LUW3LLGQ77JNQBEL74UE2BN3AO433QECSA2A76NFISVIQ\m\maven-enforcer-plugin\target\invoker-reports\BUILD-require-maven-version.xml, f:\jenkins\jenkins-slave\workspace\aven-enforcer_MENFORCER-294-IBUS6H5LUW3LLGQ77JNQBEL74UE2BN3AO433QECSA2A76NFISVIQ\m\maven-enforcer-plugin\target\invoker-reports\BUILD-require-no-repositories-allow-plugin-repo.xml, f:\jenkins\jenkins-slave\workspace\aven-enforcer_MENFORCER-294-IBUS6H5LUW3LLGQ77JNQBEL74UE2BN3AO433QECSA2A76NFISVIQ\m\maven-enforcer-plugin\target\invoker-reports\BUILD-require-no-repositories-allow-repo.xml, f:\jenkins\jenkins-slave\workspace\aven-enforcer_MENFORCER-294-IBUS6H5LUW3LLGQ77JNQBEL74UE2BN3AO433QECSA2A76NFISVIQ\m\maven-enforcer-plugin\target\invoker-reports\BUILD-require-no-repositories.xml, f:\jenkins\jenkins-slave\workspace\aven-enforcer_MENFORCER-294-IBUS6H5LUW3LLGQ77JNQBEL74UE2BN3AO433QECSA2A76NFISVIQ\m\maven-enforcer-plugin\target\invoker-reports\BUILD-require-no-repositories_failure.xml, f:\jenkins\jenkins-slave\workspace\aven-enforcer_MENFORCER-294-IBUS6H5LUW3LLGQ77JNQBEL74UE2BN3AO433QECSA2A76NFISVIQ\m\maven-enforcer-plugin\target\invoker-reports\BUILD-require-no-repositories_failure_allowed-plugin-repo.xml, f:\jenkins\jenkins-slave\workspace\aven-enforcer_MENFORCER-294-IBUS6H5LUW3LLGQ77JNQBEL74UE2BN3AO433QECSA2A76NFISVIQ\m\maven-enforcer-plugin\target\invoker-reports\BUILD-require-no-repositories_failure_plugin-repositories.xml, f:\jenkins\jenkins-slave\workspace\aven-enforcer_MENFORCER-294-IBUS6H5LUW3LLGQ77JNQBEL74UE2BN3AO433QECSA2A76NFISVIQ\m\maven-enforcer-plugin\target\invoker-reports\BUILD-require-no-repositories_failure_repositories.xml, f:\jenkins\jenkins-slave\workspace\aven-enforcer_MENFORCER-294-IBUS6H5LUW3LLGQ77JNQBEL74UE2BN3AO433QECSA2A76NFISVIQ\m\maven-enforcer-plugin\target\invoker-reports\BUILD-require-no-repositories_mm.xml, f:\jenkins\jenkins-slave\workspace\aven-enforcer_MENFORCER-294-IBUS6H5LUW3LLGQ77JNQBEL74UE2BN3AO433QECSA2A76NFISVIQ\m\maven-enforcer-plugin\target\invoker-reports\BUILD-require-no-repositories_mm_ci.xml, f:\jenkins\jenkins-slave\workspace\aven-enforcer_MENFORCER-294-IBUS6H5LUW3LLGQ77JNQBEL74UE2BN3AO433QECSA2A76NFISVIQ\m\maven-enforcer-plugin\target\invoker-reports\BUILD-require-plugin-versions-ci.xml, f:\jenkins\jenkins-slave\workspace\aven-enforcer_MENFORCER-294-IBUS6H5LUW3LLGQ77JNQBEL74UE2BN3AO433QECSA2A76NFISVIQ\m\maven-enforcer-plugin\target\invoker-reports\BUILD-require-plugin-versions-custom-packaging.xml, f:\jenkins\jenkins-slave\workspace\aven-enforcer_MENFORCER-294-IBUS6H5LUW3LLGQ77JNQBEL74UE2BN3AO433QECSA2A76NFISVIQ\m\maven-enforcer-plugin\target\invoker-reports\BUILD-require-plugin-versions-expressions.xml, f:\jenkins\jenkins-slave\workspace\aven-enforcer_MENFORCER-294-IBUS6H5LUW3LLGQ77JNQBEL74UE2BN3AO433QECSA2A76NFISVIQ\m\maven-enforcer-plugin\target\invoker-reports\BUILD-require-plugin-versions-mm-ci-friendly.xml, f:\jenkins\jenkins-slave\workspace\aven-enforcer_MENFORCER-294-IBUS6H5LUW3LLGQ77JNQBEL74UE2BN3AO433QECSA2A76NFISVIQ\m\maven-enforcer-plugin\target\invoker-reports\BUILD-require-plugin-versions-plugin-with-extensions.xml, f:\jenkins\jenkins-slave\workspace\aven-enforcer_MENFORCER-294-IBUS6H5LUW3LLGQ77JNQBEL74UE2BN3AO433QECSA2A76NFISVIQ\m\maven-enforcer-plugin\target\invoker-reports\BUILD-require-plugin-versions-plugin-with-integration-test-lifecycle.xml, f:\jenkins\jenkins-slave\workspace\aven-enforcer_MENFORCER-294-IBUS6H5LUW3LLGQ77JNQBEL74UE2BN3AO433QECSA2A76NFISVIQ\m\maven-enforcer-plugin\target\invoker-reports\BUILD-require-plugin-versions-projectGAVexpressions.xml, f:\jenkins\jenkins-slave\workspace\aven-enforcer_MENFORCER-294-IBUS6H5LUW3LLGQ77JNQBEL74UE2BN3AO433QECSA2A76NFISVIQ\m\maven-enforcer-plugin\target\invoker-reports\BUILD-require-plugin-versions.xml, f:\jenkins\jenkins-slave\workspace\aven-enforcer_MENFORCER-294-IBUS6H5LUW3LLGQ77JNQBEL74UE2BN3AO433QECSA2A76NFISVIQ\m\maven-enforcer-plugin\target\invoker-reports\BUILD-require-profile-ids-exist_failure.xml, f:\jenkins\jenkins-slave\workspace\aven-enforcer_MENFORCER-294-IBUS6H5LUW3LLGQ77JNQBEL74UE2BN3AO433QECSA2A76NFISVIQ\m\maven-enforcer-plugin\target\invoker-reports\BUILD-require-profile-ids-exist_success.xml, f:\jenkins\jenkins-slave\workspace\aven-enforcer_MENFORCER-294-IBUS6H5LUW3LLGQ77JNQBEL74UE2BN3AO433QECSA2A76NFISVIQ\m\maven-enforcer-plugin\target\invoker-reports\BUILD-require-property.xml, f:\jenkins\jenkins-slave\workspace\aven-enforcer_MENFORCER-294-IBUS6H5LUW3LLGQ77JNQBEL74UE2BN3AO433QECSA2A76NFISVIQ\m\maven-enforcer-plugin\target\invoker-reports\BUILD-require-release-dependencies-excludes.xml, f:\jenkins\jenkins-slave\workspace\aven-enforcer_MENFORCER-294-IBUS6H5LUW3LLGQ77JNQBEL74UE2BN3AO433QECSA2A76NFISVIQ\m\maven-enforcer-plugin\target\invoker-reports\BUILD-require-release-dependencies-excludes_failure.xml, f:\jenkins\jenkins-slave\workspace\aven-enforcer_MENFORCER-294-IBUS6H5LUW3LLGQ77JNQBEL74UE2BN3AO433QECSA2A76NFISVIQ\m\maven-enforcer-plugin\target\invoker-reports\BUILD-require-release-dependencies.xml, f:\jenkins\jenkins-slave\workspace\aven-enforcer_MENFORCER-294-IBUS6H5LUW3LLGQ77JNQBEL74UE2BN3AO433QECSA2A76NFISVIQ\m\maven-enforcer-plugin\target\invoker-reports\BUILD-require-release-version.xml, f:\jenkins\jenkins-slave\workspace\aven-enforcer_MENFORCER-294-IBUS6H5LUW3LLGQ77JNQBEL74UE2BN3AO433QECSA2A76NFISVIQ\m\maven-enforcer-plugin\target\invoker-reports\BUILD-require-same-versions_failure.xml, f:\jenkins\jenkins-slave\workspace\aven-enforcer_MENFORCER-294-IBUS6H5LUW3LLGQ77JNQBEL74UE2BN3AO433QECSA2A76NFISVIQ\m\maven-enforcer-plugin\target\invoker-reports\BUILD-require-same-versions_success.xml, f:\jenkins\jenkins-slave\workspace\aven-enforcer_MENFORCER-294-IBUS6H5LUW3LLGQ77JNQBEL74UE2BN3AO433QECSA2A76NFISVIQ\m\maven-enforcer-plugin\target\invoker-reports\BUILD-require-snapshot-version_failure.xml, f:\jenkins\jenkins-slave\workspace\aven-enforcer_MENFORCER-294-IBUS6H5LUW3LLGQ77JNQBEL74UE2BN3AO433QECSA2A76NFISVIQ\m\maven-enforcer-plugin\target\invoker-reports\BUILD-require-snapshot-version_success.xml, f:\jenkins\jenkins-slave\workspace\aven-enforcer_MENFORCER-294-IBUS6H5LUW3LLGQ77JNQBEL74UE2BN3AO433QECSA2A76NFISVIQ\m\maven-enforcer-plugin\target\invoker-reports\BUILD-require-upper-bound-dependencies-managed_failure.xml, f:\jenkins\jenkins-slave\workspace\aven-enforcer_MENFORCER-294-IBUS6H5LUW3LLGQ77JNQBEL74UE2BN3AO433QECSA2A76NFISVIQ\m\maven-enforcer-plugin\target\invoker-reports\BUILD-require-upper-bound-dependencies-managed_success.xml, f:\jenkins\jenkins-slave\workspace\aven-enforcer_MENFORCER-294-IBUS6H5LUW3LLGQ77JNQBEL74UE2BN3AO433QECSA2A76NFISVIQ\m\maven-enforcer-plugin\target\invoker-reports\BUILD-require-upper-bound-dependencies-unique_failure.xml, f:\jenkins\jenkins-slave\workspace\aven-enforcer_MENFORCER-294-IBUS6H5LUW3LLGQ77JNQBEL74UE2BN3AO433QECSA2A76NFISVIQ\m\maven-enforcer-plugin\target\invoker-reports\BUILD-require-upper-bound-dependencies-unique_success.xml, f:\jenkins\jenkins-slave\workspace\aven-enforcer_MENFORCER-294-IBUS6H5LUW3LLGQ77JNQBEL74UE2BN3AO433QECSA2A76NFISVIQ\m\maven-enforcer-plugin\target\invoker-reports\BUILD-require-upper-bound-deps_failure.xml, f:\jenkins\jenkins-slave\workspace\aven-enforcer_MENFORCER-294-IBUS6H5LUW3LLGQ77JNQBEL74UE2BN3AO433QECSA2A76NFISVIQ\m\maven-enforcer-plugin\target\invoker-reports\BUILD-require-upper-bound-deps_ignored.xml, f:\jenkins\jenkins-slave\workspace\aven-enforcer_MENFORCER-294-IBUS6H5LUW3LLGQ77JNQBEL74UE2BN3AO433QECSA2A76NFISVIQ\m\maven-enforcer-plugin\target\invoker-reports\BUILD-require-upper-bound-deps_success.xml, f:\jenkins\jenkins-slave\workspace\aven-enforcer_MENFORCER-294-IBUS6H5LUW3LLGQ77JNQBEL74UE2BN3AO433QECSA2A76NFISVIQ\m\maven-enforcer-plugin\target\invoker-reports\BUILD-resolve_collect_dependencies.xml]
[windows-jdk9] Found logs:[f:\jenkins\jenkins-slave\workspace\aven-enforcer_MENFORCER-294-IBUS6H5LUW3LLGQ77JNQBEL74UE2BN3AO433QECSA2A76NFISVIQ\m\maven-enforcer-plugin\target\it\always-fail-warn\build.log, f:\jenkins\jenkins-slave\workspace\aven-enforcer_MENFORCER-294-IBUS6H5LUW3LLGQ77JNQBEL74UE2BN3AO433QECSA2A76NFISVIQ\m\maven-enforcer-plugin\target\it\always-fail\build.log, f:\jenkins\jenkins-slave\workspace\aven-enforcer_MENFORCER-294-IBUS6H5LUW3LLGQ77JNQBEL74UE2BN3AO433QECSA2A76NFISVIQ\m\maven-enforcer-plugin\target\it\always-pass\build.log, f:\jenkins\jenkins-slave\workspace\aven-enforcer_MENFORCER-294-IBUS6H5LUW3LLGQ77JNQBEL74UE2BN3AO433QECSA2A76NFISVIQ\m\maven-enforcer-plugin\target\it\ban-distribution-management-multi-module-build\build.log, f:\jenkins\jenkins-slave\workspace\aven-enforcer_MENFORCER-294-IBUS6H5LUW3LLGQ77JNQBEL74UE2BN3AO433QECSA2A76NFISVIQ\m\maven-enforcer-plugin\target\it\ban-distribution-management-multi-module-except-site\build.log, f:\jenkins\jenkins-slave\workspace\aven-enforcer_MENFORCER-294-IBUS6H5LUW3LLGQ77JNQBEL74UE2BN3AO433QECSA2A76NFISVIQ\m\maven-enforcer-plugin\target\it\ban-distribution-management\build.log, f:\jenkins\jenkins-slave\workspace\aven-enforcer_MENFORCER-294-IBUS6H5LUW3LLGQ77JNQBEL74UE2BN3AO433QECSA2A76NFISVIQ\m\maven-enforcer-plugin\target\it\ban-pom-dependency-version\build.log, f:\jenkins\jenkins-slave\workspace\aven-enforcer_MENFORCER-294-IBUS6H5LUW3LLGQ77JNQBEL74UE2BN3AO433QECSA2A76NFISVIQ\m\maven-enforcer-plugin\target\it\ban-transitive-dependencies-fail\build.log, f:\jenkins\jenkins-slave\workspace\aven-enforcer_MENFORCER-294-IBUS6H5LUW3LLGQ77JNQBEL74UE2BN3AO433QECSA2A76NFISVIQ\m\maven-enforcer-plugin\target\it\ban-transitive-dependencies\build.log, f:\jenkins\jenkins-slave\workspace\aven-enforcer_MENFORCER-294-IBUS6H5LUW3LLGQ77JNQBEL74UE2BN3AO433QECSA2A76NFISVIQ\m\maven-enforcer-plugin\target\it\banned-dependencies-versionrange-fail\build.log, f:\jenkins\jenkins-slave\workspace\aven-enforcer_MENFORCER-294-IBUS6H5LUW3LLGQ77JNQBEL74UE2BN3AO433QECSA2A76NFISVIQ\m\maven-enforcer-plugin\target\it\banned-dependencies-versionrange\build.log, f:\jenkins\jenkins-slave\workspace\aven-enforcer_MENFORCER-294-IBUS6H5LUW3LLGQ77JNQBEL74UE2BN3AO433QECSA2A76NFISVIQ\m\maven-enforcer-plugin\target\it\banned-dependencies-wildcards\build.log, f:\jenkins\jenkins-slave\workspace\aven-enforcer_MENFORCER-294-IBUS6H5LUW3LLGQ77JNQBEL74UE2BN3AO433QECSA2A76NFISVIQ\m\maven-enforcer-plugin\target\it\banned-dependencies\build.log, f:\jenkins\jenkins-slave\workspace\aven-enforcer_MENFORCER-294-IBUS6H5LUW3LLGQ77JNQBEL74UE2BN3AO433QECSA2A76NFISVIQ\m\maven-enforcer-plugin\target\it\banned-plugins\build.log, f:\jenkins\jenkins-slave\workspace\aven-enforcer_MENFORCER-294-IBUS6H5LUW3LLGQ77JNQBEL74UE2BN3AO433QECSA2A76NFISVIQ\m\maven-enforcer-plugin\target\it\builds_a_pom_noop\build.log, f:\jenkins\jenkins-slave\workspace\aven-enforcer_MENFORCER-294-IBUS6H5LUW3LLGQ77JNQBEL74UE2BN3AO433QECSA2A76NFISVIQ\m\maven-enforcer-plugin\target\it\cli-always-fail\build.log, f:\jenkins\jenkins-slave\workspace\aven-enforcer_MENFORCER-294-IBUS6H5LUW3LLGQ77JNQBEL74UE2BN3AO433QECSA2A76NFISVIQ\m\maven-enforcer-plugin\target\it\cli-always-pass\build.log, f:\jenkins\jenkins-slave\workspace\aven-enforcer_MENFORCER-294-IBUS6H5LUW3LLGQ77JNQBEL74UE2BN3AO433QECSA2A76NFISVIQ\m\maven-enforcer-plugin\target\it\dependencies_converge\build.log, f:\jenkins\jenkins-slave\workspace\aven-enforcer_MENFORCER-294-IBUS6H5LUW3LLGQ77JNQBEL74UE2BN3AO433QECSA2A76NFISVIQ\m\maven-enforcer-plugin\target\it\dependencies_not_converging\build.log, f:\jenkins\jenkins-slave\workspace\aven-enforcer_MENFORCER-294-IBUS6H5LUW3LLGQ77JNQBEL74UE2BN3AO433QECSA2A76NFISVIQ\m\maven-enforcer-plugin\target\it\dependencies_not_converging_test_scope\build.log, f:\jenkins\jenkins-slave\workspace\aven-enforcer_MENFORCER-294-IBUS6H5LUW3LLGQ77JNQBEL74UE2BN3AO433QECSA2A76NFISVIQ\m\maven-enforcer-plugin\target\it\display-info\build.log, f:\jenkins\jenkins-slave\workspace\aven-enforcer_MENFORCER-294-IBUS6H5LUW3LLGQ77JNQBEL74UE2BN3AO433QECSA2A76NFISVIQ\m\maven-enforcer-plugin\target\it\evaluate-beanshell\build.log, f:\jenkins\jenkins-slave\workspace\aven-enforcer_MENFORCER-294-IBUS6H5LUW3LLGQ77JNQBEL74UE2BN3AO433QECSA2A76NFISVIQ\m\maven-enforcer-plugin\target\it\multimodule\build.log, f:\jenkins\jenkins-slave\workspace\aven-enforcer_MENFORCER-294-IBUS6H5LUW3LLGQ77JNQBEL74UE2BN3AO433QECSA2A76NFISVIQ\m\maven-enforcer-plugin\target\it\require-active-profile-all\build.log, f:\jenkins\jenkins-slave\workspace\aven-enforcer_MENFORCER-294-IBUS6H5LUW3LLGQ77JNQBEL74UE2BN3AO433QECSA2A76NFISVIQ\m\maven-enforcer-plugin\target\it\require-active-profile-from-settings\build.log, f:\jenkins\jenkins-slave\workspace\aven-enforcer_MENFORCER-294-IBUS6H5LUW3LLGQ77JNQBEL74UE2BN3AO433QECSA2A76NFISVIQ\m\maven-enforcer-plugin\target\it\require-active-profile\build.log, f:\jenkins\jenkins-slave\workspace\aven-enforcer_MENFORCER-294-IBUS6H5LUW3LLGQ77JNQBEL74UE2BN3AO433QECSA2A76NFISVIQ\m\maven-enforcer-plugin\target\it\require-file-checksum\build.log, f:\jenkins\jenkins-slave\workspace\aven-enforcer_MENFORCER-294-IBUS6H5LUW3LLGQ77JNQBEL74UE2BN3AO433QECSA2A76NFISVIQ\m\maven-enforcer-plugin\target\it\require-files-dont-exist\build.log, f:\jenkins\jenkins-slave\workspace\aven-enforcer_MENFORCER-294-IBUS6H5LUW3LLGQ77JNQBEL74UE2BN3AO433QECSA2A76NFISVIQ\m\maven-enforcer-plugin\target\it\require-files-exist\build.log, f:\jenkins\jenkins-slave\workspace\aven-enforcer_MENFORCER-294-IBUS6H5LUW3LLGQ77JNQBEL74UE2BN3AO433QECSA2A76NFISVIQ\m\maven-enforcer-plugin\target\it\require-files-size\build.log, f:\jenkins\jenkins-slave\workspace\aven-enforcer_MENFORCER-294-IBUS6H5LUW3LLGQ77JNQBEL74UE2BN3AO433QECSA2A76NFISVIQ\m\maven-enforcer-plugin\target\it\require-java-version\build.log, f:\jenkins\jenkins-slave\workspace\aven-enforcer_MENFORCER-294-IBUS6H5LUW3LLGQ77JNQBEL74UE2BN3AO433QECSA2A76NFISVIQ\m\maven-enforcer-plugin\target\it\require-maven-version\build.log, f:\jenkins\jenkins-slave\workspace\aven-enforcer_MENFORCER-294-IBUS6H5LUW3LLGQ77JNQBEL74UE2BN3AO433QECSA2A76NFISVIQ\m\maven-enforcer-plugin\target\it\require-no-repositories-allow-plugin-repo\build.log, f:\jenkins\jenkins-slave\workspace\aven-enforcer_MENFORCER-294-IBUS6H5LUW3LLGQ77JNQBEL74UE2BN3AO433QECSA2A76NFISVIQ\m\maven-enforcer-plugin\target\it\require-no-repositories-allow-repo\build.log, f:\jenkins\jenkins-slave\workspace\aven-enforcer_MENFORCER-294-IBUS6H5LUW3LLGQ77JNQBEL74UE2BN3AO433QECSA2A76NFISVIQ\m\maven-enforcer-plugin\target\it\require-no-repositories\build.log, f:\jenkins\jenkins-slave\workspace\aven-enforcer_MENFORCER-294-IBUS6H5LUW3LLGQ77JNQBEL74UE2BN3AO433QECSA2A76NFISVIQ\m\maven-enforcer-plugin\target\it\require-no-repositories_failure\build.log, f:\jenkins\jenkins-slave\workspace\aven-enforcer_MENFORCER-294-IBUS6H5LUW3LLGQ77JNQBEL74UE2BN3AO433QECSA2A76NFISVIQ\m\maven-enforcer-plugin\target\it\require-no-repositories_failure_allowed-plugin-repo\build.log, f:\jenkins\jenkins-slave\workspace\aven-enforcer_MENFORCER-294-IBUS6H5LUW3LLGQ77JNQBEL74UE2BN3AO433QECSA2A76NFISVIQ\m\maven-enforcer-plugin\target\it\require-no-repositories_failure_plugin-repositories\build.log, f:\jenkins\jenkins-slave\workspace\aven-enforcer_MENFORCER-294-IBUS6H5LUW3LLGQ77JNQBEL74UE2BN3AO433QECSA2A76NFISVIQ\m\maven-enforcer-plugin\target\it\require-no-repositories_failure_repositories\build.log, f:\jenkins\jenkins-slave\workspace\aven-enforcer_MENFORCER-294-IBUS6H5LUW3LLGQ77JNQBEL74UE2BN3AO433QECSA2A76NFISVIQ\m\maven-enforcer-plugin\target\it\require-no-repositories_mm\build.log, f:\jenkins\jenkins-slave\workspace\aven-enforcer_MENFORCER-294-IBUS6H5LUW3LLGQ77JNQBEL74UE2BN3AO433QECSA2A76NFISVIQ\m\maven-enforcer-plugin\target\it\require-no-repositories_mm_ci\build.log, f:\jenkins\jenkins-slave\workspace\aven-enforcer_MENFORCER-294-IBUS6H5LUW3LLGQ77JNQBEL74UE2BN3AO433QECSA2A76NFISVIQ\m\maven-enforcer-plugin\target\it\require-plugin-versions-ci\build.log, f:\jenkins\jenkins-slave\workspace\aven-enforcer_MENFORCER-294-IBUS6H5LUW3LLGQ77JNQBEL74UE2BN3AO433QECSA2A76NFISVIQ\m\maven-enforcer-plugin\target\it\require-plugin-versions-custom-packaging\build.log, f:\jenkins\jenkins-slave\workspace\aven-enforcer_MENFORCER-294-IBUS6H5LUW3LLGQ77JNQBEL74UE2BN3AO433QECSA2A76NFISVIQ\m\maven-enforcer-plugin\target\it\require-plugin-versions-expressions\build.log, f:\jenkins\jenkins-slave\workspace\aven-enforcer_MENFORCER-294-IBUS6H5LUW3LLGQ77JNQBEL74UE2BN3AO433QECSA2A76NFISVIQ\m\maven-enforcer-plugin\target\it\require-plugin-versions-mm-ci-friendly\build.log, f:\jenkins\jenkins-slave\workspace\aven-enforcer_MENFORCER-294-IBUS6H5LUW3LLGQ77JNQBEL74UE2BN3AO433QECSA2A76NFISVIQ\m\maven-enforcer-plugin\target\it\require-plugin-versions-plugin-with-extensions\build.log, f:\jenkins\jenkins-slave\workspace\aven-enforcer_MENFORCER-294-IBUS6H5LUW3LLGQ77JNQBEL74UE2BN3AO433QECSA2A76NFISVIQ\m\maven-enforcer-plugin\target\it\require-plugin-versions-plugin-with-integration-test-lifecycle\build.log, f:\jenkins\jenkins-slave\workspace\aven-enforcer_MENFORCER-294-IBUS6H5LUW3LLGQ77JNQBEL74UE2BN3AO433QECSA2A76NFISVIQ\m\maven-enforcer-plugin\target\it\require-plugin-versions-projectGAVexpressions\build.log, f:\jenkins\jenkins-slave\workspace\aven-enforcer_MENFORCER-294-IBUS6H5LUW3LLGQ77JNQBEL74UE2BN3AO433QECSA2A76NFISVIQ\m\maven-enforcer-plugin\target\it\require-plugin-versions\build.log, f:\jenkins\jenkins-slave\workspace\aven-enforcer_MENFORCER-294-IBUS6H5LUW3LLGQ77JNQBEL74UE2BN3AO433QECSA2A76NFISVIQ\m\maven-enforcer-plugin\target\it\require-profile-ids-exist_failure\build.log, f:\jenkins\jenkins-slave\workspace\aven-enforcer_MENFORCER-294-IBUS6H5LUW3LLGQ77JNQBEL74UE2BN3AO433QECSA2A76NFISVIQ\m\maven-enforcer-plugin\target\it\require-profile-ids-exist_success\build.log, f:\jenkins\jenkins-slave\workspace\aven-enforcer_MENFORCER-294-IBUS6H5LUW3LLGQ77JNQBEL74UE2BN3AO433QECSA2A76NFISVIQ\m\maven-enforcer-plugin\target\it\require-property\build.log, f:\jenkins\jenkins-slave\workspace\aven-enforcer_MENFORCER-294-IBUS6H5LUW3LLGQ77JNQBEL74UE2BN3AO433QECSA2A76NFISVIQ\m\maven-enforcer-plugin\target\it\require-release-dependencies-excludes\build.log, f:\jenkins\jenkins-slave\workspace\aven-enforcer_MENFORCER-294-IBUS6H5LUW3LLGQ77JNQBEL74UE2BN3AO433QECSA2A76NFISVIQ\m\maven-enforcer-plugin\target\it\require-release-dependencies-excludes_failure\build.log, f:\jenkins\jenkins-slave\workspace\aven-enforcer_MENFORCER-294-IBUS6H5LUW3LLGQ77JNQBEL74UE2BN3AO433QECSA2A76NFISVIQ\m\maven-enforcer-plugin\target\it\require-release-dependencies\build.log, f:\jenkins\jenkins-slave\workspace\aven-enforcer_MENFORCER-294-IBUS6H5LUW3LLGQ77JNQBEL74UE2BN3AO433QECSA2A76NFISVIQ\m\maven-enforcer-plugin\target\it\require-release-version\build.log, f:\jenkins\jenkins-slave\workspace\aven-enforcer_MENFORCER-294-IBUS6H5LUW3LLGQ77JNQBEL74UE2BN3AO433QECSA2A76NFISVIQ\m\maven-enforcer-plugin\target\it\require-same-versions_failure\build.log, f:\jenkins\jenkins-slave\workspace\aven-enforcer_MENFORCER-294-IBUS6H5LUW3LLGQ77JNQBEL74UE2BN3AO433QECSA2A76NFISVIQ\m\maven-enforcer-plugin\target\it\require-same-versions_success\build.log, f:\jenkins\jenkins-slave\workspace\aven-enforcer_MENFORCER-294-IBUS6H5LUW3LLGQ77JNQBEL74UE2BN3AO433QECSA2A76NFISVIQ\m\maven-enforcer-plugin\target\it\require-snapshot-version_failure\build.log, f:\jenkins\jenkins-slave\workspace\aven-enforcer_MENFORCER-294-IBUS6H5LUW3LLGQ77JNQBEL74UE2BN3AO433QECSA2A76NFISVIQ\m\maven-enforcer-plugin\target\it\require-snapshot-version_success\build.log, f:\jenkins\jenkins-slave\workspace\aven-enforcer_MENFORCER-294-IBUS6H5LUW3LLGQ77JNQBEL74UE2BN3AO433QECSA2A76NFISVIQ\m\maven-enforcer-plugin\target\it\require-upper-bound-dependencies-managed_failure\build.log, f:\jenkins\jenkins-slave\workspace\aven-enforcer_MENFORCER-294-IBUS6H5LUW3LLGQ77JNQBEL74UE2BN3AO433QECSA2A76NFISVIQ\m\maven-enforcer-plugin\target\it\require-upper-bound-dependencies-managed_success\build.log, f:\jenkins\jenkins-slave\workspace\aven-enforcer_MENFORCER-294-IBUS6H5LUW3LLGQ77JNQBEL74UE2BN3AO433QECSA2A76NFISVIQ\m\maven-enforcer-plugin\target\it\require-upper-bound-dependencies-unique_failure\build.log, f:\jenkins\jenkins-slave\workspace\aven-enforcer_MENFORCER-294-IBUS6H5LUW3LLGQ77JNQBEL74UE2BN3AO433QECSA2A76NFISVIQ\m\maven-enforcer-plugin\target\it\require-upper-bound-dependencies-unique_success\build.log, f:\jenkins\jenkins-slave\workspace\aven-enforcer_MENFORCER-294-IBUS6H5LUW3LLGQ77JNQBEL74UE2BN3AO433QECSA2A76NFISVIQ\m\maven-enforcer-plugin\target\it\require-upper-bound-deps_failure\build.log, f:\jenkins\jenkins-slave\workspace\aven-enforcer_MENFORCER-294-IBUS6H5LUW3LLGQ77JNQBEL74UE2BN3AO433QECSA2A76NFISVIQ\m\maven-enforcer-plugin\target\it\require-upper-bound-deps_ignored\build.log, f:\jenkins\jenkins-slave\workspace\aven-enforcer_MENFORCER-294-IBUS6H5LUW3LLGQ77JNQBEL74UE2BN3AO433QECSA2A76NFISVIQ\m\maven-enforcer-plugin\target\it\require-upper-bound-deps_success\build.log, f:\jenkins\jenkins-slave\workspace\aven-enforcer_MENFORCER-294-IBUS6H5LUW3LLGQ77JNQBEL74UE2BN3AO433QECSA2A76NFISVIQ\m\maven-enforcer-plugin\target\it\resolve_collect_dependencies\build.log]
[windows-jdk9] Finished parsing Maven Invoker results (found 68)
[windows-jdk9] [withMaven] junitPublisher - Archive test results for Maven artifact org.apache.maven.enforcer:enforcer-api:3.0.0-SNAPSHOT generated by maven-surefire-plugin:test (default-test): m\enforcer-api\target\surefire-reports\*.xml
[windows-jdk9] Recording test results
[windows-jdk9] None of the test reports contained any result
[windows-jdk9] [withMaven] junitPublisher - Archive test results for Maven artifact org.apache.maven.enforcer:enforcer-rules:3.0.0-SNAPSHOT generated by maven-surefire-plugin:test (default-test): m\enforcer-rules\target\surefire-reports\*.xml
[windows-jdk9] Recording test results
[windows-jdk9] [withMaven] junitPublisher - Archive test results for Maven artifact org.apache.maven.plugins:maven-enforcer-plugin:3.0.0-SNAPSHOT generated by maven-surefire-plugin:test (default-test): m\maven-enforcer-plugin\target\surefire-reports\*.xml
[windows-jdk9] Recording test results
[Pipeline] [windows-jdk9] // withMaven
[Pipeline] [windows-jdk9] cleanWs
[windows-jdk9] [WS-CLEANUP] Deleting project workspace...[WS-CLEANUP] done
[Pipeline] [windows-jdk9] }
[Pipeline] [windows-jdk9] // stage
[Pipeline] [windows-jdk9] }
[Pipeline] [windows-jdk9] // node
[Pipeline] [windows-jdk9] }
[windows-jdk10] [INFO]           require-plugin-versions-mm-ci-friendly\pom.xml ... SUCCESS (7.9 s)
[windows-jdk10] [INFO] Building: require-plugin-versions-plugin-with-extensions\pom.xml
[windows-jdk10] [INFO]           require-plugin-versions-plugin-with-extensions\pom.xml SUCCESS (9.5 s)
[windows-jdk10] [INFO] Building: require-plugin-versions-plugin-with-integration-test-lifecycle\pom.xml
[windows-jdk10] [INFO]           require-plugin-versions-plugin-with-integration-test-lifecycle\pom.xml SUCCESS (21.7 s)
[windows-jdk10] [INFO] Building: require-plugin-versions-projectGAVexpressions\pom.xml
[windows-jdk10] [INFO]           require-plugin-versions-projectGAVexpressions\pom.xml SUCCESS (6.6 s)
[windows-jdk10] [INFO] Building: require-profile-ids-exist_failure\pom.xml
[windows-jdk10] [INFO] run post-build script verify.groovy
[windows-jdk10] [INFO]           require-profile-ids-exist_failure\pom.xml ........ SUCCESS (5.9 s)
[windows-jdk10] [INFO] Building: require-profile-ids-exist_success\pom.xml
[windows-jdk10] [INFO]           require-profile-ids-exist_success\pom.xml ........ SUCCESS (5.9 s)
[windows-jdk10] [INFO] Building: require-property\pom.xml
[windows-jdk10] [INFO]           require-property\pom.xml ......................... SUCCESS (5.4 s)
[windows-jdk10] [INFO] Building: require-release-dependencies\pom.xml
[windows-jdk10] [INFO]           require-release-dependencies\pom.xml ............. SUCCESS (5.5 s)
[windows-jdk10] [INFO] Building: require-release-dependencies-excludes\pom.xml
[windows-jdk10] [INFO] snapshot org.apache.maven.plugins.enforcer.its:menforcer85_api:1.0-SNAPSHOT: checking for updates from apache-snapshots
[windows-jdk10] [INFO] snapshot org.apache.maven.plugins.enforcer.its:menforcer85_api:1.0-SNAPSHOT: checking for updates from Nexus
[windows-jdk10] [INFO] artifact org.apache.maven.plugins.enforcer.its.menforcer85_api:1.0-SNAPSHOT: checking for updates from central
[windows-jdk10] [INFO] org.apache.maven.plugins.enforcer.its.menforcer85_api.1.0-SNAPSHOT: checking for updates from central
[windows-jdk10] [INFO]           require-release-dependencies-excludes\pom.xml .... SUCCESS (5.8 s)
[windows-jdk10] [INFO] Building: require-release-dependencies-excludes_failure\pom.xml
[windows-jdk10] [INFO]           require-release-dependencies-excludes_failure\pom.xml SUCCESS (5.7 s)
[windows-jdk10] [INFO] Building: require-release-version\pom.xml
[windows-jdk10] [INFO]           require-release-version\pom.xml .................. SUCCESS (5.0 s)
[windows-jdk10] [INFO] Building: require-same-versions_failure\pom.xml
[windows-jdk10] [INFO]           require-same-versions_failure\pom.xml ............ SUCCESS (5.5 s)
[windows-jdk10] [INFO] Building: require-same-versions_success\pom.xml
[windows-jdk10] [INFO]           require-same-versions_success\pom.xml ............ SUCCESS (5.5 s)
[windows-jdk10] [INFO] Building: require-snapshot-version_failure\pom.xml
[windows-jdk10] [INFO]           require-snapshot-version_failure\pom.xml ......... SUCCESS (5.7 s)
[windows-jdk10] [INFO] Building: require-snapshot-version_success\pom.xml
[windows-jdk10] [INFO]           require-snapshot-version_success\pom.xml ......... SUCCESS (5.4 s)
[windows-jdk10] [INFO] Building: require-upper-bound-dependencies-managed_failure\pom.xml
[windows-jdk10] [INFO] run post-build script verify.groovy
[windows-jdk10] [INFO]           require-upper-bound-dependencies-managed_failure\pom.xml SUCCESS (5.5 s)
[windows-jdk10] [INFO] Building: require-upper-bound-dependencies-managed_success\pom.xml
[windows-jdk10] [INFO]           require-upper-bound-dependencies-managed_success\pom.xml SUCCESS (5.4 s)
[windows-jdk10] [INFO] Building: require-upper-bound-dependencies-unique_failure\pom.xml
[windows-jdk10] [INFO] snapshot org.apache.maven.plugins.enforcer.its:menforcer134_project:1.0-SNAPSHOT: checking for updates from apache-snapshots
[windows-jdk10] [INFO] snapshot org.apache.maven.plugins.enforcer.its:menforcer134_project:1.0-SNAPSHOT: checking for updates from Nexus
[windows-jdk10] [INFO] artifact org.apache.maven.plugins.enforcer.its.menforcer134_project:1.0-SNAPSHOT: checking for updates from central
[windows-jdk10] [INFO] org.apache.maven.plugins.enforcer.its.menforcer134_project.1.0-SNAPSHOT: checking for updates from central
[windows-jdk10] [INFO] snapshot org.apache.maven.plugins.enforcer.its:menforcer134_modelbuilder:1.0-SNAPSHOT: checking for updates from apache-snapshots
[windows-jdk10] [INFO] snapshot org.apache.maven.plugins.enforcer.its:menforcer134_modelbuilder:1.0-SNAPSHOT: checking for updates from Nexus
[windows-jdk10] [INFO] artifact org.apache.maven.plugins.enforcer.its.menforcer134_modelbuilder:1.0-SNAPSHOT: checking for updates from central
[windows-jdk10] [INFO] org.apache.maven.plugins.enforcer.its.menforcer134_modelbuilder.1.0-SNAPSHOT: checking for updates from central
[windows-jdk10] [INFO] snapshot org.apache.maven.plugins.enforcer.its:menforcer134_model:1.0-SNAPSHOT: checking for updates from apache-snapshots
[windows-jdk10] [INFO] snapshot org.apache.maven.plugins.enforcer.its:menforcer134_model:1.0-SNAPSHOT: checking for updates from Nexus
[windows-jdk10] [INFO] artifact org.apache.maven.plugins.enforcer.its.menforcer134_model:1.0-SNAPSHOT: checking for updates from central
[windows-jdk10] [INFO] org.apache.maven.plugins.enforcer.its.menforcer134_model.1.0-SNAPSHOT: checking for updates from central
[windows-jdk10] [INFO] run post-build script verify.groovy
[windows-jdk10] [INFO]           require-upper-bound-dependencies-unique_failure\pom.xml SUCCESS (6.8 s)
[windows-jdk10] [INFO] Building: require-upper-bound-dependencies-unique_success\pom.xml
[windows-jdk10] [INFO]           require-upper-bound-dependencies-unique_success\pom.xml SUCCESS (5.6 s)
[windows-jdk10] [INFO] Building: require-upper-bound-deps_failure\pom.xml
[windows-jdk10] [INFO] run post-build script verify.groovy
[windows-jdk10] [INFO]           require-upper-bound-deps_failure\pom.xml ......... SUCCESS (5.7 s)
[windows-jdk10] [INFO] Building: require-upper-bound-deps_ignored\pom.xml
[windows-jdk10] [INFO] run post-build script verify.groovy
[windows-jdk10] [INFO]           require-upper-bound-deps_ignored\pom.xml ......... SUCCESS (5.3 s)
[windows-jdk10] [INFO] Building: require-upper-bound-deps_success\pom.xml
[windows-jdk10] [INFO]           require-upper-bound-deps_success\pom.xml ......... SUCCESS (5.4 s)
[windows-jdk10] [INFO] Building: resolve_collect_dependencies\pom.xml
[windows-jdk10] [INFO] run post-build script verify.groovy
[windows-jdk10] [INFO]           resolve_collect_dependencies\pom.xml ............. SUCCESS (10.0 s)
[windows-jdk10] [INFO] -------------------------------------------------
[windows-jdk10] [INFO] Build Summary:
[windows-jdk10] [INFO]   Passed: 68, Failed: 0, Errors: 0, Skipped: 0
[windows-jdk10] [INFO] -------------------------------------------------
[windows-jdk10] [INFO] 
[windows-jdk10] [INFO] --- mrm-maven-plugin:1.0.0:stop (default) @ maven-enforcer-plugin ---
[windows-jdk10] [INFO] Stopping Mock Repository Manager on http://localhost:50550
[windows-jdk10] [INFO] Mock Repository Manager http://localhost:50550 is stopped.
[windows-jdk10] [INFO] 
[windows-jdk10] [INFO] --- maven-checkstyle-plugin:3.0.0:check (checkstyle-check) @ maven-enforcer-plugin ---
[windows-jdk10] [INFO] ------------------------------------------------------------------------
[windows-jdk10] [INFO] Reactor Summary:
[windows-jdk10] [INFO] 
[windows-jdk10] [INFO] Apache Maven Enforcer .............................. SUCCESS [ 37.244 s]
[windows-jdk10] [INFO] Apache Maven Enforcer API .......................... SUCCESS [  9.550 s]
[windows-jdk10] [INFO] Apache Maven Enforcer Built-In Rules ............... SUCCESS [ 21.822 s]
[windows-jdk10] [INFO] Apache Maven Enforcer Plugin ....................... SUCCESS [07:38 min]
[windows-jdk10] [INFO] ------------------------------------------------------------------------
[windows-jdk10] [INFO] BUILD SUCCESS
[windows-jdk10] [INFO] ------------------------------------------------------------------------
[windows-jdk10] [INFO] Total time: 08:48 min
[windows-jdk10] [INFO] Finished at: 2018-08-16T22:29:58-07:00
[windows-jdk10] [INFO] Final Memory: 51M/177M
[windows-jdk10] [INFO] ------------------------------------------------------------------------
[windows-jdk10] [INFO] [jenkins-event-spy] Generated F:\jenkins\jenkins-slave\workspace\aven-enforcer_MENFORCER-294-IBUS6H5LUW3LLGQ77JNQBEL74UE2BN3AO433QECSA2A76NFISVIQ@tmp\withMaven28c0e6d6\maven-spy-20180816-222109-32710165901643769453702.log
[Pipeline] [windows-jdk10] }
[Pipeline] [windows-jdk10] // dir
[Pipeline] [windows-jdk10] }
[windows-jdk10] [withMaven] invokerPublisher - Archive invoker results for Maven artifact MavenArtifact{org.apache.maven.plugins:maven-enforcer-plugin::3.0.0-SNAPSHOT(version: 3.0.0-SNAPSHOT, snapshot:false) } generated by PluginInvocation{org.apache.maven.plugins:maven-invoker-plugin:3.0.1@run  integration-test}: m\maven-enforcer-plugin\target\invoker-reports\*.xml
[windows-jdk10] performing MavenInvokerRecorder, reportsFilenamePattern:'**/m\maven-enforcer-plugin\target\invoker-reports/BUILD*.xml', invokerBuildDir:'**/m\maven-enforcer-plugin\target\it'
[windows-jdk10] Found reports:[f:\jenkins\jenkins-slave\workspace\aven-enforcer_MENFORCER-294-IBUS6H5LUW3LLGQ77JNQBEL74UE2BN3AO433QECSA2A76NFISVIQ\m\maven-enforcer-plugin\target\invoker-reports\BUILD-always-fail-warn.xml, f:\jenkins\jenkins-slave\workspace\aven-enforcer_MENFORCER-294-IBUS6H5LUW3LLGQ77JNQBEL74UE2BN3AO433QECSA2A76NFISVIQ\m\maven-enforcer-plugin\target\invoker-reports\BUILD-always-fail.xml, f:\jenkins\jenkins-slave\workspace\aven-enforcer_MENFORCER-294-IBUS6H5LUW3LLGQ77JNQBEL74UE2BN3AO433QECSA2A76NFISVIQ\m\maven-enforcer-plugin\target\invoker-reports\BUILD-always-pass.xml, f:\jenkins\jenkins-slave\workspace\aven-enforcer_MENFORCER-294-IBUS6H5LUW3LLGQ77JNQBEL74UE2BN3AO433QECSA2A76NFISVIQ\m\maven-enforcer-plugin\target\invoker-reports\BUILD-ban-distribution-management-multi-module-build.xml, f:\jenkins\jenkins-slave\workspace\aven-enforcer_MENFORCER-294-IBUS6H5LUW3LLGQ77JNQBEL74UE2BN3AO433QECSA2A76NFISVIQ\m\maven-enforcer-plugin\target\invoker-reports\BUILD-ban-distribution-management-multi-module-except-site.xml, f:\jenkins\jenkins-slave\workspace\aven-enforcer_MENFORCER-294-IBUS6H5LUW3LLGQ77JNQBEL74UE2BN3AO433QECSA2A76NFISVIQ\m\maven-enforcer-plugin\target\invoker-reports\BUILD-ban-distribution-management.xml, f:\jenkins\jenkins-slave\workspace\aven-enforcer_MENFORCER-294-IBUS6H5LUW3LLGQ77JNQBEL74UE2BN3AO433QECSA2A76NFISVIQ\m\maven-enforcer-plugin\target\invoker-reports\BUILD-ban-pom-dependency-version.xml, f:\jenkins\jenkins-slave\workspace\aven-enforcer_MENFORCER-294-IBUS6H5LUW3LLGQ77JNQBEL74UE2BN3AO433QECSA2A76NFISVIQ\m\maven-enforcer-plugin\target\invoker-reports\BUILD-ban-transitive-dependencies-fail.xml, f:\jenkins\jenkins-slave\workspace\aven-enforcer_MENFORCER-294-IBUS6H5LUW3LLGQ77JNQBEL74UE2BN3AO433QECSA2A76NFISVIQ\m\maven-enforcer-plugin\target\invoker-reports\BUILD-ban-transitive-dependencies.xml, f:\jenkins\jenkins-slave\workspace\aven-enforcer_MENFORCER-294-IBUS6H5LUW3LLGQ77JNQBEL74UE2BN3AO433QECSA2A76NFISVIQ\m\maven-enforcer-plugin\target\invoker-reports\BUILD-banned-dependencies-versionrange-fail.xml, f:\jenkins\jenkins-slave\workspace\aven-enforcer_MENFORCER-294-IBUS6H5LUW3LLGQ77JNQBEL74UE2BN3AO433QECSA2A76NFISVIQ\m\maven-enforcer-plugin\target\invoker-reports\BUILD-banned-dependencies-versionrange.xml, f:\jenkins\jenkins-slave\workspace\aven-enforcer_MENFORCER-294-IBUS6H5LUW3LLGQ77JNQBEL74UE2BN3AO433QECSA2A76NFISVIQ\m\maven-enforcer-plugin\target\invoker-reports\BUILD-banned-dependencies-wildcards.xml, f:\jenkins\jenkins-slave\workspace\aven-enforcer_MENFORCER-294-IBUS6H5LUW3LLGQ77JNQBEL74UE2BN3AO433QECSA2A76NFISVIQ\m\maven-enforcer-plugin\target\invoker-reports\BUILD-banned-dependencies.xml, f:\jenkins\jenkins-slave\workspace\aven-enforcer_MENFORCER-294-IBUS6H5LUW3LLGQ77JNQBEL74UE2BN3AO433QECSA2A76NFISVIQ\m\maven-enforcer-plugin\target\invoker-reports\BUILD-banned-plugins.xml, f:\jenkins\jenkins-slave\workspace\aven-enforcer_MENFORCER-294-IBUS6H5LUW3LLGQ77JNQBEL74UE2BN3AO433QECSA2A76NFISVIQ\m\maven-enforcer-plugin\target\invoker-reports\BUILD-builds_a_pom_noop.xml, f:\jenkins\jenkins-slave\workspace\aven-enforcer_MENFORCER-294-IBUS6H5LUW3LLGQ77JNQBEL74UE2BN3AO433QECSA2A76NFISVIQ\m\maven-enforcer-plugin\target\invoker-reports\BUILD-cli-always-fail.xml, f:\jenkins\jenkins-slave\workspace\aven-enforcer_MENFORCER-294-IBUS6H5LUW3LLGQ77JNQBEL74UE2BN3AO433QECSA2A76NFISVIQ\m\maven-enforcer-plugin\target\invoker-reports\BUILD-cli-always-pass.xml, f:\jenkins\jenkins-slave\workspace\aven-enforcer_MENFORCER-294-IBUS6H5LUW3LLGQ77JNQBEL74UE2BN3AO433QECSA2A76NFISVIQ\m\maven-enforcer-plugin\target\invoker-reports\BUILD-dependencies_converge.xml, f:\jenkins\jenkins-slave\workspace\aven-enforcer_MENFORCER-294-IBUS6H5LUW3LLGQ77JNQBEL74UE2BN3AO433QECSA2A76NFISVIQ\m\maven-enforcer-plugin\target\invoker-reports\BUILD-dependencies_not_converging.xml, f:\jenkins\jenkins-slave\workspace\aven-enforcer_MENFORCER-294-IBUS6H5LUW3LLGQ77JNQBEL74UE2BN3AO433QECSA2A76NFISVIQ\m\maven-enforcer-plugin\target\invoker-reports\BUILD-dependencies_not_converging_test_scope.xml, f:\jenkins\jenkins-slave\workspace\aven-enforcer_MENFORCER-294-IBUS6H5LUW3LLGQ77JNQBEL74UE2BN3AO433QECSA2A76NFISVIQ\m\maven-enforcer-plugin\target\invoker-reports\BUILD-display-info.xml, f:\jenkins\jenkins-slave\workspace\aven-enforcer_MENFORCER-294-IBUS6H5LUW3LLGQ77JNQBEL74UE2BN3AO433QECSA2A76NFISVIQ\m\maven-enforcer-plugin\target\invoker-reports\BUILD-evaluate-beanshell.xml, f:\jenkins\jenkins-slave\workspace\aven-enforcer_MENFORCER-294-IBUS6H5LUW3LLGQ77JNQBEL74UE2BN3AO433QECSA2A76NFISVIQ\m\maven-enforcer-plugin\target\invoker-reports\BUILD-multimodule.xml, f:\jenkins\jenkins-slave\workspace\aven-enforcer_MENFORCER-294-IBUS6H5LUW3LLGQ77JNQBEL74UE2BN3AO433QECSA2A76NFISVIQ\m\maven-enforcer-plugin\target\invoker-reports\BUILD-require-active-profile-all.xml, f:\jenkins\jenkins-slave\workspace\aven-enforcer_MENFORCER-294-IBUS6H5LUW3LLGQ77JNQBEL74UE2BN3AO433QECSA2A76NFISVIQ\m\maven-enforcer-plugin\target\invoker-reports\BUILD-require-active-profile-from-settings.xml, f:\jenkins\jenkins-slave\workspace\aven-enforcer_MENFORCER-294-IBUS6H5LUW3LLGQ77JNQBEL74UE2BN3AO433QECSA2A76NFISVIQ\m\maven-enforcer-plugin\target\invoker-reports\BUILD-require-active-profile.xml, f:\jenkins\jenkins-slave\workspace\aven-enforcer_MENFORCER-294-IBUS6H5LUW3LLGQ77JNQBEL74UE2BN3AO433QECSA2A76NFISVIQ\m\maven-enforcer-plugin\target\invoker-reports\BUILD-require-file-checksum.xml, f:\jenkins\jenkins-slave\workspace\aven-enforcer_MENFORCER-294-IBUS6H5LUW3LLGQ77JNQBEL74UE2BN3AO433QECSA2A76NFISVIQ\m\maven-enforcer-plugin\target\invoker-reports\BUILD-require-files-dont-exist.xml, f:\jenkins\jenkins-slave\workspace\aven-enforcer_MENFORCER-294-IBUS6H5LUW3LLGQ77JNQBEL74UE2BN3AO433QECSA2A76NFISVIQ\m\maven-enforcer-plugin\target\invoker-reports\BUILD-require-files-exist.xml, f:\jenkins\jenkins-slave\workspace\aven-enforcer_MENFORCER-294-IBUS6H5LUW3LLGQ77JNQBEL74UE2BN3AO433QECSA2A76NFISVIQ\m\maven-enforcer-plugin\target\invoker-reports\BUILD-require-files-size.xml, f:\jenkins\jenkins-slave\workspace\aven-enforcer_MENFORCER-294-IBUS6H5LUW3LLGQ77JNQBEL74UE2BN3AO433QECSA2A76NFISVIQ\m\maven-enforcer-plugin\target\invoker-reports\BUILD-require-java-version.xml, f:\jenkins\jenkins-slave\workspace\aven-enforcer_MENFORCER-294-IBUS6H5LUW3LLGQ77JNQBEL74UE2BN3AO433QECSA2A76NFISVIQ\m\maven-enforcer-plugin\target\invoker-reports\BUILD-require-maven-version.xml, f:\jenkins\jenkins-slave\workspace\aven-enforcer_MENFORCER-294-IBUS6H5LUW3LLGQ77JNQBEL74UE2BN3AO433QECSA2A76NFISVIQ\m\maven-enforcer-plugin\target\invoker-reports\BUILD-require-no-repositories-allow-plugin-repo.xml, f:\jenkins\jenkins-slave\workspace\aven-enforcer_MENFORCER-294-IBUS6H5LUW3LLGQ77JNQBEL74UE2BN3AO433QECSA2A76NFISVIQ\m\maven-enforcer-plugin\target\invoker-reports\BUILD-require-no-repositories-allow-repo.xml, f:\jenkins\jenkins-slave\workspace\aven-enforcer_MENFORCER-294-IBUS6H5LUW3LLGQ77JNQBEL74UE2BN3AO433QECSA2A76NFISVIQ\m\maven-enforcer-plugin\target\invoker-reports\BUILD-require-no-repositories.xml, f:\jenkins\jenkins-slave\workspace\aven-enforcer_MENFORCER-294-IBUS6H5LUW3LLGQ77JNQBEL74UE2BN3AO433QECSA2A76NFISVIQ\m\maven-enforcer-plugin\target\invoker-reports\BUILD-require-no-repositories_failure.xml, f:\jenkins\jenkins-slave\workspace\aven-enforcer_MENFORCER-294-IBUS6H5LUW3LLGQ77JNQBEL74UE2BN3AO433QECSA2A76NFISVIQ\m\maven-enforcer-plugin\target\invoker-reports\BUILD-require-no-repositories_failure_allowed-plugin-repo.xml, f:\jenkins\jenkins-slave\workspace\aven-enforcer_MENFORCER-294-IBUS6H5LUW3LLGQ77JNQBEL74UE2BN3AO433QECSA2A76NFISVIQ\m\maven-enforcer-plugin\target\invoker-reports\BUILD-require-no-repositories_failure_plugin-repositories.xml, f:\jenkins\jenkins-slave\workspace\aven-enforcer_MENFORCER-294-IBUS6H5LUW3LLGQ77JNQBEL74UE2BN3AO433QECSA2A76NFISVIQ\m\maven-enforcer-plugin\target\invoker-reports\BUILD-require-no-repositories_failure_repositories.xml, f:\jenkins\jenkins-slave\workspace\aven-enforcer_MENFORCER-294-IBUS6H5LUW3LLGQ77JNQBEL74UE2BN3AO433QECSA2A76NFISVIQ\m\maven-enforcer-plugin\target\invoker-reports\BUILD-require-no-repositories_mm.xml, f:\jenkins\jenkins-slave\workspace\aven-enforcer_MENFORCER-294-IBUS6H5LUW3LLGQ77JNQBEL74UE2BN3AO433QECSA2A76NFISVIQ\m\maven-enforcer-plugin\target\invoker-reports\BUILD-require-no-repositories_mm_ci.xml, f:\jenkins\jenkins-slave\workspace\aven-enforcer_MENFORCER-294-IBUS6H5LUW3LLGQ77JNQBEL74UE2BN3AO433QECSA2A76NFISVIQ\m\maven-enforcer-plugin\target\invoker-reports\BUILD-require-plugin-versions-ci.xml, f:\jenkins\jenkins-slave\workspace\aven-enforcer_MENFORCER-294-IBUS6H5LUW3LLGQ77JNQBEL74UE2BN3AO433QECSA2A76NFISVIQ\m\maven-enforcer-plugin\target\invoker-reports\BUILD-require-plugin-versions-custom-packaging.xml, f:\jenkins\jenkins-slave\workspace\aven-enforcer_MENFORCER-294-IBUS6H5LUW3LLGQ77JNQBEL74UE2BN3AO433QECSA2A76NFISVIQ\m\maven-enforcer-plugin\target\invoker-reports\BUILD-require-plugin-versions-expressions.xml, f:\jenkins\jenkins-slave\workspace\aven-enforcer_MENFORCER-294-IBUS6H5LUW3LLGQ77JNQBEL74UE2BN3AO433QECSA2A76NFISVIQ\m\maven-enforcer-plugin\target\invoker-reports\BUILD-require-plugin-versions-mm-ci-friendly.xml, f:\jenkins\jenkins-slave\workspace\aven-enforcer_MENFORCER-294-IBUS6H5LUW3LLGQ77JNQBEL74UE2BN3AO433QECSA2A76NFISVIQ\m\maven-enforcer-plugin\target\invoker-reports\BUILD-require-plugin-versions-plugin-with-extensions.xml, f:\jenkins\jenkins-slave\workspace\aven-enforcer_MENFORCER-294-IBUS6H5LUW3LLGQ77JNQBEL74UE2BN3AO433QECSA2A76NFISVIQ\m\maven-enforcer-plugin\target\invoker-reports\BUILD-require-plugin-versions-plugin-with-integration-test-lifecycle.xml, f:\jenkins\jenkins-slave\workspace\aven-enforcer_MENFORCER-294-IBUS6H5LUW3LLGQ77JNQBEL74UE2BN3AO433QECSA2A76NFISVIQ\m\maven-enforcer-plugin\target\invoker-reports\BUILD-require-plugin-versions-projectGAVexpressions.xml, f:\jenkins\jenkins-slave\workspace\aven-enforcer_MENFORCER-294-IBUS6H5LUW3LLGQ77JNQBEL74UE2BN3AO433QECSA2A76NFISVIQ\m\maven-enforcer-plugin\target\invoker-reports\BUILD-require-plugin-versions.xml, f:\jenkins\jenkins-slave\workspace\aven-enforcer_MENFORCER-294-IBUS6H5LUW3LLGQ77JNQBEL74UE2BN3AO433QECSA2A76NFISVIQ\m\maven-enforcer-plugin\target\invoker-reports\BUILD-require-profile-ids-exist_failure.xml, f:\jenkins\jenkins-slave\workspace\aven-enforcer_MENFORCER-294-IBUS6H5LUW3LLGQ77JNQBEL74UE2BN3AO433QECSA2A76NFISVIQ\m\maven-enforcer-plugin\target\invoker-reports\BUILD-require-profile-ids-exist_success.xml, f:\jenkins\jenkins-slave\workspace\aven-enforcer_MENFORCER-294-IBUS6H5LUW3LLGQ77JNQBEL74UE2BN3AO433QECSA2A76NFISVIQ\m\maven-enforcer-plugin\target\invoker-reports\BUILD-require-property.xml, f:\jenkins\jenkins-slave\workspace\aven-enforcer_MENFORCER-294-IBUS6H5LUW3LLGQ77JNQBEL74UE2BN3AO433QECSA2A76NFISVIQ\m\maven-enforcer-plugin\target\invoker-reports\BUILD-require-release-dependencies-excludes.xml, f:\jenkins\jenkins-slave\workspace\aven-enforcer_MENFORCER-294-IBUS6H5LUW3LLGQ77JNQBEL74UE2BN3AO433QECSA2A76NFISVIQ\m\maven-enforcer-plugin\target\invoker-reports\BUILD-require-release-dependencies-excludes_failure.xml, f:\jenkins\jenkins-slave\workspace\aven-enforcer_MENFORCER-294-IBUS6H5LUW3LLGQ77JNQBEL74UE2BN3AO433QECSA2A76NFISVIQ\m\maven-enforcer-plugin\target\invoker-reports\BUILD-require-release-dependencies.xml, f:\jenkins\jenkins-slave\workspace\aven-enforcer_MENFORCER-294-IBUS6H5LUW3LLGQ77JNQBEL74UE2BN3AO433QECSA2A76NFISVIQ\m\maven-enforcer-plugin\target\invoker-reports\BUILD-require-release-version.xml, f:\jenkins\jenkins-slave\workspace\aven-enforcer_MENFORCER-294-IBUS6H5LUW3LLGQ77JNQBEL74UE2BN3AO433QECSA2A76NFISVIQ\m\maven-enforcer-plugin\target\invoker-reports\BUILD-require-same-versions_failure.xml, f:\jenkins\jenkins-slave\workspace\aven-enforcer_MENFORCER-294-IBUS6H5LUW3LLGQ77JNQBEL74UE2BN3AO433QECSA2A76NFISVIQ\m\maven-enforcer-plugin\target\invoker-reports\BUILD-require-same-versions_success.xml, f:\jenkins\jenkins-slave\workspace\aven-enforcer_MENFORCER-294-IBUS6H5LUW3LLGQ77JNQBEL74UE2BN3AO433QECSA2A76NFISVIQ\m\maven-enforcer-plugin\target\invoker-reports\BUILD-require-snapshot-version_failure.xml, f:\jenkins\jenkins-slave\workspace\aven-enforcer_MENFORCER-294-IBUS6H5LUW3LLGQ77JNQBEL74UE2BN3AO433QECSA2A76NFISVIQ\m\maven-enforcer-plugin\target\invoker-reports\BUILD-require-snapshot-version_success.xml, f:\jenkins\jenkins-slave\workspace\aven-enforcer_MENFORCER-294-IBUS6H5LUW3LLGQ77JNQBEL74UE2BN3AO433QECSA2A76NFISVIQ\m\maven-enforcer-plugin\target\invoker-reports\BUILD-require-upper-bound-dependencies-managed_failure.xml, f:\jenkins\jenkins-slave\workspace\aven-enforcer_MENFORCER-294-IBUS6H5LUW3LLGQ77JNQBEL74UE2BN3AO433QECSA2A76NFISVIQ\m\maven-enforcer-plugin\target\invoker-reports\BUILD-require-upper-bound-dependencies-managed_success.xml, f:\jenkins\jenkins-slave\workspace\aven-enforcer_MENFORCER-294-IBUS6H5LUW3LLGQ77JNQBEL74UE2BN3AO433QECSA2A76NFISVIQ\m\maven-enforcer-plugin\target\invoker-reports\BUILD-require-upper-bound-dependencies-unique_failure.xml, f:\jenkins\jenkins-slave\workspace\aven-enforcer_MENFORCER-294-IBUS6H5LUW3LLGQ77JNQBEL74UE2BN3AO433QECSA2A76NFISVIQ\m\maven-enforcer-plugin\target\invoker-reports\BUILD-require-upper-bound-dependencies-unique_success.xml, f:\jenkins\jenkins-slave\workspace\aven-enforcer_MENFORCER-294-IBUS6H5LUW3LLGQ77JNQBEL74UE2BN3AO433QECSA2A76NFISVIQ\m\maven-enforcer-plugin\target\invoker-reports\BUILD-require-upper-bound-deps_failure.xml, f:\jenkins\jenkins-slave\workspace\aven-enforcer_MENFORCER-294-IBUS6H5LUW3LLGQ77JNQBEL74UE2BN3AO433QECSA2A76NFISVIQ\m\maven-enforcer-plugin\target\invoker-reports\BUILD-require-upper-bound-deps_ignored.xml, f:\jenkins\jenkins-slave\workspace\aven-enforcer_MENFORCER-294-IBUS6H5LUW3LLGQ77JNQBEL74UE2BN3AO433QECSA2A76NFISVIQ\m\maven-enforcer-plugin\target\invoker-reports\BUILD-require-upper-bound-deps_success.xml, f:\jenkins\jenkins-slave\workspace\aven-enforcer_MENFORCER-294-IBUS6H5LUW3LLGQ77JNQBEL74UE2BN3AO433QECSA2A76NFISVIQ\m\maven-enforcer-plugin\target\invoker-reports\BUILD-resolve_collect_dependencies.xml]
[windows-jdk10] Found logs:[f:\jenkins\jenkins-slave\workspace\aven-enforcer_MENFORCER-294-IBUS6H5LUW3LLGQ77JNQBEL74UE2BN3AO433QECSA2A76NFISVIQ\m\maven-enforcer-plugin\target\it\always-fail-warn\build.log, f:\jenkins\jenkins-slave\workspace\aven-enforcer_MENFORCER-294-IBUS6H5LUW3LLGQ77JNQBEL74UE2BN3AO433QECSA2A76NFISVIQ\m\maven-enforcer-plugin\target\it\always-fail\build.log, f:\jenkins\jenkins-slave\workspace\aven-enforcer_MENFORCER-294-IBUS6H5LUW3LLGQ77JNQBEL74UE2BN3AO433QECSA2A76NFISVIQ\m\maven-enforcer-plugin\target\it\always-pass\build.log, f:\jenkins\jenkins-slave\workspace\aven-enforcer_MENFORCER-294-IBUS6H5LUW3LLGQ77JNQBEL74UE2BN3AO433QECSA2A76NFISVIQ\m\maven-enforcer-plugin\target\it\ban-distribution-management-multi-module-build\build.log, f:\jenkins\jenkins-slave\workspace\aven-enforcer_MENFORCER-294-IBUS6H5LUW3LLGQ77JNQBEL74UE2BN3AO433QECSA2A76NFISVIQ\m\maven-enforcer-plugin\target\it\ban-distribution-management-multi-module-except-site\build.log, f:\jenkins\jenkins-slave\workspace\aven-enforcer_MENFORCER-294-IBUS6H5LUW3LLGQ77JNQBEL74UE2BN3AO433QECSA2A76NFISVIQ\m\maven-enforcer-plugin\target\it\ban-distribution-management\build.log, f:\jenkins\jenkins-slave\workspace\aven-enforcer_MENFORCER-294-IBUS6H5LUW3LLGQ77JNQBEL74UE2BN3AO433QECSA2A76NFISVIQ\m\maven-enforcer-plugin\target\it\ban-pom-dependency-version\build.log, f:\jenkins\jenkins-slave\workspace\aven-enforcer_MENFORCER-294-IBUS6H5LUW3LLGQ77JNQBEL74UE2BN3AO433QECSA2A76NFISVIQ\m\maven-enforcer-plugin\target\it\ban-transitive-dependencies-fail\build.log, f:\jenkins\jenkins-slave\workspace\aven-enforcer_MENFORCER-294-IBUS6H5LUW3LLGQ77JNQBEL74UE2BN3AO433QECSA2A76NFISVIQ\m\maven-enforcer-plugin\target\it\ban-transitive-dependencies\build.log, f:\jenkins\jenkins-slave\workspace\aven-enforcer_MENFORCER-294-IBUS6H5LUW3LLGQ77JNQBEL74UE2BN3AO433QECSA2A76NFISVIQ\m\maven-enforcer-plugin\target\it\banned-dependencies-versionrange-fail\build.log, f:\jenkins\jenkins-slave\workspace\aven-enforcer_MENFORCER-294-IBUS6H5LUW3LLGQ77JNQBEL74UE2BN3AO433QECSA2A76NFISVIQ\m\maven-enforcer-plugin\target\it\banned-dependencies-versionrange\build.log, f:\jenkins\jenkins-slave\workspace\aven-enforcer_MENFORCER-294-IBUS6H5LUW3LLGQ77JNQBEL74UE2BN3AO433QECSA2A76NFISVIQ\m\maven-enforcer-plugin\target\it\banned-dependencies-wildcards\build.log, f:\jenkins\jenkins-slave\workspace\aven-enforcer_MENFORCER-294-IBUS6H5LUW3LLGQ77JNQBEL74UE2BN3AO433QECSA2A76NFISVIQ\m\maven-enforcer-plugin\target\it\banned-dependencies\build.log, f:\jenkins\jenkins-slave\workspace\aven-enforcer_MENFORCER-294-IBUS6H5LUW3LLGQ77JNQBEL74UE2BN3AO433QECSA2A76NFISVIQ\m\maven-enforcer-plugin\target\it\banned-plugins\build.log, f:\jenkins\jenkins-slave\workspace\aven-enforcer_MENFORCER-294-IBUS6H5LUW3LLGQ77JNQBEL74UE2BN3AO433QECSA2A76NFISVIQ\m\maven-enforcer-plugin\target\it\builds_a_pom_noop\build.log, f:\jenkins\jenkins-slave\workspace\aven-enforcer_MENFORCER-294-IBUS6H5LUW3LLGQ77JNQBEL74UE2BN3AO433QECSA2A76NFISVIQ\m\maven-enforcer-plugin\target\it\cli-always-fail\build.log, f:\jenkins\jenkins-slave\workspace\aven-enforcer_MENFORCER-294-IBUS6H5LUW3LLGQ77JNQBEL74UE2BN3AO433QECSA2A76NFISVIQ\m\maven-enforcer-plugin\target\it\cli-always-pass\build.log, f:\jenkins\jenkins-slave\workspace\aven-enforcer_MENFORCER-294-IBUS6H5LUW3LLGQ77JNQBEL74UE2BN3AO433QECSA2A76NFISVIQ\m\maven-enforcer-plugin\target\it\dependencies_converge\build.log, f:\jenkins\jenkins-slave\workspace\aven-enforcer_MENFORCER-294-IBUS6H5LUW3LLGQ77JNQBEL74UE2BN3AO433QECSA2A76NFISVIQ\m\maven-enforcer-plugin\target\it\dependencies_not_converging\build.log, f:\jenkins\jenkins-slave\workspace\aven-enforcer_MENFORCER-294-IBUS6H5LUW3LLGQ77JNQBEL74UE2BN3AO433QECSA2A76NFISVIQ\m\maven-enforcer-plugin\target\it\dependencies_not_converging_test_scope\build.log, f:\jenkins\jenkins-slave\workspace\aven-enforcer_MENFORCER-294-IBUS6H5LUW3LLGQ77JNQBEL74UE2BN3AO433QECSA2A76NFISVIQ\m\maven-enforcer-plugin\target\it\display-info\build.log, f:\jenkins\jenkins-slave\workspace\aven-enforcer_MENFORCER-294-IBUS6H5LUW3LLGQ77JNQBEL74UE2BN3AO433QECSA2A76NFISVIQ\m\maven-enforcer-plugin\target\it\evaluate-beanshell\build.log, f:\jenkins\jenkins-slave\workspace\aven-enforcer_MENFORCER-294-IBUS6H5LUW3LLGQ77JNQBEL74UE2BN3AO433QECSA2A76NFISVIQ\m\maven-enforcer-plugin\target\it\multimodule\build.log, f:\jenkins\jenkins-slave\workspace\aven-enforcer_MENFORCER-294-IBUS6H5LUW3LLGQ77JNQBEL74UE2BN3AO433QECSA2A76NFISVIQ\m\maven-enforcer-plugin\target\it\require-active-profile-all\build.log, f:\jenkins\jenkins-slave\workspace\aven-enforcer_MENFORCER-294-IBUS6H5LUW3LLGQ77JNQBEL74UE2BN3AO433QECSA2A76NFISVIQ\m\maven-enforcer-plugin\target\it\require-active-profile-from-settings\build.log, f:\jenkins\jenkins-slave\workspace\aven-enforcer_MENFORCER-294-IBUS6H5LUW3LLGQ77JNQBEL74UE2BN3AO433QECSA2A76NFISVIQ\m\maven-enforcer-plugin\target\it\require-active-profile\build.log, f:\jenkins\jenkins-slave\workspace\aven-enforcer_MENFORCER-294-IBUS6H5LUW3LLGQ77JNQBEL74UE2BN3AO433QECSA2A76NFISVIQ\m\maven-enforcer-plugin\target\it\require-file-checksum\build.log, f:\jenkins\jenkins-slave\workspace\aven-enforcer_MENFORCER-294-IBUS6H5LUW3LLGQ77JNQBEL74UE2BN3AO433QECSA2A76NFISVIQ\m\maven-enforcer-plugin\target\it\require-files-dont-exist\build.log, f:\jenkins\jenkins-slave\workspace\aven-enforcer_MENFORCER-294-IBUS6H5LUW3LLGQ77JNQBEL74UE2BN3AO433QECSA2A76NFISVIQ\m\maven-enforcer-plugin\target\it\require-files-exist\build.log, f:\jenkins\jenkins-slave\workspace\aven-enforcer_MENFORCER-294-IBUS6H5LUW3LLGQ77JNQBEL74UE2BN3AO433QECSA2A76NFISVIQ\m\maven-enforcer-plugin\target\it\require-files-size\build.log, f:\jenkins\jenkins-slave\workspace\aven-enforcer_MENFORCER-294-IBUS6H5LUW3LLGQ77JNQBEL74UE2BN3AO433QECSA2A76NFISVIQ\m\maven-enforcer-plugin\target\it\require-java-version\build.log, f:\jenkins\jenkins-slave\workspace\aven-enforcer_MENFORCER-294-IBUS6H5LUW3LLGQ77JNQBEL74UE2BN3AO433QECSA2A76NFISVIQ\m\maven-enforcer-plugin\target\it\require-maven-version\build.log, f:\jenkins\jenkins-slave\workspace\aven-enforcer_MENFORCER-294-IBUS6H5LUW3LLGQ77JNQBEL74UE2BN3AO433QECSA2A76NFISVIQ\m\maven-enforcer-plugin\target\it\require-no-repositories-allow-plugin-repo\build.log, f:\jenkins\jenkins-slave\workspace\aven-enforcer_MENFORCER-294-IBUS6H5LUW3LLGQ77JNQBEL74UE2BN3AO433QECSA2A76NFISVIQ\m\maven-enforcer-plugin\target\it\require-no-repositories-allow-repo\build.log, f:\jenkins\jenkins-slave\workspace\aven-enforcer_MENFORCER-294-IBUS6H5LUW3LLGQ77JNQBEL74UE2BN3AO433QECSA2A76NFISVIQ\m\maven-enforcer-plugin\target\it\require-no-repositories\build.log, f:\jenkins\jenkins-slave\workspace\aven-enforcer_MENFORCER-294-IBUS6H5LUW3LLGQ77JNQBEL74UE2BN3AO433QECSA2A76NFISVIQ\m\maven-enforcer-plugin\target\it\require-no-repositories_failure\build.log, f:\jenkins\jenkins-slave\workspace\aven-enforcer_MENFORCER-294-IBUS6H5LUW3LLGQ77JNQBEL74UE2BN3AO433QECSA2A76NFISVIQ\m\maven-enforcer-plugin\target\it\require-no-repositories_failure_allowed-plugin-repo\build.log, f:\jenkins\jenkins-slave\workspace\aven-enforcer_MENFORCER-294-IBUS6H5LUW3LLGQ77JNQBEL74UE2BN3AO433QECSA2A76NFISVIQ\m\maven-enforcer-plugin\target\it\require-no-repositories_failure_plugin-repositories\build.log, f:\jenkins\jenkins-slave\workspace\aven-enforcer_MENFORCER-294-IBUS6H5LUW3LLGQ77JNQBEL74UE2BN3AO433QECSA2A76NFISVIQ\m\maven-enforcer-plugin\target\it\require-no-repositories_failure_repositories\build.log, f:\jenkins\jenkins-slave\workspace\aven-enforcer_MENFORCER-294-IBUS6H5LUW3LLGQ77JNQBEL74UE2BN3AO433QECSA2A76NFISVIQ\m\maven-enforcer-plugin\target\it\require-no-repositories_mm\build.log, f:\jenkins\jenkins-slave\workspace\aven-enforcer_MENFORCER-294-IBUS6H5LUW3LLGQ77JNQBEL74UE2BN3AO433QECSA2A76NFISVIQ\m\maven-enforcer-plugin\target\it\require-no-repositories_mm_ci\build.log, f:\jenkins\jenkins-slave\workspace\aven-enforcer_MENFORCER-294-IBUS6H5LUW3LLGQ77JNQBEL74UE2BN3AO433QECSA2A76NFISVIQ\m\maven-enforcer-plugin\target\it\require-plugin-versions-ci\build.log, f:\jenkins\jenkins-slave\workspace\aven-enforcer_MENFORCER-294-IBUS6H5LUW3LLGQ77JNQBEL74UE2BN3AO433QECSA2A76NFISVIQ\m\maven-enforcer-plugin\target\it\require-plugin-versions-custom-packaging\build.log, f:\jenkins\jenkins-slave\workspace\aven-enforcer_MENFORCER-294-IBUS6H5LUW3LLGQ77JNQBEL74UE2BN3AO433QECSA2A76NFISVIQ\m\maven-enforcer-plugin\target\it\require-plugin-versions-expressions\build.log, f:\jenkins\jenkins-slave\workspace\aven-enforcer_MENFORCER-294-IBUS6H5LUW3LLGQ77JNQBEL74UE2BN3AO433QECSA2A76NFISVIQ\m\maven-enforcer-plugin\target\it\require-plugin-versions-mm-ci-friendly\build.log, f:\jenkins\jenkins-slave\workspace\aven-enforcer_MENFORCER-294-IBUS6H5LUW3LLGQ77JNQBEL74UE2BN3AO433QECSA2A76NFISVIQ\m\maven-enforcer-plugin\target\it\require-plugin-versions-plugin-with-extensions\build.log, f:\jenkins\jenkins-slave\workspace\aven-enforcer_MENFORCER-294-IBUS6H5LUW3LLGQ77JNQBEL74UE2BN3AO433QECSA2A76NFISVIQ\m\maven-enforcer-plugin\target\it\require-plugin-versions-plugin-with-integration-test-lifecycle\build.log, f:\jenkins\jenkins-slave\workspace\aven-enforcer_MENFORCER-294-IBUS6H5LUW3LLGQ77JNQBEL74UE2BN3AO433QECSA2A76NFISVIQ\m\maven-enforcer-plugin\target\it\require-plugin-versions-projectGAVexpressions\build.log, f:\jenkins\jenkins-slave\workspace\aven-enforcer_MENFORCER-294-IBUS6H5LUW3LLGQ77JNQBEL74UE2BN3AO433QECSA2A76NFISVIQ\m\maven-enforcer-plugin\target\it\require-plugin-versions\build.log, f:\jenkins\jenkins-slave\workspace\aven-enforcer_MENFORCER-294-IBUS6H5LUW3LLGQ77JNQBEL74UE2BN3AO433QECSA2A76NFISVIQ\m\maven-enforcer-plugin\target\it\require-profile-ids-exist_failure\build.log, f:\jenkins\jenkins-slave\workspace\aven-enforcer_MENFORCER-294-IBUS6H5LUW3LLGQ77JNQBEL74UE2BN3AO433QECSA2A76NFISVIQ\m\maven-enforcer-plugin\target\it\require-profile-ids-exist_success\build.log, f:\jenkins\jenkins-slave\workspace\aven-enforcer_MENFORCER-294-IBUS6H5LUW3LLGQ77JNQBEL74UE2BN3AO433QECSA2A76NFISVIQ\m\maven-enforcer-plugin\target\it\require-property\build.log, f:\jenkins\jenkins-slave\workspace\aven-enforcer_MENFORCER-294-IBUS6H5LUW3LLGQ77JNQBEL74UE2BN3AO433QECSA2A76NFISVIQ\m\maven-enforcer-plugin\target\it\require-release-dependencies-excludes\build.log, f:\jenkins\jenkins-slave\workspace\aven-enforcer_MENFORCER-294-IBUS6H5LUW3LLGQ77JNQBEL74UE2BN3AO433QECSA2A76NFISVIQ\m\maven-enforcer-plugin\target\it\require-release-dependencies-excludes_failure\build.log, f:\jenkins\jenkins-slave\workspace\aven-enforcer_MENFORCER-294-IBUS6H5LUW3LLGQ77JNQBEL74UE2BN3AO433QECSA2A76NFISVIQ\m\maven-enforcer-plugin\target\it\require-release-dependencies\build.log, f:\jenkins\jenkins-slave\workspace\aven-enforcer_MENFORCER-294-IBUS6H5LUW3LLGQ77JNQBEL74UE2BN3AO433QECSA2A76NFISVIQ\m\maven-enforcer-plugin\target\it\require-release-version\build.log, f:\jenkins\jenkins-slave\workspace\aven-enforcer_MENFORCER-294-IBUS6H5LUW3LLGQ77JNQBEL74UE2BN3AO433QECSA2A76NFISVIQ\m\maven-enforcer-plugin\target\it\require-same-versions_failure\build.log, f:\jenkins\jenkins-slave\workspace\aven-enforcer_MENFORCER-294-IBUS6H5LUW3LLGQ77JNQBEL74UE2BN3AO433QECSA2A76NFISVIQ\m\maven-enforcer-plugin\target\it\require-same-versions_success\build.log, f:\jenkins\jenkins-slave\workspace\aven-enforcer_MENFORCER-294-IBUS6H5LUW3LLGQ77JNQBEL74UE2BN3AO433QECSA2A76NFISVIQ\m\maven-enforcer-plugin\target\it\require-snapshot-version_failure\build.log, f:\jenkins\jenkins-slave\workspace\aven-enforcer_MENFORCER-294-IBUS6H5LUW3LLGQ77JNQBEL74UE2BN3AO433QECSA2A76NFISVIQ\m\maven-enforcer-plugin\target\it\require-snapshot-version_success\build.log, f:\jenkins\jenkins-slave\workspace\aven-enforcer_MENFORCER-294-IBUS6H5LUW3LLGQ77JNQBEL74UE2BN3AO433QECSA2A76NFISVIQ\m\maven-enforcer-plugin\target\it\require-upper-bound-dependencies-managed_failure\build.log, f:\jenkins\jenkins-slave\workspace\aven-enforcer_MENFORCER-294-IBUS6H5LUW3LLGQ77JNQBEL74UE2BN3AO433QECSA2A76NFISVIQ\m\maven-enforcer-plugin\target\it\require-upper-bound-dependencies-managed_success\build.log, f:\jenkins\jenkins-slave\workspace\aven-enforcer_MENFORCER-294-IBUS6H5LUW3LLGQ77JNQBEL74UE2BN3AO433QECSA2A76NFISVIQ\m\maven-enforcer-plugin\target\it\require-upper-bound-dependencies-unique_failure\build.log, f:\jenkins\jenkins-slave\workspace\aven-enforcer_MENFORCER-294-IBUS6H5LUW3LLGQ77JNQBEL74UE2BN3AO433QECSA2A76NFISVIQ\m\maven-enforcer-plugin\target\it\require-upper-bound-dependencies-unique_success\build.log, f:\jenkins\jenkins-slave\workspace\aven-enforcer_MENFORCER-294-IBUS6H5LUW3LLGQ77JNQBEL74UE2BN3AO433QECSA2A76NFISVIQ\m\maven-enforcer-plugin\target\it\require-upper-bound-deps_failure\build.log, f:\jenkins\jenkins-slave\workspace\aven-enforcer_MENFORCER-294-IBUS6H5LUW3LLGQ77JNQBEL74UE2BN3AO433QECSA2A76NFISVIQ\m\maven-enforcer-plugin\target\it\require-upper-bound-deps_ignored\build.log, f:\jenkins\jenkins-slave\workspace\aven-enforcer_MENFORCER-294-IBUS6H5LUW3LLGQ77JNQBEL74UE2BN3AO433QECSA2A76NFISVIQ\m\maven-enforcer-plugin\target\it\require-upper-bound-deps_success\build.log, f:\jenkins\jenkins-slave\workspace\aven-enforcer_MENFORCER-294-IBUS6H5LUW3LLGQ77JNQBEL74UE2BN3AO433QECSA2A76NFISVIQ\m\maven-enforcer-plugin\target\it\resolve_collect_dependencies\build.log]
[windows-jdk10] Finished parsing Maven Invoker results (found 68)
[windows-jdk10] [withMaven] junitPublisher - Archive test results for Maven artifact org.apache.maven.enforcer:enforcer-api:3.0.0-SNAPSHOT generated by maven-surefire-plugin:test (default-test): m\enforcer-api\target\surefire-reports\*.xml
[windows-jdk10] Recording test results
[windows-jdk10] None of the test reports contained any result
[windows-jdk10] [withMaven] junitPublisher - Archive test results for Maven artifact org.apache.maven.enforcer:enforcer-rules:3.0.0-SNAPSHOT generated by maven-surefire-plugin:test (default-test): m\enforcer-rules\target\surefire-reports\*.xml
[windows-jdk10] Recording test results
[windows-jdk10] [withMaven] junitPublisher - Archive test results for Maven artifact org.apache.maven.plugins:maven-enforcer-plugin:3.0.0-SNAPSHOT generated by maven-surefire-plugin:test (default-test): m\maven-enforcer-plugin\target\surefire-reports\*.xml
[windows-jdk10] Recording test results
[Pipeline] [windows-jdk10] // withMaven
[Pipeline] [windows-jdk10] cleanWs
[windows-jdk10] [WS-CLEANUP] Deleting project workspace...[WS-CLEANUP] done
[Pipeline] [windows-jdk10] }
[Pipeline] [windows-jdk10] // stage
[Pipeline] [windows-jdk10] }
[Pipeline] [windows-jdk10] // node
[Pipeline] [windows-jdk10] }
[Pipeline] // parallel
[Pipeline] stage
[Pipeline] { (Notifications)
[Pipeline] echo
Build result: UNSTABLE
[Pipeline] jiraIssueSelector
[Pipeline] emailext

Build unstable in Jenkins: Maven TLP » maven-enforcer » MENFORCER-294 #10

Posted by Apache Jenkins Server <je...@builds.apache.org>.
See https://builds.apache.org/job/maven-box/job/maven-enforcer/job/MENFORCER-294/10/

No changes.

4 tests failed.
FAILED:  org.apache.maven.plugins.enforcer.TestRequireEnvironmentVariable.testRuleWithRegex

Error Message:
This should not throw an exception

Stack Trace:
junit.framework.AssertionFailedError: This should not throw an exception
	at org.apache.maven.plugins.enforcer.TestRequireEnvironmentVariable.testRuleWithRegex(TestRequireEnvironmentVariable.java:107)


FAILED:  org.apache.maven.plugins.enforcer.TestRequireEnvironmentVariable.testRuleWithRegex

Error Message:
This should not throw an exception

Stack Trace:
junit.framework.AssertionFailedError: This should not throw an exception
	at org.apache.maven.plugins.enforcer.TestRequireEnvironmentVariable.testRuleWithRegex(TestRequireEnvironmentVariable.java:107)


FAILED:  org.apache.maven.plugins.enforcer.TestRequireEnvironmentVariable.testRuleWithRegex

Error Message:
This should not throw an exception

Stack Trace:
junit.framework.AssertionFailedError: This should not throw an exception
	at org.apache.maven.plugins.enforcer.TestRequireEnvironmentVariable.testRuleWithRegex(TestRequireEnvironmentVariable.java:107)


FAILED:  org.apache.maven.plugins.enforcer.TestRequireEnvironmentVariable.testRuleWithRegex

Error Message:
This should not throw an exception

Stack Trace:
junit.framework.AssertionFailedError: This should not throw an exception
	at org.apache.maven.plugins.enforcer.TestRequireEnvironmentVariable.testRuleWithRegex(TestRequireEnvironmentVariable.java:107)




Build log:
[...truncated 3.06 MB...]
[linux-jdk8] [INFO] Total time: 06:08 min
[linux-jdk8] [INFO] Finished at: 2018-08-20T05:18:27Z
[linux-jdk8] [INFO] ------------------------------------------------------------------------
[linux-jdk8] [INFO] [jenkins-event-spy] Generated /home/jenkins/jenkins-slave/workspace/aven-enforcer_MENFORCER-294-IBUS6H5LUW3LLGQ77JNQBEL74UE2BN3AO433QECSA2A76NFISVIQ@tmp/withMaven4c62d745/maven-spy-20180820-051218-3935112726309968598853.log
[linux-jdk10] [INFO]           require-plugin-versions-plugin-with-integration-test-lifecycle/pom.xml SUCCESS (11.3 s)
[linux-jdk10] [INFO] Building: banned-dependencies/pom.xml
[linux-jdk10] [INFO]           banned-dependencies/pom.xml ...................... SUCCESS (4.3 s)
[linux-jdk10] [INFO] Building: ban-pom-dependency-version/pom.xml
[linux-jdk10] [INFO] run post-build script verify.groovy
[linux-jdk10] [INFO]           ban-pom-dependency-version/pom.xml ............... SUCCESS (4.1 s)
[linux-jdk10] [INFO] Building: require-active-profile-all/pom.xml
[Pipeline] [linux-jdk9] }
[linux-jdk9] [withMaven] invokerPublisher - Archive invoker results for Maven artifact MavenArtifact{org.apache.maven.plugins:maven-enforcer-plugin::3.0.0-SNAPSHOT(version: 3.0.0-SNAPSHOT, snapshot:false) } generated by PluginInvocation{org.apache.maven.plugins:maven-invoker-plugin:3.0.1@run  integration-test}: m/maven-enforcer-plugin/target/invoker-reports/*.xml
[linux-jdk9] performing MavenInvokerRecorder, reportsFilenamePattern:'**/m/maven-enforcer-plugin/target/invoker-reports/BUILD*.xml', invokerBuildDir:'**/m/maven-enforcer-plugin/target/it'
[linux-jdk9] Found reports:[/home/jenkins/jenkins-slave/workspace/aven-enforcer_MENFORCER-294-IBUS6H5LUW3LLGQ77JNQBEL74UE2BN3AO433QECSA2A76NFISVIQ/m/maven-enforcer-plugin/target/invoker-reports/BUILD-always-fail-warn.xml, /home/jenkins/jenkins-slave/workspace/aven-enforcer_MENFORCER-294-IBUS6H5LUW3LLGQ77JNQBEL74UE2BN3AO433QECSA2A76NFISVIQ/m/maven-enforcer-plugin/target/invoker-reports/BUILD-always-fail.xml, /home/jenkins/jenkins-slave/workspace/aven-enforcer_MENFORCER-294-IBUS6H5LUW3LLGQ77JNQBEL74UE2BN3AO433QECSA2A76NFISVIQ/m/maven-enforcer-plugin/target/invoker-reports/BUILD-always-pass.xml, /home/jenkins/jenkins-slave/workspace/aven-enforcer_MENFORCER-294-IBUS6H5LUW3LLGQ77JNQBEL74UE2BN3AO433QECSA2A76NFISVIQ/m/maven-enforcer-plugin/target/invoker-reports/BUILD-ban-distribution-management-multi-module-build.xml, /home/jenkins/jenkins-slave/workspace/aven-enforcer_MENFORCER-294-IBUS6H5LUW3LLGQ77JNQBEL74UE2BN3AO433QECSA2A76NFISVIQ/m/maven-enforcer-plugin/target/invoker-reports/BUILD-ban-distribution-management-multi-module-except-site.xml, /home/jenkins/jenkins-slave/workspace/aven-enforcer_MENFORCER-294-IBUS6H5LUW3LLGQ77JNQBEL74UE2BN3AO433QECSA2A76NFISVIQ/m/maven-enforcer-plugin/target/invoker-reports/BUILD-ban-distribution-management.xml, /home/jenkins/jenkins-slave/workspace/aven-enforcer_MENFORCER-294-IBUS6H5LUW3LLGQ77JNQBEL74UE2BN3AO433QECSA2A76NFISVIQ/m/maven-enforcer-plugin/target/invoker-reports/BUILD-ban-pom-dependency-version.xml, /home/jenkins/jenkins-slave/workspace/aven-enforcer_MENFORCER-294-IBUS6H5LUW3LLGQ77JNQBEL74UE2BN3AO433QECSA2A76NFISVIQ/m/maven-enforcer-plugin/target/invoker-reports/BUILD-ban-transitive-dependencies-fail.xml, /home/jenkins/jenkins-slave/workspace/aven-enforcer_MENFORCER-294-IBUS6H5LUW3LLGQ77JNQBEL74UE2BN3AO433QECSA2A76NFISVIQ/m/maven-enforcer-plugin/target/invoker-reports/BUILD-ban-transitive-dependencies.xml, /home/jenkins/jenkins-slave/workspace/aven-enforcer_MENFORCER-294-IBUS6H5LUW3LLGQ77JNQBEL74UE2BN3AO433QECSA2A76NFISVIQ/m/maven-enforcer-plugin/target/invoker-reports/BUILD-banned-dependencies-versionrange-fail.xml, /home/jenkins/jenkins-slave/workspace/aven-enforcer_MENFORCER-294-IBUS6H5LUW3LLGQ77JNQBEL74UE2BN3AO433QECSA2A76NFISVIQ/m/maven-enforcer-plugin/target/invoker-reports/BUILD-banned-dependencies-versionrange.xml, /home/jenkins/jenkins-slave/workspace/aven-enforcer_MENFORCER-294-IBUS6H5LUW3LLGQ77JNQBEL74UE2BN3AO433QECSA2A76NFISVIQ/m/maven-enforcer-plugin/target/invoker-reports/BUILD-banned-dependencies-wildcards.xml, /home/jenkins/jenkins-slave/workspace/aven-enforcer_MENFORCER-294-IBUS6H5LUW3LLGQ77JNQBEL74UE2BN3AO433QECSA2A76NFISVIQ/m/maven-enforcer-plugin/target/invoker-reports/BUILD-banned-dependencies.xml, /home/jenkins/jenkins-slave/workspace/aven-enforcer_MENFORCER-294-IBUS6H5LUW3LLGQ77JNQBEL74UE2BN3AO433QECSA2A76NFISVIQ/m/maven-enforcer-plugin/target/invoker-reports/BUILD-banned-plugins.xml, /home/jenkins/jenkins-slave/workspace/aven-enforcer_MENFORCER-294-IBUS6H5LUW3LLGQ77JNQBEL74UE2BN3AO433QECSA2A76NFISVIQ/m/maven-enforcer-plugin/target/invoker-reports/BUILD-builds_a_pom_noop.xml, /home/jenkins/jenkins-slave/workspace/aven-enforcer_MENFORCER-294-IBUS6H5LUW3LLGQ77JNQBEL74UE2BN3AO433QECSA2A76NFISVIQ/m/maven-enforcer-plugin/target/invoker-reports/BUILD-cli-always-fail.xml, /home/jenkins/jenkins-slave/workspace/aven-enforcer_MENFORCER-294-IBUS6H5LUW3LLGQ77JNQBEL74UE2BN3AO433QECSA2A76NFISVIQ/m/maven-enforcer-plugin/target/invoker-reports/BUILD-cli-always-pass.xml, /home/jenkins/jenkins-slave/workspace/aven-enforcer_MENFORCER-294-IBUS6H5LUW3LLGQ77JNQBEL74UE2BN3AO433QECSA2A76NFISVIQ/m/maven-enforcer-plugin/target/invoker-reports/BUILD-dependencies_converge.xml, /home/jenkins/jenkins-slave/workspace/aven-enforcer_MENFORCER-294-IBUS6H5LUW3LLGQ77JNQBEL74UE2BN3AO433QECSA2A76NFISVIQ/m/maven-enforcer-plugin/target/invoker-reports/BUILD-dependencies_not_converging.xml, /home/jenkins/jenkins-slave/workspace/aven-enforcer_MENFORCER-294-IBUS6H5LUW3LLGQ77JNQBEL74UE2BN3AO433QECSA2A76NFISVIQ/m/maven-enforcer-plugin/target/invoker-reports/BUILD-dependencies_not_converging_test_scope.xml, /home/jenkins/jenkins-slave/workspace/aven-enforcer_MENFORCER-294-IBUS6H5LUW3LLGQ77JNQBEL74UE2BN3AO433QECSA2A76NFISVIQ/m/maven-enforcer-plugin/target/invoker-reports/BUILD-display-info.xml, /home/jenkins/jenkins-slave/workspace/aven-enforcer_MENFORCER-294-IBUS6H5LUW3LLGQ77JNQBEL74UE2BN3AO433QECSA2A76NFISVIQ/m/maven-enforcer-plugin/target/invoker-reports/BUILD-evaluate-beanshell.xml, /home/jenkins/jenkins-slave/workspace/aven-enforcer_MENFORCER-294-IBUS6H5LUW3LLGQ77JNQBEL74UE2BN3AO433QECSA2A76NFISVIQ/m/maven-enforcer-plugin/target/invoker-reports/BUILD-multimodule.xml, /home/jenkins/jenkins-slave/workspace/aven-enforcer_MENFORCER-294-IBUS6H5LUW3LLGQ77JNQBEL74UE2BN3AO433QECSA2A76NFISVIQ/m/maven-enforcer-plugin/target/invoker-reports/BUILD-require-active-profile-all.xml, /home/jenkins/jenkins-slave/workspace/aven-enforcer_MENFORCER-294-IBUS6H5LUW3LLGQ77JNQBEL74UE2BN3AO433QECSA2A76NFISVIQ/m/maven-enforcer-plugin/target/invoker-reports/BUILD-require-active-profile-from-settings.xml, /home/jenkins/jenkins-slave/workspace/aven-enforcer_MENFORCER-294-IBUS6H5LUW3LLGQ77JNQBEL74UE2BN3AO433QECSA2A76NFISVIQ/m/maven-enforcer-plugin/target/invoker-reports/BUILD-require-active-profile.xml, /home/jenkins/jenkins-slave/workspace/aven-enforcer_MENFORCER-294-IBUS6H5LUW3LLGQ77JNQBEL74UE2BN3AO433QECSA2A76NFISVIQ/m/maven-enforcer-plugin/target/invoker-reports/BUILD-require-file-checksum.xml, /home/jenkins/jenkins-slave/workspace/aven-enforcer_MENFORCER-294-IBUS6H5LUW3LLGQ77JNQBEL74UE2BN3AO433QECSA2A76NFISVIQ/m/maven-enforcer-plugin/target/invoker-reports/BUILD-require-files-dont-exist.xml, /home/jenkins/jenkins-slave/workspace/aven-enforcer_MENFORCER-294-IBUS6H5LUW3LLGQ77JNQBEL74UE2BN3AO433QECSA2A76NFISVIQ/m/maven-enforcer-plugin/target/invoker-reports/BUILD-require-files-exist.xml, /home/jenkins/jenkins-slave/workspace/aven-enforcer_MENFORCER-294-IBUS6H5LUW3LLGQ77JNQBEL74UE2BN3AO433QECSA2A76NFISVIQ/m/maven-enforcer-plugin/target/invoker-reports/BUILD-require-files-size.xml, /home/jenkins/jenkins-slave/workspace/aven-enforcer_MENFORCER-294-IBUS6H5LUW3LLGQ77JNQBEL74UE2BN3AO433QECSA2A76NFISVIQ/m/maven-enforcer-plugin/target/invoker-reports/BUILD-require-java-version.xml, /home/jenkins/jenkins-slave/workspace/aven-enforcer_MENFORCER-294-IBUS6H5LUW3LLGQ77JNQBEL74UE2BN3AO433QECSA2A76NFISVIQ/m/maven-enforcer-plugin/target/invoker-reports/BUILD-require-maven-version.xml, /home/jenkins/jenkins-slave/workspace/aven-enforcer_MENFORCER-294-IBUS6H5LUW3LLGQ77JNQBEL74UE2BN3AO433QECSA2A76NFISVIQ/m/maven-enforcer-plugin/target/invoker-reports/BUILD-require-no-repositories-allow-plugin-repo.xml, /home/jenkins/jenkins-slave/workspace/aven-enforcer_MENFORCER-294-IBUS6H5LUW3LLGQ77JNQBEL74UE2BN3AO433QECSA2A76NFISVIQ/m/maven-enforcer-plugin/target/invoker-reports/BUILD-require-no-repositories-allow-repo.xml, /home/jenkins/jenkins-slave/workspace/aven-enforcer_MENFORCER-294-IBUS6H5LUW3LLGQ77JNQBEL74UE2BN3AO433QECSA2A76NFISVIQ/m/maven-enforcer-plugin/target/invoker-reports/BUILD-require-no-repositories.xml, /home/jenkins/jenkins-slave/workspace/aven-enforcer_MENFORCER-294-IBUS6H5LUW3LLGQ77JNQBEL74UE2BN3AO433QECSA2A76NFISVIQ/m/maven-enforcer-plugin/target/invoker-reports/BUILD-require-no-repositories_failure.xml, /home/jenkins/jenkins-slave/workspace/aven-enforcer_MENFORCER-294-IBUS6H5LUW3LLGQ77JNQBEL74UE2BN3AO433QECSA2A76NFISVIQ/m/maven-enforcer-plugin/target/invoker-reports/BUILD-require-no-repositories_failure_allowed-plugin-repo.xml, /home/jenkins/jenkins-slave/workspace/aven-enforcer_MENFORCER-294-IBUS6H5LUW3LLGQ77JNQBEL74UE2BN3AO433QECSA2A76NFISVIQ/m/maven-enforcer-plugin/target/invoker-reports/BUILD-require-no-repositories_failure_plugin-repositories.xml, /home/jenkins/jenkins-slave/workspace/aven-enforcer_MENFORCER-294-IBUS6H5LUW3LLGQ77JNQBEL74UE2BN3AO433QECSA2A76NFISVIQ/m/maven-enforcer-plugin/target/invoker-reports/BUILD-require-no-repositories_failure_repositories.xml, /home/jenkins/jenkins-slave/workspace/aven-enforcer_MENFORCER-294-IBUS6H5LUW3LLGQ77JNQBEL74UE2BN3AO433QECSA2A76NFISVIQ/m/maven-enforcer-plugin/target/invoker-reports/BUILD-require-no-repositories_mm.xml, /home/jenkins/jenkins-slave/workspace/aven-enforcer_MENFORCER-294-IBUS6H5LUW3LLGQ77JNQBEL74UE2BN3AO433QECSA2A76NFISVIQ/m/maven-enforcer-plugin/target/invoker-reports/BUILD-require-no-repositories_mm_ci.xml, /home/jenkins/jenkins-slave/workspace/aven-enforcer_MENFORCER-294-IBUS6H5LUW3LLGQ77JNQBEL74UE2BN3AO433QECSA2A76NFISVIQ/m/maven-enforcer-plugin/target/invoker-reports/BUILD-require-plugin-versions-ci.xml, /home/jenkins/jenkins-slave/workspace/aven-enforcer_MENFORCER-294-IBUS6H5LUW3LLGQ77JNQBEL74UE2BN3AO433QECSA2A76NFISVIQ/m/maven-enforcer-plugin/target/invoker-reports/BUILD-require-plugin-versions-custom-packaging.xml, /home/jenkins/jenkins-slave/workspace/aven-enforcer_MENFORCER-294-IBUS6H5LUW3LLGQ77JNQBEL74UE2BN3AO433QECSA2A76NFISVIQ/m/maven-enforcer-plugin/target/invoker-reports/BUILD-require-plugin-versions-expressions.xml, /home/jenkins/jenkins-slave/workspace/aven-enforcer_MENFORCER-294-IBUS6H5LUW3LLGQ77JNQBEL74UE2BN3AO433QECSA2A76NFISVIQ/m/maven-enforcer-plugin/target/invoker-reports/BUILD-require-plugin-versions-mm-ci-friendly.xml, /home/jenkins/jenkins-slave/workspace/aven-enforcer_MENFORCER-294-IBUS6H5LUW3LLGQ77JNQBEL74UE2BN3AO433QECSA2A76NFISVIQ/m/maven-enforcer-plugin/target/invoker-reports/BUILD-require-plugin-versions-plugin-with-extensions.xml, /home/jenkins/jenkins-slave/workspace/aven-enforcer_MENFORCER-294-IBUS6H5LUW3LLGQ77JNQBEL74UE2BN3AO433QECSA2A76NFISVIQ/m/maven-enforcer-plugin/target/invoker-reports/BUILD-require-plugin-versions-plugin-with-integration-test-lifecycle.xml, /home/jenkins/jenkins-slave/workspace/aven-enforcer_MENFORCER-294-IBUS6H5LUW3LLGQ77JNQBEL74UE2BN3AO433QECSA2A76NFISVIQ/m/maven-enforcer-plugin/target/invoker-reports/BUILD-require-plugin-versions-projectGAVexpressions.xml, /home/jenkins/jenkins-slave/workspace/aven-enforcer_MENFORCER-294-IBUS6H5LUW3LLGQ77JNQBEL74UE2BN3AO433QECSA2A76NFISVIQ/m/maven-enforcer-plugin/target/invoker-reports/BUILD-require-plugin-versions.xml, /home/jenkins/jenkins-slave/workspace/aven-enforcer_MENFORCER-294-IBUS6H5LUW3LLGQ77JNQBEL74UE2BN3AO433QECSA2A76NFISVIQ/m/maven-enforcer-plugin/target/invoker-reports/BUILD-require-profile-ids-exist_failure.xml, /home/jenkins/jenkins-slave/workspace/aven-enforcer_MENFORCER-294-IBUS6H5LUW3LLGQ77JNQBEL74UE2BN3AO433QECSA2A76NFISVIQ/m/maven-enforcer-plugin/target/invoker-reports/BUILD-require-profile-ids-exist_success.xml, /home/jenkins/jenkins-slave/workspace/aven-enforcer_MENFORCER-294-IBUS6H5LUW3LLGQ77JNQBEL74UE2BN3AO433QECSA2A76NFISVIQ/m/maven-enforcer-plugin/target/invoker-reports/BUILD-require-property.xml, /home/jenkins/jenkins-slave/workspace/aven-enforcer_MENFORCER-294-IBUS6H5LUW3LLGQ77JNQBEL74UE2BN3AO433QECSA2A76NFISVIQ/m/maven-enforcer-plugin/target/invoker-reports/BUILD-require-release-dependencies-excludes.xml, /home/jenkins/jenkins-slave/workspace/aven-enforcer_MENFORCER-294-IBUS6H5LUW3LLGQ77JNQBEL74UE2BN3AO433QECSA2A76NFISVIQ/m/maven-enforcer-plugin/target/invoker-reports/BUILD-require-release-dependencies-excludes_failure.xml, /home/jenkins/jenkins-slave/workspace/aven-enforcer_MENFORCER-294-IBUS6H5LUW3LLGQ77JNQBEL74UE2BN3AO433QECSA2A76NFISVIQ/m/maven-enforcer-plugin/target/invoker-reports/BUILD-require-release-dependencies.xml, /home/jenkins/jenkins-slave/workspace/aven-enforcer_MENFORCER-294-IBUS6H5LUW3LLGQ77JNQBEL74UE2BN3AO433QECSA2A76NFISVIQ/m/maven-enforcer-plugin/target/invoker-reports/BUILD-require-release-version.xml, /home/jenkins/jenkins-slave/workspace/aven-enforcer_MENFORCER-294-IBUS6H5LUW3LLGQ77JNQBEL74UE2BN3AO433QECSA2A76NFISVIQ/m/maven-enforcer-plugin/target/invoker-reports/BUILD-require-same-versions_failure.xml, /home/jenkins/jenkins-slave/workspace/aven-enforcer_MENFORCER-294-IBUS6H5LUW3LLGQ77JNQBEL74UE2BN3AO433QECSA2A76NFISVIQ/m/maven-enforcer-plugin/target/invoker-reports/BUILD-require-same-versions_success.xml, /home/jenkins/jenkins-slave/workspace/aven-enforcer_MENFORCER-294-IBUS6H5LUW3LLGQ77JNQBEL74UE2BN3AO433QECSA2A76NFISVIQ/m/maven-enforcer-plugin/target/invoker-reports/BUILD-require-snapshot-version_failure.xml, /home/jenkins/jenkins-slave/workspace/aven-enforcer_MENFORCER-294-IBUS6H5LUW3LLGQ77JNQBEL74UE2BN3AO433QECSA2A76NFISVIQ/m/maven-enforcer-plugin/target/invoker-reports/BUILD-require-snapshot-version_success.xml, /home/jenkins/jenkins-slave/workspace/aven-enforcer_MENFORCER-294-IBUS6H5LUW3LLGQ77JNQBEL74UE2BN3AO433QECSA2A76NFISVIQ/m/maven-enforcer-plugin/target/invoker-reports/BUILD-require-upper-bound-dependencies-managed_failure.xml, /home/jenkins/jenkins-slave/workspace/aven-enforcer_MENFORCER-294-IBUS6H5LUW3LLGQ77JNQBEL74UE2BN3AO433QECSA2A76NFISVIQ/m/maven-enforcer-plugin/target/invoker-reports/BUILD-require-upper-bound-dependencies-managed_success.xml, /home/jenkins/jenkins-slave/workspace/aven-enforcer_MENFORCER-294-IBUS6H5LUW3LLGQ77JNQBEL74UE2BN3AO433QECSA2A76NFISVIQ/m/maven-enforcer-plugin/target/invoker-reports/BUILD-require-upper-bound-dependencies-unique_failure.xml, /home/jenkins/jenkins-slave/workspace/aven-enforcer_MENFORCER-294-IBUS6H5LUW3LLGQ77JNQBEL74UE2BN3AO433QECSA2A76NFISVIQ/m/maven-enforcer-plugin/target/invoker-reports/BUILD-require-upper-bound-dependencies-unique_success.xml, /home/jenkins/jenkins-slave/workspace/aven-enforcer_MENFORCER-294-IBUS6H5LUW3LLGQ77JNQBEL74UE2BN3AO433QECSA2A76NFISVIQ/m/maven-enforcer-plugin/target/invoker-reports/BUILD-require-upper-bound-deps_failure.xml, /home/jenkins/jenkins-slave/workspace/aven-enforcer_MENFORCER-294-IBUS6H5LUW3LLGQ77JNQBEL74UE2BN3AO433QECSA2A76NFISVIQ/m/maven-enforcer-plugin/target/invoker-reports/BUILD-require-upper-bound-deps_ignored.xml, /home/jenkins/jenkins-slave/workspace/aven-enforcer_MENFORCER-294-IBUS6H5LUW3LLGQ77JNQBEL74UE2BN3AO433QECSA2A76NFISVIQ/m/maven-enforcer-plugin/target/invoker-reports/BUILD-require-upper-bound-deps_success.xml, /home/jenkins/jenkins-slave/workspace/aven-enforcer_MENFORCER-294-IBUS6H5LUW3LLGQ77JNQBEL74UE2BN3AO433QECSA2A76NFISVIQ/m/maven-enforcer-plugin/target/invoker-reports/BUILD-resolve_collect_dependencies.xml]
[linux-jdk9] Found logs:[/home/jenkins/jenkins-slave/workspace/aven-enforcer_MENFORCER-294-IBUS6H5LUW3LLGQ77JNQBEL74UE2BN3AO433QECSA2A76NFISVIQ/m/maven-enforcer-plugin/target/it/always-fail-warn/build.log, /home/jenkins/jenkins-slave/workspace/aven-enforcer_MENFORCER-294-IBUS6H5LUW3LLGQ77JNQBEL74UE2BN3AO433QECSA2A76NFISVIQ/m/maven-enforcer-plugin/target/it/always-fail/build.log, /home/jenkins/jenkins-slave/workspace/aven-enforcer_MENFORCER-294-IBUS6H5LUW3LLGQ77JNQBEL74UE2BN3AO433QECSA2A76NFISVIQ/m/maven-enforcer-plugin/target/it/always-pass/build.log, /home/jenkins/jenkins-slave/workspace/aven-enforcer_MENFORCER-294-IBUS6H5LUW3LLGQ77JNQBEL74UE2BN3AO433QECSA2A76NFISVIQ/m/maven-enforcer-plugin/target/it/ban-distribution-management-multi-module-build/build.log, /home/jenkins/jenkins-slave/workspace/aven-enforcer_MENFORCER-294-IBUS6H5LUW3LLGQ77JNQBEL74UE2BN3AO433QECSA2A76NFISVIQ/m/maven-enforcer-plugin/target/it/ban-distribution-management-multi-module-except-site/build.log, /home/jenkins/jenkins-slave/workspace/aven-enforcer_MENFORCER-294-IBUS6H5LUW3LLGQ77JNQBEL74UE2BN3AO433QECSA2A76NFISVIQ/m/maven-enforcer-plugin/target/it/ban-distribution-management/build.log, /home/jenkins/jenkins-slave/workspace/aven-enforcer_MENFORCER-294-IBUS6H5LUW3LLGQ77JNQBEL74UE2BN3AO433QECSA2A76NFISVIQ/m/maven-enforcer-plugin/target/it/ban-pom-dependency-version/build.log, /home/jenkins/jenkins-slave/workspace/aven-enforcer_MENFORCER-294-IBUS6H5LUW3LLGQ77JNQBEL74UE2BN3AO433QECSA2A76NFISVIQ/m/maven-enforcer-plugin/target/it/ban-transitive-dependencies-fail/build.log, /home/jenkins/jenkins-slave/workspace/aven-enforcer_MENFORCER-294-IBUS6H5LUW3LLGQ77JNQBEL74UE2BN3AO433QECSA2A76NFISVIQ/m/maven-enforcer-plugin/target/it/ban-transitive-dependencies/build.log, /home/jenkins/jenkins-slave/workspace/aven-enforcer_MENFORCER-294-IBUS6H5LUW3LLGQ77JNQBEL74UE2BN3AO433QECSA2A76NFISVIQ/m/maven-enforcer-plugin/target/it/banned-dependencies-versionrange-fail/build.log, /home/jenkins/jenkins-slave/workspace/aven-enforcer_MENFORCER-294-IBUS6H5LUW3LLGQ77JNQBEL74UE2BN3AO433QECSA2A76NFISVIQ/m/maven-enforcer-plugin/target/it/banned-dependencies-versionrange/build.log, /home/jenkins/jenkins-slave/workspace/aven-enforcer_MENFORCER-294-IBUS6H5LUW3LLGQ77JNQBEL74UE2BN3AO433QECSA2A76NFISVIQ/m/maven-enforcer-plugin/target/it/banned-dependencies-wildcards/build.log, /home/jenkins/jenkins-slave/workspace/aven-enforcer_MENFORCER-294-IBUS6H5LUW3LLGQ77JNQBEL74UE2BN3AO433QECSA2A76NFISVIQ/m/maven-enforcer-plugin/target/it/banned-dependencies/build.log, /home/jenkins/jenkins-slave/workspace/aven-enforcer_MENFORCER-294-IBUS6H5LUW3LLGQ77JNQBEL74UE2BN3AO433QECSA2A76NFISVIQ/m/maven-enforcer-plugin/target/it/banned-plugins/build.log, /home/jenkins/jenkins-slave/workspace/aven-enforcer_MENFORCER-294-IBUS6H5LUW3LLGQ77JNQBEL74UE2BN3AO433QECSA2A76NFISVIQ/m/maven-enforcer-plugin/target/it/builds_a_pom_noop/build.log, /home/jenkins/jenkins-slave/workspace/aven-enforcer_MENFORCER-294-IBUS6H5LUW3LLGQ77JNQBEL74UE2BN3AO433QECSA2A76NFISVIQ/m/maven-enforcer-plugin/target/it/cli-always-fail/build.log, /home/jenkins/jenkins-slave/workspace/aven-enforcer_MENFORCER-294-IBUS6H5LUW3LLGQ77JNQBEL74UE2BN3AO433QECSA2A76NFISVIQ/m/maven-enforcer-plugin/target/it/cli-always-pass/build.log, /home/jenkins/jenkins-slave/workspace/aven-enforcer_MENFORCER-294-IBUS6H5LUW3LLGQ77JNQBEL74UE2BN3AO433QECSA2A76NFISVIQ/m/maven-enforcer-plugin/target/it/dependencies_converge/build.log, /home/jenkins/jenkins-slave/workspace/aven-enforcer_MENFORCER-294-IBUS6H5LUW3LLGQ77JNQBEL74UE2BN3AO433QECSA2A76NFISVIQ/m/maven-enforcer-plugin/target/it/dependencies_not_converging/build.log, /home/jenkins/jenkins-slave/workspace/aven-enforcer_MENFORCER-294-IBUS6H5LUW3LLGQ77JNQBEL74UE2BN3AO433QECSA2A76NFISVIQ/m/maven-enforcer-plugin/target/it/dependencies_not_converging_test_scope/build.log, /home/jenkins/jenkins-slave/workspace/aven-enforcer_MENFORCER-294-IBUS6H5LUW3LLGQ77JNQBEL74UE2BN3AO433QECSA2A76NFISVIQ/m/maven-enforcer-plugin/target/it/display-info/build.log, /home/jenkins/jenkins-slave/workspace/aven-enforcer_MENFORCER-294-IBUS6H5LUW3LLGQ77JNQBEL74UE2BN3AO433QECSA2A76NFISVIQ/m/maven-enforcer-plugin/target/it/evaluate-beanshell/build.log, /home/jenkins/jenkins-slave/workspace/aven-enforcer_MENFORCER-294-IBUS6H5LUW3LLGQ77JNQBEL74UE2BN3AO433QECSA2A76NFISVIQ/m/maven-enforcer-plugin/target/it/multimodule/build.log, /home/jenkins/jenkins-slave/workspace/aven-enforcer_MENFORCER-294-IBUS6H5LUW3LLGQ77JNQBEL74UE2BN3AO433QECSA2A76NFISVIQ/m/maven-enforcer-plugin/target/it/require-active-profile-all/build.log, /home/jenkins/jenkins-slave/workspace/aven-enforcer_MENFORCER-294-IBUS6H5LUW3LLGQ77JNQBEL74UE2BN3AO433QECSA2A76NFISVIQ/m/maven-enforcer-plugin/target/it/require-active-profile-from-settings/build.log, /home/jenkins/jenkins-slave/workspace/aven-enforcer_MENFORCER-294-IBUS6H5LUW3LLGQ77JNQBEL74UE2BN3AO433QECSA2A76NFISVIQ/m/maven-enforcer-plugin/target/it/require-active-profile/build.log, /home/jenkins/jenkins-slave/workspace/aven-enforcer_MENFORCER-294-IBUS6H5LUW3LLGQ77JNQBEL74UE2BN3AO433QECSA2A76NFISVIQ/m/maven-enforcer-plugin/target/it/require-file-checksum/build.log, /home/jenkins/jenkins-slave/workspace/aven-enforcer_MENFORCER-294-IBUS6H5LUW3LLGQ77JNQBEL74UE2BN3AO433QECSA2A76NFISVIQ/m/maven-enforcer-plugin/target/it/require-files-dont-exist/build.log, /home/jenkins/jenkins-slave/workspace/aven-enforcer_MENFORCER-294-IBUS6H5LUW3LLGQ77JNQBEL74UE2BN3AO433QECSA2A76NFISVIQ/m/maven-enforcer-plugin/target/it/require-files-exist/build.log, /home/jenkins/jenkins-slave/workspace/aven-enforcer_MENFORCER-294-IBUS6H5LUW3LLGQ77JNQBEL74UE2BN3AO433QECSA2A76NFISVIQ/m/maven-enforcer-plugin/target/it/require-files-size/build.log, /home/jenkins/jenkins-slave/workspace/aven-enforcer_MENFORCER-294-IBUS6H5LUW3LLGQ77JNQBEL74UE2BN3AO433QECSA2A76NFISVIQ/m/maven-enforcer-plugin/target/it/require-java-version/build.log, /home/jenkins/jenkins-slave/workspace/aven-enforcer_MENFORCER-294-IBUS6H5LUW3LLGQ77JNQBEL74UE2BN3AO433QECSA2A76NFISVIQ/m/maven-enforcer-plugin/target/it/require-maven-version/build.log, /home/jenkins/jenkins-slave/workspace/aven-enforcer_MENFORCER-294-IBUS6H5LUW3LLGQ77JNQBEL74UE2BN3AO433QECSA2A76NFISVIQ/m/maven-enforcer-plugin/target/it/require-no-repositories-allow-plugin-repo/build.log, /home/jenkins/jenkins-slave/workspace/aven-enforcer_MENFORCER-294-IBUS6H5LUW3LLGQ77JNQBEL74UE2BN3AO433QECSA2A76NFISVIQ/m/maven-enforcer-plugin/target/it/require-no-repositories-allow-repo/build.log, /home/jenkins/jenkins-slave/workspace/aven-enforcer_MENFORCER-294-IBUS6H5LUW3LLGQ77JNQBEL74UE2BN3AO433QECSA2A76NFISVIQ/m/maven-enforcer-plugin/target/it/require-no-repositories/build.log, /home/jenkins/jenkins-slave/workspace/aven-enforcer_MENFORCER-294-IBUS6H5LUW3LLGQ77JNQBEL74UE2BN3AO433QECSA2A76NFISVIQ/m/maven-enforcer-plugin/target/it/require-no-repositories_failure/build.log, /home/jenkins/jenkins-slave/workspace/aven-enforcer_MENFORCER-294-IBUS6H5LUW3LLGQ77JNQBEL74UE2BN3AO433QECSA2A76NFISVIQ/m/maven-enforcer-plugin/target/it/require-no-repositories_failure_allowed-plugin-repo/build.log, /home/jenkins/jenkins-slave/workspace/aven-enforcer_MENFORCER-294-IBUS6H5LUW3LLGQ77JNQBEL74UE2BN3AO433QECSA2A76NFISVIQ/m/maven-enforcer-plugin/target/it/require-no-repositories_failure_plugin-repositories/build.log, /home/jenkins/jenkins-slave/workspace/aven-enforcer_MENFORCER-294-IBUS6H5LUW3LLGQ77JNQBEL74UE2BN3AO433QECSA2A76NFISVIQ/m/maven-enforcer-plugin/target/it/require-no-repositories_failure_repositories/build.log, /home/jenkins/jenkins-slave/workspace/aven-enforcer_MENFORCER-294-IBUS6H5LUW3LLGQ77JNQBEL74UE2BN3AO433QECSA2A76NFISVIQ/m/maven-enforcer-plugin/target/it/require-no-repositories_mm/build.log, /home/jenkins/jenkins-slave/workspace/aven-enforcer_MENFORCER-294-IBUS6H5LUW3LLGQ77JNQBEL74UE2BN3AO433QECSA2A76NFISVIQ/m/maven-enforcer-plugin/target/it/require-no-repositories_mm_ci/build.log, /home/jenkins/jenkins-slave/workspace/aven-enforcer_MENFORCER-294-IBUS6H5LUW3LLGQ77JNQBEL74UE2BN3AO433QECSA2A76NFISVIQ/m/maven-enforcer-plugin/target/it/require-plugin-versions-ci/build.log, /home/jenkins/jenkins-slave/workspace/aven-enforcer_MENFORCER-294-IBUS6H5LUW3LLGQ77JNQBEL74UE2BN3AO433QECSA2A76NFISVIQ/m/maven-enforcer-plugin/target/it/require-plugin-versions-custom-packaging/build.log, /home/jenkins/jenkins-slave/workspace/aven-enforcer_MENFORCER-294-IBUS6H5LUW3LLGQ77JNQBEL74UE2BN3AO433QECSA2A76NFISVIQ/m/maven-enforcer-plugin/target/it/require-plugin-versions-expressions/build.log, /home/jenkins/jenkins-slave/workspace/aven-enforcer_MENFORCER-294-IBUS6H5LUW3LLGQ77JNQBEL74UE2BN3AO433QECSA2A76NFISVIQ/m/maven-enforcer-plugin/target/it/require-plugin-versions-mm-ci-friendly/build.log, /home/jenkins/jenkins-slave/workspace/aven-enforcer_MENFORCER-294-IBUS6H5LUW3LLGQ77JNQBEL74UE2BN3AO433QECSA2A76NFISVIQ/m/maven-enforcer-plugin/target/it/require-plugin-versions-plugin-with-extensions/build.log, /home/jenkins/jenkins-slave/workspace/aven-enforcer_MENFORCER-294-IBUS6H5LUW3LLGQ77JNQBEL74UE2BN3AO433QECSA2A76NFISVIQ/m/maven-enforcer-plugin/target/it/require-plugin-versions-plugin-with-integration-test-lifecycle/build.log, /home/jenkins/jenkins-slave/workspace/aven-enforcer_MENFORCER-294-IBUS6H5LUW3LLGQ77JNQBEL74UE2BN3AO433QECSA2A76NFISVIQ/m/maven-enforcer-plugin/target/it/require-plugin-versions-projectGAVexpressions/build.log, /home/jenkins/jenkins-slave/workspace/aven-enforcer_MENFORCER-294-IBUS6H5LUW3LLGQ77JNQBEL74UE2BN3AO433QECSA2A76NFISVIQ/m/maven-enforcer-plugin/target/it/require-plugin-versions/build.log, /home/jenkins/jenkins-slave/workspace/aven-enforcer_MENFORCER-294-IBUS6H5LUW3LLGQ77JNQBEL74UE2BN3AO433QECSA2A76NFISVIQ/m/maven-enforcer-plugin/target/it/require-profile-ids-exist_failure/build.log, /home/jenkins/jenkins-slave/workspace/aven-enforcer_MENFORCER-294-IBUS6H5LUW3LLGQ77JNQBEL74UE2BN3AO433QECSA2A76NFISVIQ/m/maven-enforcer-plugin/target/it/require-profile-ids-exist_success/build.log, /home/jenkins/jenkins-slave/workspace/aven-enforcer_MENFORCER-294-IBUS6H5LUW3LLGQ77JNQBEL74UE2BN3AO433QECSA2A76NFISVIQ/m/maven-enforcer-plugin/target/it/require-property/build.log, /home/jenkins/jenkins-slave/workspace/aven-enforcer_MENFORCER-294-IBUS6H5LUW3LLGQ77JNQBEL74UE2BN3AO433QECSA2A76NFISVIQ/m/maven-enforcer-plugin/target/it/require-release-dependencies-excludes/build.log, /home/jenkins/jenkins-slave/workspace/aven-enforcer_MENFORCER-294-IBUS6H5LUW3LLGQ77JNQBEL74UE2BN3AO433QECSA2A76NFISVIQ/m/maven-enforcer-plugin/target/it/require-release-dependencies-excludes_failure/build.log, /home/jenkins/jenkins-slave/workspace/aven-enforcer_MENFORCER-294-IBUS6H5LUW3LLGQ77JNQBEL74UE2BN3AO433QECSA2A76NFISVIQ/m/maven-enforcer-plugin/target/it/require-release-dependencies/build.log, /home/jenkins/jenkins-slave/workspace/aven-enforcer_MENFORCER-294-IBUS6H5LUW3LLGQ77JNQBEL74UE2BN3AO433QECSA2A76NFISVIQ/m/maven-enforcer-plugin/target/it/require-release-version/build.log, /home/jenkins/jenkins-slave/workspace/aven-enforcer_MENFORCER-294-IBUS6H5LUW3LLGQ77JNQBEL74UE2BN3AO433QECSA2A76NFISVIQ/m/maven-enforcer-plugin/target/it/require-same-versions_failure/build.log, /home/jenkins/jenkins-slave/workspace/aven-enforcer_MENFORCER-294-IBUS6H5LUW3LLGQ77JNQBEL74UE2BN3AO433QECSA2A76NFISVIQ/m/maven-enforcer-plugin/target/it/require-same-versions_success/build.log, /home/jenkins/jenkins-slave/workspace/aven-enforcer_MENFORCER-294-IBUS6H5LUW3LLGQ77JNQBEL74UE2BN3AO433QECSA2A76NFISVIQ/m/maven-enforcer-plugin/target/it/require-snapshot-version_failure/build.log, /home/jenkins/jenkins-slave/workspace/aven-enforcer_MENFORCER-294-IBUS6H5LUW3LLGQ77JNQBEL74UE2BN3AO433QECSA2A76NFISVIQ/m/maven-enforcer-plugin/target/it/require-snapshot-version_success/build.log, /home/jenkins/jenkins-slave/workspace/aven-enforcer_MENFORCER-294-IBUS6H5LUW3LLGQ77JNQBEL74UE2BN3AO433QECSA2A76NFISVIQ/m/maven-enforcer-plugin/target/it/require-upper-bound-dependencies-managed_failure/build.log, /home/jenkins/jenkins-slave/workspace/aven-enforcer_MENFORCER-294-IBUS6H5LUW3LLGQ77JNQBEL74UE2BN3AO433QECSA2A76NFISVIQ/m/maven-enforcer-plugin/target/it/require-upper-bound-dependencies-managed_success/build.log, /home/jenkins/jenkins-slave/workspace/aven-enforcer_MENFORCER-294-IBUS6H5LUW3LLGQ77JNQBEL74UE2BN3AO433QECSA2A76NFISVIQ/m/maven-enforcer-plugin/target/it/require-upper-bound-dependencies-unique_failure/build.log, /home/jenkins/jenkins-slave/workspace/aven-enforcer_MENFORCER-294-IBUS6H5LUW3LLGQ77JNQBEL74UE2BN3AO433QECSA2A76NFISVIQ/m/maven-enforcer-plugin/target/it/require-upper-bound-dependencies-unique_success/build.log, /home/jenkins/jenkins-slave/workspace/aven-enforcer_MENFORCER-294-IBUS6H5LUW3LLGQ77JNQBEL74UE2BN3AO433QECSA2A76NFISVIQ/m/maven-enforcer-plugin/target/it/require-upper-bound-deps_failure/build.log, /home/jenkins/jenkins-slave/workspace/aven-enforcer_MENFORCER-294-IBUS6H5LUW3LLGQ77JNQBEL74UE2BN3AO433QECSA2A76NFISVIQ/m/maven-enforcer-plugin/target/it/require-upper-bound-deps_ignored/build.log, /home/jenkins/jenkins-slave/workspace/aven-enforcer_MENFORCER-294-IBUS6H5LUW3LLGQ77JNQBEL74UE2BN3AO433QECSA2A76NFISVIQ/m/maven-enforcer-plugin/target/it/require-upper-bound-deps_success/build.log, /home/jenkins/jenkins-slave/workspace/aven-enforcer_MENFORCER-294-IBUS6H5LUW3LLGQ77JNQBEL74UE2BN3AO433QECSA2A76NFISVIQ/m/maven-enforcer-plugin/target/it/resolve_collect_dependencies/build.log]
[linux-jdk9] Finished parsing Maven Invoker results (found 68)
[linux-jdk9] [withMaven] junitPublisher - Archive test results for Maven artifact org.apache.maven.enforcer:enforcer-api:3.0.0-SNAPSHOT generated by maven-surefire-plugin:test (default-test): m/enforcer-api/target/surefire-reports/*.xml
[linux-jdk9] Recording test results
[linux-jdk9] None of the test reports contained any result
[linux-jdk9] [withMaven] junitPublisher - Archive test results for Maven artifact org.apache.maven.enforcer:enforcer-rules:3.0.0-SNAPSHOT generated by maven-surefire-plugin:test (default-test): m/enforcer-rules/target/surefire-reports/*.xml
[linux-jdk9] Recording test results
[linux-jdk9] [withMaven] junitPublisher - Archive test results for Maven artifact org.apache.maven.plugins:maven-enforcer-plugin:3.0.0-SNAPSHOT generated by maven-surefire-plugin:test (default-test): m/maven-enforcer-plugin/target/surefire-reports/*.xml
[linux-jdk9] Recording test results
[Pipeline] [linux-jdk9] // withMaven
[Pipeline] [windows-jdk9] }
[Pipeline] [windows-jdk10] }
[Pipeline] [linux-jdk8] }
[Pipeline] [linux-jdk9] cleanWs
[Pipeline] [windows-jdk9] // dir
[Pipeline] [windows-jdk10] // stage
[Pipeline] [linux-jdk8] // dir
[linux-jdk10] [INFO]           require-active-profile-all/pom.xml ............... SUCCESS (4.6 s)
[linux-jdk10] [INFO] Building: require-same-versions_failure/pom.xml
[linux-jdk9] [WS-CLEANUP] Deleting project workspace...[WS-CLEANUP] done
[linux-jdk10] [INFO]           require-same-versions_failure/pom.xml ............ SUCCESS (4.2 s)
[linux-jdk10] [INFO] Building: banned-dependencies-versionrange/pom.xml
[linux-jdk10] [INFO]           banned-dependencies-versionrange/pom.xml ......... SUCCESS (3.9 s)
[linux-jdk10] [INFO] Building: ban-transitive-dependencies/pom.xml
[linux-jdk10] [INFO]           ban-transitive-dependencies/pom.xml .............. SUCCESS (4.2 s)
[linux-jdk10] [INFO] Building: require-no-repositories_mm/pom.xml
[linux-jdk10] [INFO]           require-no-repositories_mm/pom.xml ............... SUCCESS (4.2 s)
[linux-jdk10] [INFO] Building: require-upper-bound-deps_ignored/pom.xml
[linux-jdk10] [INFO] run post-build script verify.groovy
[linux-jdk10] [INFO]           require-upper-bound-deps_ignored/pom.xml ......... SUCCESS (4.3 s)
[linux-jdk10] [INFO] Building: require-no-repositories/pom.xml
[linux-jdk10] [INFO]           require-no-repositories/pom.xml .................. SUCCESS (5.0 s)
[linux-jdk10] [INFO] Building: require-property/pom.xml
[linux-jdk10] [INFO]           require-property/pom.xml ......................... SUCCESS (4.1 s)
[linux-jdk10] [INFO] Building: require-no-repositories-allow-plugin-repo/pom.xml
[linux-jdk10] [INFO] run post-build script verify.groovy
[linux-jdk10] [INFO]           require-no-repositories-allow-plugin-repo/pom.xml  SUCCESS (4.1 s)
[linux-jdk10] [INFO] Building: require-plugin-versions-plugin-with-extensions/pom.xml
[linux-jdk10] [INFO]           require-plugin-versions-plugin-with-extensions/pom.xml SUCCESS (5.6 s)
[linux-jdk10] [INFO] Building: require-files-exist/pom.xml
[linux-jdk10] [INFO]           require-files-exist/pom.xml ...................... SUCCESS (4.1 s)
[linux-jdk10] [INFO] Building: always-fail/pom.xml
[linux-jdk10] [INFO]           always-fail/pom.xml .............................. SUCCESS (4.1 s)
[linux-jdk10] [INFO] Building: require-file-checksum/pom.xml
[linux-jdk10] [INFO] run pre-build script setup.groovy
[linux-jdk10] [INFO]           require-file-checksum/pom.xml .................... SUCCESS (4.2 s)
[linux-jdk10] [INFO] Building: require-java-version/pom.xml
[linux-jdk10] [INFO]           require-java-version/pom.xml ..................... SUCCESS (4.2 s)
[linux-jdk10] [INFO] Building: require-upper-bound-dependencies-unique_success/pom.xml
[Pipeline] [windows-jdk10] }
[Pipeline] [windows-jdk9] }
[windows-jdk9] [withMaven] invokerPublisher - Archive invoker results for Maven artifact MavenArtifact{org.apache.maven.plugins:maven-enforcer-plugin::3.0.0-SNAPSHOT(version: 3.0.0-SNAPSHOT, snapshot:false) } generated by PluginInvocation{org.apache.maven.plugins:maven-invoker-plugin:3.0.1@run  integration-test}: m\maven-enforcer-plugin\target\invoker-reports\*.xml
[windows-jdk9] performing MavenInvokerRecorder, reportsFilenamePattern:'**/m\maven-enforcer-plugin\target\invoker-reports/BUILD*.xml', invokerBuildDir:'**/m\maven-enforcer-plugin\target\it'
[windows-jdk9] Found reports:[f:\jenkins\jenkins-slave\workspace\aven-enforcer_MENFORCER-294-IBUS6H5LUW3LLGQ77JNQBEL74UE2BN3AO433QECSA2A76NFISVIQ\m\maven-enforcer-plugin\target\invoker-reports\BUILD-always-fail-warn.xml, f:\jenkins\jenkins-slave\workspace\aven-enforcer_MENFORCER-294-IBUS6H5LUW3LLGQ77JNQBEL74UE2BN3AO433QECSA2A76NFISVIQ\m\maven-enforcer-plugin\target\invoker-reports\BUILD-always-fail.xml, f:\jenkins\jenkins-slave\workspace\aven-enforcer_MENFORCER-294-IBUS6H5LUW3LLGQ77JNQBEL74UE2BN3AO433QECSA2A76NFISVIQ\m\maven-enforcer-plugin\target\invoker-reports\BUILD-always-pass.xml, f:\jenkins\jenkins-slave\workspace\aven-enforcer_MENFORCER-294-IBUS6H5LUW3LLGQ77JNQBEL74UE2BN3AO433QECSA2A76NFISVIQ\m\maven-enforcer-plugin\target\invoker-reports\BUILD-ban-distribution-management-multi-module-build.xml, f:\jenkins\jenkins-slave\workspace\aven-enforcer_MENFORCER-294-IBUS6H5LUW3LLGQ77JNQBEL74UE2BN3AO433QECSA2A76NFISVIQ\m\maven-enforcer-plugin\target\invoker-reports\BUILD-ban-distribution-management-multi-module-except-site.xml, f:\jenkins\jenkins-slave\workspace\aven-enforcer_MENFORCER-294-IBUS6H5LUW3LLGQ77JNQBEL74UE2BN3AO433QECSA2A76NFISVIQ\m\maven-enforcer-plugin\target\invoker-reports\BUILD-ban-distribution-management.xml, f:\jenkins\jenkins-slave\workspace\aven-enforcer_MENFORCER-294-IBUS6H5LUW3LLGQ77JNQBEL74UE2BN3AO433QECSA2A76NFISVIQ\m\maven-enforcer-plugin\target\invoker-reports\BUILD-ban-pom-dependency-version.xml, f:\jenkins\jenkins-slave\workspace\aven-enforcer_MENFORCER-294-IBUS6H5LUW3LLGQ77JNQBEL74UE2BN3AO433QECSA2A76NFISVIQ\m\maven-enforcer-plugin\target\invoker-reports\BUILD-ban-transitive-dependencies-fail.xml, f:\jenkins\jenkins-slave\workspace\aven-enforcer_MENFORCER-294-IBUS6H5LUW3LLGQ77JNQBEL74UE2BN3AO433QECSA2A76NFISVIQ\m\maven-enforcer-plugin\target\invoker-reports\BUILD-ban-transitive-dependencies.xml, f:\jenkins\jenkins-slave\workspace\aven-enforcer_MENFORCER-294-IBUS6H5LUW3LLGQ77JNQBEL74UE2BN3AO433QECSA2A76NFISVIQ\m\maven-enforcer-plugin\target\invoker-reports\BUILD-banned-dependencies-versionrange-fail.xml, f:\jenkins\jenkins-slave\workspace\aven-enforcer_MENFORCER-294-IBUS6H5LUW3LLGQ77JNQBEL74UE2BN3AO433QECSA2A76NFISVIQ\m\maven-enforcer-plugin\target\invoker-reports\BUILD-banned-dependencies-versionrange.xml, f:\jenkins\jenkins-slave\workspace\aven-enforcer_MENFORCER-294-IBUS6H5LUW3LLGQ77JNQBEL74UE2BN3AO433QECSA2A76NFISVIQ\m\maven-enforcer-plugin\target\invoker-reports\BUILD-banned-dependencies-wildcards.xml, f:\jenkins\jenkins-slave\workspace\aven-enforcer_MENFORCER-294-IBUS6H5LUW3LLGQ77JNQBEL74UE2BN3AO433QECSA2A76NFISVIQ\m\maven-enforcer-plugin\target\invoker-reports\BUILD-banned-dependencies.xml, f:\jenkins\jenkins-slave\workspace\aven-enforcer_MENFORCER-294-IBUS6H5LUW3LLGQ77JNQBEL74UE2BN3AO433QECSA2A76NFISVIQ\m\maven-enforcer-plugin\target\invoker-reports\BUILD-banned-plugins.xml, f:\jenkins\jenkins-slave\workspace\aven-enforcer_MENFORCER-294-IBUS6H5LUW3LLGQ77JNQBEL74UE2BN3AO433QECSA2A76NFISVIQ\m\maven-enforcer-plugin\target\invoker-reports\BUILD-builds_a_pom_noop.xml, f:\jenkins\jenkins-slave\workspace\aven-enforcer_MENFORCER-294-IBUS6H5LUW3LLGQ77JNQBEL74UE2BN3AO433QECSA2A76NFISVIQ\m\maven-enforcer-plugin\target\invoker-reports\BUILD-cli-always-fail.xml, f:\jenkins\jenkins-slave\workspace\aven-enforcer_MENFORCER-294-IBUS6H5LUW3LLGQ77JNQBEL74UE2BN3AO433QECSA2A76NFISVIQ\m\maven-enforcer-plugin\target\invoker-reports\BUILD-cli-always-pass.xml, f:\jenkins\jenkins-slave\workspace\aven-enforcer_MENFORCER-294-IBUS6H5LUW3LLGQ77JNQBEL74UE2BN3AO433QECSA2A76NFISVIQ\m\maven-enforcer-plugin\target\invoker-reports\BUILD-dependencies_converge.xml, f:\jenkins\jenkins-slave\workspace\aven-enforcer_MENFORCER-294-IBUS6H5LUW3LLGQ77JNQBEL74UE2BN3AO433QECSA2A76NFISVIQ\m\maven-enforcer-plugin\target\invoker-reports\BUILD-dependencies_not_converging.xml, f:\jenkins\jenkins-slave\workspace\aven-enforcer_MENFORCER-294-IBUS6H5LUW3LLGQ77JNQBEL74UE2BN3AO433QECSA2A76NFISVIQ\m\maven-enforcer-plugin\target\invoker-reports\BUILD-dependencies_not_converging_test_scope.xml, f:\jenkins\jenkins-slave\workspace\aven-enforcer_MENFORCER-294-IBUS6H5LUW3LLGQ77JNQBEL74UE2BN3AO433QECSA2A76NFISVIQ\m\maven-enforcer-plugin\target\invoker-reports\BUILD-display-info.xml, f:\jenkins\jenkins-slave\workspace\aven-enforcer_MENFORCER-294-IBUS6H5LUW3LLGQ77JNQBEL74UE2BN3AO433QECSA2A76NFISVIQ\m\maven-enforcer-plugin\target\invoker-reports\BUILD-evaluate-beanshell.xml, f:\jenkins\jenkins-slave\workspace\aven-enforcer_MENFORCER-294-IBUS6H5LUW3LLGQ77JNQBEL74UE2BN3AO433QECSA2A76NFISVIQ\m\maven-enforcer-plugin\target\invoker-reports\BUILD-multimodule.xml, f:\jenkins\jenkins-slave\workspace\aven-enforcer_MENFORCER-294-IBUS6H5LUW3LLGQ77JNQBEL74UE2BN3AO433QECSA2A76NFISVIQ\m\maven-enforcer-plugin\target\invoker-reports\BUILD-require-active-profile-all.xml, f:\jenkins\jenkins-slave\workspace\aven-enforcer_MENFORCER-294-IBUS6H5LUW3LLGQ77JNQBEL74UE2BN3AO433QECSA2A76NFISVIQ\m\maven-enforcer-plugin\target\invoker-reports\BUILD-require-active-profile-from-settings.xml, f:\jenkins\jenkins-slave\workspace\aven-enforcer_MENFORCER-294-IBUS6H5LUW3LLGQ77JNQBEL74UE2BN3AO433QECSA2A76NFISVIQ\m\maven-enforcer-plugin\target\invoker-reports\BUILD-require-active-profile.xml, f:\jenkins\jenkins-slave\workspace\aven-enforcer_MENFORCER-294-IBUS6H5LUW3LLGQ77JNQBEL74UE2BN3AO433QECSA2A76NFISVIQ\m\maven-enforcer-plugin\target\invoker-reports\BUILD-require-file-checksum.xml, f:\jenkins\jenkins-slave\workspace\aven-enforcer_MENFORCER-294-IBUS6H5LUW3LLGQ77JNQBEL74UE2BN3AO433QECSA2A76NFISVIQ\m\maven-enforcer-plugin\target\invoker-reports\BUILD-require-files-dont-exist.xml, f:\jenkins\jenkins-slave\workspace\aven-enforcer_MENFORCER-294-IBUS6H5LUW3LLGQ77JNQBEL74UE2BN3AO433QECSA2A76NFISVIQ\m\maven-enforcer-plugin\target\invoker-reports\BUILD-require-files-exist.xml, f:\jenkins\jenkins-slave\workspace\aven-enforcer_MENFORCER-294-IBUS6H5LUW3LLGQ77JNQBEL74UE2BN3AO433QECSA2A76NFISVIQ\m\maven-enforcer-plugin\target\invoker-reports\BUILD-require-files-size.xml, f:\jenkins\jenkins-slave\workspace\aven-enforcer_MENFORCER-294-IBUS6H5LUW3LLGQ77JNQBEL74UE2BN3AO433QECSA2A76NFISVIQ\m\maven-enforcer-plugin\target\invoker-reports\BUILD-require-java-version.xml, f:\jenkins\jenkins-slave\workspace\aven-enforcer_MENFORCER-294-IBUS6H5LUW3LLGQ77JNQBEL74UE2BN3AO433QECSA2A76NFISVIQ\m\maven-enforcer-plugin\target\invoker-reports\BUILD-require-maven-version.xml, f:\jenkins\jenkins-slave\workspace\aven-enforcer_MENFORCER-294-IBUS6H5LUW3LLGQ77JNQBEL74UE2BN3AO433QECSA2A76NFISVIQ\m\maven-enforcer-plugin\target\invoker-reports\BUILD-require-no-repositories-allow-plugin-repo.xml, f:\jenkins\jenkins-slave\workspace\aven-enforcer_MENFORCER-294-IBUS6H5LUW3LLGQ77JNQBEL74UE2BN3AO433QECSA2A76NFISVIQ\m\maven-enforcer-plugin\target\invoker-reports\BUILD-require-no-repositories-allow-repo.xml, f:\jenkins\jenkins-slave\workspace\aven-enforcer_MENFORCER-294-IBUS6H5LUW3LLGQ77JNQBEL74UE2BN3AO433QECSA2A76NFISVIQ\m\maven-enforcer-plugin\target\invoker-reports\BUILD-require-no-repositories.xml, f:\jenkins\jenkins-slave\workspace\aven-enforcer_MENFORCER-294-IBUS6H5LUW3LLGQ77JNQBEL74UE2BN3AO433QECSA2A76NFISVIQ\m\maven-enforcer-plugin\target\invoker-reports\BUILD-require-no-repositories_failure.xml, f:\jenkins\jenkins-slave\workspace\aven-enforcer_MENFORCER-294-IBUS6H5LUW3LLGQ77JNQBEL74UE2BN3AO433QECSA2A76NFISVIQ\m\maven-enforcer-plugin\target\invoker-reports\BUILD-require-no-repositories_failure_allowed-plugin-repo.xml, f:\jenkins\jenkins-slave\workspace\aven-enforcer_MENFORCER-294-IBUS6H5LUW3LLGQ77JNQBEL74UE2BN3AO433QECSA2A76NFISVIQ\m\maven-enforcer-plugin\target\invoker-reports\BUILD-require-no-repositories_failure_plugin-repositories.xml, f:\jenkins\jenkins-slave\workspace\aven-enforcer_MENFORCER-294-IBUS6H5LUW3LLGQ77JNQBEL74UE2BN3AO433QECSA2A76NFISVIQ\m\maven-enforcer-plugin\target\invoker-reports\BUILD-require-no-repositories_failure_repositories.xml, f:\jenkins\jenkins-slave\workspace\aven-enforcer_MENFORCER-294-IBUS6H5LUW3LLGQ77JNQBEL74UE2BN3AO433QECSA2A76NFISVIQ\m\maven-enforcer-plugin\target\invoker-reports\BUILD-require-no-repositories_mm.xml, f:\jenkins\jenkins-slave\workspace\aven-enforcer_MENFORCER-294-IBUS6H5LUW3LLGQ77JNQBEL74UE2BN3AO433QECSA2A76NFISVIQ\m\maven-enforcer-plugin\target\invoker-reports\BUILD-require-no-repositories_mm_ci.xml, f:\jenkins\jenkins-slave\workspace\aven-enforcer_MENFORCER-294-IBUS6H5LUW3LLGQ77JNQBEL74UE2BN3AO433QECSA2A76NFISVIQ\m\maven-enforcer-plugin\target\invoker-reports\BUILD-require-plugin-versions-ci.xml, f:\jenkins\jenkins-slave\workspace\aven-enforcer_MENFORCER-294-IBUS6H5LUW3LLGQ77JNQBEL74UE2BN3AO433QECSA2A76NFISVIQ\m\maven-enforcer-plugin\target\invoker-reports\BUILD-require-plugin-versions-custom-packaging.xml, f:\jenkins\jenkins-slave\workspace\aven-enforcer_MENFORCER-294-IBUS6H5LUW3LLGQ77JNQBEL74UE2BN3AO433QECSA2A76NFISVIQ\m\maven-enforcer-plugin\target\invoker-reports\BUILD-require-plugin-versions-expressions.xml, f:\jenkins\jenkins-slave\workspace\aven-enforcer_MENFORCER-294-IBUS6H5LUW3LLGQ77JNQBEL74UE2BN3AO433QECSA2A76NFISVIQ\m\maven-enforcer-plugin\target\invoker-reports\BUILD-require-plugin-versions-mm-ci-friendly.xml, f:\jenkins\jenkins-slave\workspace\aven-enforcer_MENFORCER-294-IBUS6H5LUW3LLGQ77JNQBEL74UE2BN3AO433QECSA2A76NFISVIQ\m\maven-enforcer-plugin\target\invoker-reports\BUILD-require-plugin-versions-plugin-with-extensions.xml, f:\jenkins\jenkins-slave\workspace\aven-enforcer_MENFORCER-294-IBUS6H5LUW3LLGQ77JNQBEL74UE2BN3AO433QECSA2A76NFISVIQ\m\maven-enforcer-plugin\target\invoker-reports\BUILD-require-plugin-versions-plugin-with-integration-test-lifecycle.xml, f:\jenkins\jenkins-slave\workspace\aven-enforcer_MENFORCER-294-IBUS6H5LUW3LLGQ77JNQBEL74UE2BN3AO433QECSA2A76NFISVIQ\m\maven-enforcer-plugin\target\invoker-reports\BUILD-require-plugin-versions-projectGAVexpressions.xml, f:\jenkins\jenkins-slave\workspace\aven-enforcer_MENFORCER-294-IBUS6H5LUW3LLGQ77JNQBEL74UE2BN3AO433QECSA2A76NFISVIQ\m\maven-enforcer-plugin\target\invoker-reports\BUILD-require-plugin-versions.xml, f:\jenkins\jenkins-slave\workspace\aven-enforcer_MENFORCER-294-IBUS6H5LUW3LLGQ77JNQBEL74UE2BN3AO433QECSA2A76NFISVIQ\m\maven-enforcer-plugin\target\invoker-reports\BUILD-require-profile-ids-exist_failure.xml, f:\jenkins\jenkins-slave\workspace\aven-enforcer_MENFORCER-294-IBUS6H5LUW3LLGQ77JNQBEL74UE2BN3AO433QECSA2A76NFISVIQ\m\maven-enforcer-plugin\target\invoker-reports\BUILD-require-profile-ids-exist_success.xml, f:\jenkins\jenkins-slave\workspace\aven-enforcer_MENFORCER-294-IBUS6H5LUW3LLGQ77JNQBEL74UE2BN3AO433QECSA2A76NFISVIQ\m\maven-enforcer-plugin\target\invoker-reports\BUILD-require-property.xml, f:\jenkins\jenkins-slave\workspace\aven-enforcer_MENFORCER-294-IBUS6H5LUW3LLGQ77JNQBEL74UE2BN3AO433QECSA2A76NFISVIQ\m\maven-enforcer-plugin\target\invoker-reports\BUILD-require-release-dependencies-excludes.xml, f:\jenkins\jenkins-slave\workspace\aven-enforcer_MENFORCER-294-IBUS6H5LUW3LLGQ77JNQBEL74UE2BN3AO433QECSA2A76NFISVIQ\m\maven-enforcer-plugin\target\invoker-reports\BUILD-require-release-dependencies-excludes_failure.xml, f:\jenkins\jenkins-slave\workspace\aven-enforcer_MENFORCER-294-IBUS6H5LUW3LLGQ77JNQBEL74UE2BN3AO433QECSA2A76NFISVIQ\m\maven-enforcer-plugin\target\invoker-reports\BUILD-require-release-dependencies.xml, f:\jenkins\jenkins-slave\workspace\aven-enforcer_MENFORCER-294-IBUS6H5LUW3LLGQ77JNQBEL74UE2BN3AO433QECSA2A76NFISVIQ\m\maven-enforcer-plugin\target\invoker-reports\BUILD-require-release-version.xml, f:\jenkins\jenkins-slave\workspace\aven-enforcer_MENFORCER-294-IBUS6H5LUW3LLGQ77JNQBEL74UE2BN3AO433QECSA2A76NFISVIQ\m\maven-enforcer-plugin\target\invoker-reports\BUILD-require-same-versions_failure.xml, f:\jenkins\jenkins-slave\workspace\aven-enforcer_MENFORCER-294-IBUS6H5LUW3LLGQ77JNQBEL74UE2BN3AO433QECSA2A76NFISVIQ\m\maven-enforcer-plugin\target\invoker-reports\BUILD-require-same-versions_success.xml, f:\jenkins\jenkins-slave\workspace\aven-enforcer_MENFORCER-294-IBUS6H5LUW3LLGQ77JNQBEL74UE2BN3AO433QECSA2A76NFISVIQ\m\maven-enforcer-plugin\target\invoker-reports\BUILD-require-snapshot-version_failure.xml, f:\jenkins\jenkins-slave\workspace\aven-enforcer_MENFORCER-294-IBUS6H5LUW3LLGQ77JNQBEL74UE2BN3AO433QECSA2A76NFISVIQ\m\maven-enforcer-plugin\target\invoker-reports\BUILD-require-snapshot-version_success.xml, f:\jenkins\jenkins-slave\workspace\aven-enforcer_MENFORCER-294-IBUS6H5LUW3LLGQ77JNQBEL74UE2BN3AO433QECSA2A76NFISVIQ\m\maven-enforcer-plugin\target\invoker-reports\BUILD-require-upper-bound-dependencies-managed_failure.xml, f:\jenkins\jenkins-slave\workspace\aven-enforcer_MENFORCER-294-IBUS6H5LUW3LLGQ77JNQBEL74UE2BN3AO433QECSA2A76NFISVIQ\m\maven-enforcer-plugin\target\invoker-reports\BUILD-require-upper-bound-dependencies-managed_success.xml, f:\jenkins\jenkins-slave\workspace\aven-enforcer_MENFORCER-294-IBUS6H5LUW3LLGQ77JNQBEL74UE2BN3AO433QECSA2A76NFISVIQ\m\maven-enforcer-plugin\target\invoker-reports\BUILD-require-upper-bound-dependencies-unique_failure.xml, f:\jenkins\jenkins-slave\workspace\aven-enforcer_MENFORCER-294-IBUS6H5LUW3LLGQ77JNQBEL74UE2BN3AO433QECSA2A76NFISVIQ\m\maven-enforcer-plugin\target\invoker-reports\BUILD-require-upper-bound-dependencies-unique_success.xml, f:\jenkins\jenkins-slave\workspace\aven-enforcer_MENFORCER-294-IBUS6H5LUW3LLGQ77JNQBEL74UE2BN3AO433QECSA2A76NFISVIQ\m\maven-enforcer-plugin\target\invoker-reports\BUILD-require-upper-bound-deps_failure.xml, f:\jenkins\jenkins-slave\workspace\aven-enforcer_MENFORCER-294-IBUS6H5LUW3LLGQ77JNQBEL74UE2BN3AO433QECSA2A76NFISVIQ\m\maven-enforcer-plugin\target\invoker-reports\BUILD-require-upper-bound-deps_ignored.xml, f:\jenkins\jenkins-slave\workspace\aven-enforcer_MENFORCER-294-IBUS6H5LUW3LLGQ77JNQBEL74UE2BN3AO433QECSA2A76NFISVIQ\m\maven-enforcer-plugin\target\invoker-reports\BUILD-require-upper-bound-deps_success.xml, f:\jenkins\jenkins-slave\workspace\aven-enforcer_MENFORCER-294-IBUS6H5LUW3LLGQ77JNQBEL74UE2BN3AO433QECSA2A76NFISVIQ\m\maven-enforcer-plugin\target\invoker-reports\BUILD-resolve_collect_dependencies.xml]
[windows-jdk9] Found logs:[f:\jenkins\jenkins-slave\workspace\aven-enforcer_MENFORCER-294-IBUS6H5LUW3LLGQ77JNQBEL74UE2BN3AO433QECSA2A76NFISVIQ\m\maven-enforcer-plugin\target\it\always-fail-warn\build.log, f:\jenkins\jenkins-slave\workspace\aven-enforcer_MENFORCER-294-IBUS6H5LUW3LLGQ77JNQBEL74UE2BN3AO433QECSA2A76NFISVIQ\m\maven-enforcer-plugin\target\it\always-fail\build.log, f:\jenkins\jenkins-slave\workspace\aven-enforcer_MENFORCER-294-IBUS6H5LUW3LLGQ77JNQBEL74UE2BN3AO433QECSA2A76NFISVIQ\m\maven-enforcer-plugin\target\it\always-pass\build.log, f:\jenkins\jenkins-slave\workspace\aven-enforcer_MENFORCER-294-IBUS6H5LUW3LLGQ77JNQBEL74UE2BN3AO433QECSA2A76NFISVIQ\m\maven-enforcer-plugin\target\it\ban-distribution-management-multi-module-build\build.log, f:\jenkins\jenkins-slave\workspace\aven-enforcer_MENFORCER-294-IBUS6H5LUW3LLGQ77JNQBEL74UE2BN3AO433QECSA2A76NFISVIQ\m\maven-enforcer-plugin\target\it\ban-distribution-management-multi-module-except-site\build.log, f:\jenkins\jenkins-slave\workspace\aven-enforcer_MENFORCER-294-IBUS6H5LUW3LLGQ77JNQBEL74UE2BN3AO433QECSA2A76NFISVIQ\m\maven-enforcer-plugin\target\it\ban-distribution-management\build.log, f:\jenkins\jenkins-slave\workspace\aven-enforcer_MENFORCER-294-IBUS6H5LUW3LLGQ77JNQBEL74UE2BN3AO433QECSA2A76NFISVIQ\m\maven-enforcer-plugin\target\it\ban-pom-dependency-version\build.log, f:\jenkins\jenkins-slave\workspace\aven-enforcer_MENFORCER-294-IBUS6H5LUW3LLGQ77JNQBEL74UE2BN3AO433QECSA2A76NFISVIQ\m\maven-enforcer-plugin\target\it\ban-transitive-dependencies-fail\build.log, f:\jenkins\jenkins-slave\workspace\aven-enforcer_MENFORCER-294-IBUS6H5LUW3LLGQ77JNQBEL74UE2BN3AO433QECSA2A76NFISVIQ\m\maven-enforcer-plugin\target\it\ban-transitive-dependencies\build.log, f:\jenkins\jenkins-slave\workspace\aven-enforcer_MENFORCER-294-IBUS6H5LUW3LLGQ77JNQBEL74UE2BN3AO433QECSA2A76NFISVIQ\m\maven-enforcer-plugin\target\it\banned-dependencies-versionrange-fail\build.log, f:\jenkins\jenkins-slave\workspace\aven-enforcer_MENFORCER-294-IBUS6H5LUW3LLGQ77JNQBEL74UE2BN3AO433QECSA2A76NFISVIQ\m\maven-enforcer-plugin\target\it\banned-dependencies-versionrange\build.log, f:\jenkins\jenkins-slave\workspace\aven-enforcer_MENFORCER-294-IBUS6H5LUW3LLGQ77JNQBEL74UE2BN3AO433QECSA2A76NFISVIQ\m\maven-enforcer-plugin\target\it\banned-dependencies-wildcards\build.log, f:\jenkins\jenkins-slave\workspace\aven-enforcer_MENFORCER-294-IBUS6H5LUW3LLGQ77JNQBEL74UE2BN3AO433QECSA2A76NFISVIQ\m\maven-enforcer-plugin\target\it\banned-dependencies\build.log, f:\jenkins\jenkins-slave\workspace\aven-enforcer_MENFORCER-294-IBUS6H5LUW3LLGQ77JNQBEL74UE2BN3AO433QECSA2A76NFISVIQ\m\maven-enforcer-plugin\target\it\banned-plugins\build.log, f:\jenkins\jenkins-slave\workspace\aven-enforcer_MENFORCER-294-IBUS6H5LUW3LLGQ77JNQBEL74UE2BN3AO433QECSA2A76NFISVIQ\m\maven-enforcer-plugin\target\it\builds_a_pom_noop\build.log, f:\jenkins\jenkins-slave\workspace\aven-enforcer_MENFORCER-294-IBUS6H5LUW3LLGQ77JNQBEL74UE2BN3AO433QECSA2A76NFISVIQ\m\maven-enforcer-plugin\target\it\cli-always-fail\build.log, f:\jenkins\jenkins-slave\workspace\aven-enforcer_MENFORCER-294-IBUS6H5LUW3LLGQ77JNQBEL74UE2BN3AO433QECSA2A76NFISVIQ\m\maven-enforcer-plugin\target\it\cli-always-pass\build.log, f:\jenkins\jenkins-slave\workspace\aven-enforcer_MENFORCER-294-IBUS6H5LUW3LLGQ77JNQBEL74UE2BN3AO433QECSA2A76NFISVIQ\m\maven-enforcer-plugin\target\it\dependencies_converge\build.log, f:\jenkins\jenkins-slave\workspace\aven-enforcer_MENFORCER-294-IBUS6H5LUW3LLGQ77JNQBEL74UE2BN3AO433QECSA2A76NFISVIQ\m\maven-enforcer-plugin\target\it\dependencies_not_converging\build.log, f:\jenkins\jenkins-slave\workspace\aven-enforcer_MENFORCER-294-IBUS6H5LUW3LLGQ77JNQBEL74UE2BN3AO433QECSA2A76NFISVIQ\m\maven-enforcer-plugin\target\it\dependencies_not_converging_test_scope\build.log, f:\jenkins\jenkins-slave\workspace\aven-enforcer_MENFORCER-294-IBUS6H5LUW3LLGQ77JNQBEL74UE2BN3AO433QECSA2A76NFISVIQ\m\maven-enforcer-plugin\target\it\display-info\build.log, f:\jenkins\jenkins-slave\workspace\aven-enforcer_MENFORCER-294-IBUS6H5LUW3LLGQ77JNQBEL74UE2BN3AO433QECSA2A76NFISVIQ\m\maven-enforcer-plugin\target\it\evaluate-beanshell\build.log, f:\jenkins\jenkins-slave\workspace\aven-enforcer_MENFORCER-294-IBUS6H5LUW3LLGQ77JNQBEL74UE2BN3AO433QECSA2A76NFISVIQ\m\maven-enforcer-plugin\target\it\multimodule\build.log, f:\jenkins\jenkins-slave\workspace\aven-enforcer_MENFORCER-294-IBUS6H5LUW3LLGQ77JNQBEL74UE2BN3AO433QECSA2A76NFISVIQ\m\maven-enforcer-plugin\target\it\require-active-profile-all\build.log, f:\jenkins\jenkins-slave\workspace\aven-enforcer_MENFORCER-294-IBUS6H5LUW3LLGQ77JNQBEL74UE2BN3AO433QECSA2A76NFISVIQ\m\maven-enforcer-plugin\target\it\require-active-profile-from-settings\build.log, f:\jenkins\jenkins-slave\workspace\aven-enforcer_MENFORCER-294-IBUS6H5LUW3LLGQ77JNQBEL74UE2BN3AO433QECSA2A76NFISVIQ\m\maven-enforcer-plugin\target\it\require-active-profile\build.log, f:\jenkins\jenkins-slave\workspace\aven-enforcer_MENFORCER-294-IBUS6H5LUW3LLGQ77JNQBEL74UE2BN3AO433QECSA2A76NFISVIQ\m\maven-enforcer-plugin\target\it\require-file-checksum\build.log, f:\jenkins\jenkins-slave\workspace\aven-enforcer_MENFORCER-294-IBUS6H5LUW3LLGQ77JNQBEL74UE2BN3AO433QECSA2A76NFISVIQ\m\maven-enforcer-plugin\target\it\require-files-dont-exist\build.log, f:\jenkins\jenkins-slave\workspace\aven-enforcer_MENFORCER-294-IBUS6H5LUW3LLGQ77JNQBEL74UE2BN3AO433QECSA2A76NFISVIQ\m\maven-enforcer-plugin\target\it\require-files-exist\build.log, f:\jenkins\jenkins-slave\workspace\aven-enforcer_MENFORCER-294-IBUS6H5LUW3LLGQ77JNQBEL74UE2BN3AO433QECSA2A76NFISVIQ\m\maven-enforcer-plugin\target\it\require-files-size\build.log, f:\jenkins\jenkins-slave\workspace\aven-enforcer_MENFORCER-294-IBUS6H5LUW3LLGQ77JNQBEL74UE2BN3AO433QECSA2A76NFISVIQ\m\maven-enforcer-plugin\target\it\require-java-version\build.log, f:\jenkins\jenkins-slave\workspace\aven-enforcer_MENFORCER-294-IBUS6H5LUW3LLGQ77JNQBEL74UE2BN3AO433QECSA2A76NFISVIQ\m\maven-enforcer-plugin\target\it\require-maven-version\build.log, f:\jenkins\jenkins-slave\workspace\aven-enforcer_MENFORCER-294-IBUS6H5LUW3LLGQ77JNQBEL74UE2BN3AO433QECSA2A76NFISVIQ\m\maven-enforcer-plugin\target\it\require-no-repositories-allow-plugin-repo\build.log, f:\jenkins\jenkins-slave\workspace\aven-enforcer_MENFORCER-294-IBUS6H5LUW3LLGQ77JNQBEL74UE2BN3AO433QECSA2A76NFISVIQ\m\maven-enforcer-plugin\target\it\require-no-repositories-allow-repo\build.log, f:\jenkins\jenkins-slave\workspace\aven-enforcer_MENFORCER-294-IBUS6H5LUW3LLGQ77JNQBEL74UE2BN3AO433QECSA2A76NFISVIQ\m\maven-enforcer-plugin\target\it\require-no-repositories\build.log, f:\jenkins\jenkins-slave\workspace\aven-enforcer_MENFORCER-294-IBUS6H5LUW3LLGQ77JNQBEL74UE2BN3AO433QECSA2A76NFISVIQ\m\maven-enforcer-plugin\target\it\require-no-repositories_failure\build.log, f:\jenkins\jenkins-slave\workspace\aven-enforcer_MENFORCER-294-IBUS6H5LUW3LLGQ77JNQBEL74UE2BN3AO433QECSA2A76NFISVIQ\m\maven-enforcer-plugin\target\it\require-no-repositories_failure_allowed-plugin-repo\build.log, f:\jenkins\jenkins-slave\workspace\aven-enforcer_MENFORCER-294-IBUS6H5LUW3LLGQ77JNQBEL74UE2BN3AO433QECSA2A76NFISVIQ\m\maven-enforcer-plugin\target\it\require-no-repositories_failure_plugin-repositories\build.log, f:\jenkins\jenkins-slave\workspace\aven-enforcer_MENFORCER-294-IBUS6H5LUW3LLGQ77JNQBEL74UE2BN3AO433QECSA2A76NFISVIQ\m\maven-enforcer-plugin\target\it\require-no-repositories_failure_repositories\build.log, f:\jenkins\jenkins-slave\workspace\aven-enforcer_MENFORCER-294-IBUS6H5LUW3LLGQ77JNQBEL74UE2BN3AO433QECSA2A76NFISVIQ\m\maven-enforcer-plugin\target\it\require-no-repositories_mm\build.log, f:\jenkins\jenkins-slave\workspace\aven-enforcer_MENFORCER-294-IBUS6H5LUW3LLGQ77JNQBEL74UE2BN3AO433QECSA2A76NFISVIQ\m\maven-enforcer-plugin\target\it\require-no-repositories_mm_ci\build.log, f:\jenkins\jenkins-slave\workspace\aven-enforcer_MENFORCER-294-IBUS6H5LUW3LLGQ77JNQBEL74UE2BN3AO433QECSA2A76NFISVIQ\m\maven-enforcer-plugin\target\it\require-plugin-versions-ci\build.log, f:\jenkins\jenkins-slave\workspace\aven-enforcer_MENFORCER-294-IBUS6H5LUW3LLGQ77JNQBEL74UE2BN3AO433QECSA2A76NFISVIQ\m\maven-enforcer-plugin\target\it\require-plugin-versions-custom-packaging\build.log, f:\jenkins\jenkins-slave\workspace\aven-enforcer_MENFORCER-294-IBUS6H5LUW3LLGQ77JNQBEL74UE2BN3AO433QECSA2A76NFISVIQ\m\maven-enforcer-plugin\target\it\require-plugin-versions-expressions\build.log, f:\jenkins\jenkins-slave\workspace\aven-enforcer_MENFORCER-294-IBUS6H5LUW3LLGQ77JNQBEL74UE2BN3AO433QECSA2A76NFISVIQ\m\maven-enforcer-plugin\target\it\require-plugin-versions-mm-ci-friendly\build.log, f:\jenkins\jenkins-slave\workspace\aven-enforcer_MENFORCER-294-IBUS6H5LUW3LLGQ77JNQBEL74UE2BN3AO433QECSA2A76NFISVIQ\m\maven-enforcer-plugin\target\it\require-plugin-versions-plugin-with-extensions\build.log, f:\jenkins\jenkins-slave\workspace\aven-enforcer_MENFORCER-294-IBUS6H5LUW3LLGQ77JNQBEL74UE2BN3AO433QECSA2A76NFISVIQ\m\maven-enforcer-plugin\target\it\require-plugin-versions-plugin-with-integration-test-lifecycle\build.log, f:\jenkins\jenkins-slave\workspace\aven-enforcer_MENFORCER-294-IBUS6H5LUW3LLGQ77JNQBEL74UE2BN3AO433QECSA2A76NFISVIQ\m\maven-enforcer-plugin\target\it\require-plugin-versions-projectGAVexpressions\build.log, f:\jenkins\jenkins-slave\workspace\aven-enforcer_MENFORCER-294-IBUS6H5LUW3LLGQ77JNQBEL74UE2BN3AO433QECSA2A76NFISVIQ\m\maven-enforcer-plugin\target\it\require-plugin-versions\build.log, f:\jenkins\jenkins-slave\workspace\aven-enforcer_MENFORCER-294-IBUS6H5LUW3LLGQ77JNQBEL74UE2BN3AO433QECSA2A76NFISVIQ\m\maven-enforcer-plugin\target\it\require-profile-ids-exist_failure\build.log, f:\jenkins\jenkins-slave\workspace\aven-enforcer_MENFORCER-294-IBUS6H5LUW3LLGQ77JNQBEL74UE2BN3AO433QECSA2A76NFISVIQ\m\maven-enforcer-plugin\target\it\require-profile-ids-exist_success\build.log, f:\jenkins\jenkins-slave\workspace\aven-enforcer_MENFORCER-294-IBUS6H5LUW3LLGQ77JNQBEL74UE2BN3AO433QECSA2A76NFISVIQ\m\maven-enforcer-plugin\target\it\require-property\build.log, f:\jenkins\jenkins-slave\workspace\aven-enforcer_MENFORCER-294-IBUS6H5LUW3LLGQ77JNQBEL74UE2BN3AO433QECSA2A76NFISVIQ\m\maven-enforcer-plugin\target\it\require-release-dependencies-excludes\build.log, f:\jenkins\jenkins-slave\workspace\aven-enforcer_MENFORCER-294-IBUS6H5LUW3LLGQ77JNQBEL74UE2BN3AO433QECSA2A76NFISVIQ\m\maven-enforcer-plugin\target\it\require-release-dependencies-excludes_failure\build.log, f:\jenkins\jenkins-slave\workspace\aven-enforcer_MENFORCER-294-IBUS6H5LUW3LLGQ77JNQBEL74UE2BN3AO433QECSA2A76NFISVIQ\m\maven-enforcer-plugin\target\it\require-release-dependencies\build.log, f:\jenkins\jenkins-slave\workspace\aven-enforcer_MENFORCER-294-IBUS6H5LUW3LLGQ77JNQBEL74UE2BN3AO433QECSA2A76NFISVIQ\m\maven-enforcer-plugin\target\it\require-release-version\build.log, f:\jenkins\jenkins-slave\workspace\aven-enforcer_MENFORCER-294-IBUS6H5LUW3LLGQ77JNQBEL74UE2BN3AO433QECSA2A76NFISVIQ\m\maven-enforcer-plugin\target\it\require-same-versions_failure\build.log, f:\jenkins\jenkins-slave\workspace\aven-enforcer_MENFORCER-294-IBUS6H5LUW3LLGQ77JNQBEL74UE2BN3AO433QECSA2A76NFISVIQ\m\maven-enforcer-plugin\target\it\require-same-versions_success\build.log, f:\jenkins\jenkins-slave\workspace\aven-enforcer_MENFORCER-294-IBUS6H5LUW3LLGQ77JNQBEL74UE2BN3AO433QECSA2A76NFISVIQ\m\maven-enforcer-plugin\target\it\require-snapshot-version_failure\build.log, f:\jenkins\jenkins-slave\workspace\aven-enforcer_MENFORCER-294-IBUS6H5LUW3LLGQ77JNQBEL74UE2BN3AO433QECSA2A76NFISVIQ\m\maven-enforcer-plugin\target\it\require-snapshot-version_success\build.log, f:\jenkins\jenkins-slave\workspace\aven-enforcer_MENFORCER-294-IBUS6H5LUW3LLGQ77JNQBEL74UE2BN3AO433QECSA2A76NFISVIQ\m\maven-enforcer-plugin\target\it\require-upper-bound-dependencies-managed_failure\build.log, f:\jenkins\jenkins-slave\workspace\aven-enforcer_MENFORCER-294-IBUS6H5LUW3LLGQ77JNQBEL74UE2BN3AO433QECSA2A76NFISVIQ\m\maven-enforcer-plugin\target\it\require-upper-bound-dependencies-managed_success\build.log, f:\jenkins\jenkins-slave\workspace\aven-enforcer_MENFORCER-294-IBUS6H5LUW3LLGQ77JNQBEL74UE2BN3AO433QECSA2A76NFISVIQ\m\maven-enforcer-plugin\target\it\require-upper-bound-dependencies-unique_failure\build.log, f:\jenkins\jenkins-slave\workspace\aven-enforcer_MENFORCER-294-IBUS6H5LUW3LLGQ77JNQBEL74UE2BN3AO433QECSA2A76NFISVIQ\m\maven-enforcer-plugin\target\it\require-upper-bound-dependencies-unique_success\build.log, f:\jenkins\jenkins-slave\workspace\aven-enforcer_MENFORCER-294-IBUS6H5LUW3LLGQ77JNQBEL74UE2BN3AO433QECSA2A76NFISVIQ\m\maven-enforcer-plugin\target\it\require-upper-bound-deps_failure\build.log, f:\jenkins\jenkins-slave\workspace\aven-enforcer_MENFORCER-294-IBUS6H5LUW3LLGQ77JNQBEL74UE2BN3AO433QECSA2A76NFISVIQ\m\maven-enforcer-plugin\target\it\require-upper-bound-deps_ignored\build.log, f:\jenkins\jenkins-slave\workspace\aven-enforcer_MENFORCER-294-IBUS6H5LUW3LLGQ77JNQBEL74UE2BN3AO433QECSA2A76NFISVIQ\m\maven-enforcer-plugin\target\it\require-upper-bound-deps_success\build.log, f:\jenkins\jenkins-slave\workspace\aven-enforcer_MENFORCER-294-IBUS6H5LUW3LLGQ77JNQBEL74UE2BN3AO433QECSA2A76NFISVIQ\m\maven-enforcer-plugin\target\it\resolve_collect_dependencies\build.log]
[windows-jdk9] Finished parsing Maven Invoker results (found 68)
[windows-jdk9] [withMaven] junitPublisher - Archive test results for Maven artifact org.apache.maven.enforcer:enforcer-api:3.0.0-SNAPSHOT generated by maven-surefire-plugin:test (default-test): m\enforcer-api\target\surefire-reports\*.xml
[windows-jdk9] Recording test results
[windows-jdk9] None of the test reports contained any result
[windows-jdk9] [withMaven] junitPublisher - Archive test results for Maven artifact org.apache.maven.enforcer:enforcer-rules:3.0.0-SNAPSHOT generated by maven-surefire-plugin:test (default-test): m\enforcer-rules\target\surefire-reports\*.xml
[windows-jdk9] Recording test results
[windows-jdk9] [withMaven] junitPublisher - Archive test results for Maven artifact org.apache.maven.plugins:maven-enforcer-plugin:3.0.0-SNAPSHOT generated by maven-surefire-plugin:test (default-test): m\maven-enforcer-plugin\target\surefire-reports\*.xml
[windows-jdk9] Recording test results
[Pipeline] [linux-jdk8] }
[linux-jdk8] [withMaven] invokerPublisher - Archive invoker results for Maven artifact MavenArtifact{org.apache.maven.plugins:maven-enforcer-plugin::3.0.0-SNAPSHOT(version: 3.0.0-SNAPSHOT, snapshot:false) } generated by PluginInvocation{org.apache.maven.plugins:maven-invoker-plugin:3.0.1@run  integration-test}: m/maven-enforcer-plugin/target/invoker-reports/*.xml
[linux-jdk8] performing MavenInvokerRecorder, reportsFilenamePattern:'**/m/maven-enforcer-plugin/target/invoker-reports/BUILD*.xml', invokerBuildDir:'**/m/maven-enforcer-plugin/target/it'
[linux-jdk8] Found reports:[/home/jenkins/jenkins-slave/workspace/aven-enforcer_MENFORCER-294-IBUS6H5LUW3LLGQ77JNQBEL74UE2BN3AO433QECSA2A76NFISVIQ/m/maven-enforcer-plugin/target/invoker-reports/BUILD-always-fail-warn.xml, /home/jenkins/jenkins-slave/workspace/aven-enforcer_MENFORCER-294-IBUS6H5LUW3LLGQ77JNQBEL74UE2BN3AO433QECSA2A76NFISVIQ/m/maven-enforcer-plugin/target/invoker-reports/BUILD-always-fail.xml, /home/jenkins/jenkins-slave/workspace/aven-enforcer_MENFORCER-294-IBUS6H5LUW3LLGQ77JNQBEL74UE2BN3AO433QECSA2A76NFISVIQ/m/maven-enforcer-plugin/target/invoker-reports/BUILD-always-pass.xml, /home/jenkins/jenkins-slave/workspace/aven-enforcer_MENFORCER-294-IBUS6H5LUW3LLGQ77JNQBEL74UE2BN3AO433QECSA2A76NFISVIQ/m/maven-enforcer-plugin/target/invoker-reports/BUILD-ban-distribution-management-multi-module-build.xml, /home/jenkins/jenkins-slave/workspace/aven-enforcer_MENFORCER-294-IBUS6H5LUW3LLGQ77JNQBEL74UE2BN3AO433QECSA2A76NFISVIQ/m/maven-enforcer-plugin/target/invoker-reports/BUILD-ban-distribution-management-multi-module-except-site.xml, /home/jenkins/jenkins-slave/workspace/aven-enforcer_MENFORCER-294-IBUS6H5LUW3LLGQ77JNQBEL74UE2BN3AO433QECSA2A76NFISVIQ/m/maven-enforcer-plugin/target/invoker-reports/BUILD-ban-distribution-management.xml, /home/jenkins/jenkins-slave/workspace/aven-enforcer_MENFORCER-294-IBUS6H5LUW3LLGQ77JNQBEL74UE2BN3AO433QECSA2A76NFISVIQ/m/maven-enforcer-plugin/target/invoker-reports/BUILD-ban-pom-dependency-version.xml, /home/jenkins/jenkins-slave/workspace/aven-enforcer_MENFORCER-294-IBUS6H5LUW3LLGQ77JNQBEL74UE2BN3AO433QECSA2A76NFISVIQ/m/maven-enforcer-plugin/target/invoker-reports/BUILD-ban-transitive-dependencies-fail.xml, /home/jenkins/jenkins-slave/workspace/aven-enforcer_MENFORCER-294-IBUS6H5LUW3LLGQ77JNQBEL74UE2BN3AO433QECSA2A76NFISVIQ/m/maven-enforcer-plugin/target/invoker-reports/BUILD-ban-transitive-dependencies.xml, /home/jenkins/jenkins-slave/workspace/aven-enforcer_MENFORCER-294-IBUS6H5LUW3LLGQ77JNQBEL74UE2BN3AO433QECSA2A76NFISVIQ/m/maven-enforcer-plugin/target/invoker-reports/BUILD-banned-dependencies-versionrange-fail.xml, /home/jenkins/jenkins-slave/workspace/aven-enforcer_MENFORCER-294-IBUS6H5LUW3LLGQ77JNQBEL74UE2BN3AO433QECSA2A76NFISVIQ/m/maven-enforcer-plugin/target/invoker-reports/BUILD-banned-dependencies-versionrange.xml, /home/jenkins/jenkins-slave/workspace/aven-enforcer_MENFORCER-294-IBUS6H5LUW3LLGQ77JNQBEL74UE2BN3AO433QECSA2A76NFISVIQ/m/maven-enforcer-plugin/target/invoker-reports/BUILD-banned-dependencies-wildcards.xml, /home/jenkins/jenkins-slave/workspace/aven-enforcer_MENFORCER-294-IBUS6H5LUW3LLGQ77JNQBEL74UE2BN3AO433QECSA2A76NFISVIQ/m/maven-enforcer-plugin/target/invoker-reports/BUILD-banned-dependencies.xml, /home/jenkins/jenkins-slave/workspace/aven-enforcer_MENFORCER-294-IBUS6H5LUW3LLGQ77JNQBEL74UE2BN3AO433QECSA2A76NFISVIQ/m/maven-enforcer-plugin/target/invoker-reports/BUILD-banned-plugins.xml, /home/jenkins/jenkins-slave/workspace/aven-enforcer_MENFORCER-294-IBUS6H5LUW3LLGQ77JNQBEL74UE2BN3AO433QECSA2A76NFISVIQ/m/maven-enforcer-plugin/target/invoker-reports/BUILD-builds_a_pom_noop.xml, /home/jenkins/jenkins-slave/workspace/aven-enforcer_MENFORCER-294-IBUS6H5LUW3LLGQ77JNQBEL74UE2BN3AO433QECSA2A76NFISVIQ/m/maven-enforcer-plugin/target/invoker-reports/BUILD-cli-always-fail.xml, /home/jenkins/jenkins-slave/workspace/aven-enforcer_MENFORCER-294-IBUS6H5LUW3LLGQ77JNQBEL74UE2BN3AO433QECSA2A76NFISVIQ/m/maven-enforcer-plugin/target/invoker-reports/BUILD-cli-always-pass.xml, /home/jenkins/jenkins-slave/workspace/aven-enforcer_MENFORCER-294-IBUS6H5LUW3LLGQ77JNQBEL74UE2BN3AO433QECSA2A76NFISVIQ/m/maven-enforcer-plugin/target/invoker-reports/BUILD-dependencies_converge.xml, /home/jenkins/jenkins-slave/workspace/aven-enforcer_MENFORCER-294-IBUS6H5LUW3LLGQ77JNQBEL74UE2BN3AO433QECSA2A76NFISVIQ/m/maven-enforcer-plugin/target/invoker-reports/BUILD-dependencies_not_converging.xml, /home/jenkins/jenkins-slave/workspace/aven-enforcer_MENFORCER-294-IBUS6H5LUW3LLGQ77JNQBEL74UE2BN3AO433QECSA2A76NFISVIQ/m/maven-enforcer-plugin/target/invoker-reports/BUILD-dependencies_not_converging_test_scope.xml, /home/jenkins/jenkins-slave/workspace/aven-enforcer_MENFORCER-294-IBUS6H5LUW3LLGQ77JNQBEL74UE2BN3AO433QECSA2A76NFISVIQ/m/maven-enforcer-plugin/target/invoker-reports/BUILD-display-info.xml, /home/jenkins/jenkins-slave/workspace/aven-enforcer_MENFORCER-294-IBUS6H5LUW3LLGQ77JNQBEL74UE2BN3AO433QECSA2A76NFISVIQ/m/maven-enforcer-plugin/target/invoker-reports/BUILD-evaluate-beanshell.xml, /home/jenkins/jenkins-slave/workspace/aven-enforcer_MENFORCER-294-IBUS6H5LUW3LLGQ77JNQBEL74UE2BN3AO433QECSA2A76NFISVIQ/m/maven-enforcer-plugin/target/invoker-reports/BUILD-multimodule.xml, /home/jenkins/jenkins-slave/workspace/aven-enforcer_MENFORCER-294-IBUS6H5LUW3LLGQ77JNQBEL74UE2BN3AO433QECSA2A76NFISVIQ/m/maven-enforcer-plugin/target/invoker-reports/BUILD-require-active-profile-all.xml, /home/jenkins/jenkins-slave/workspace/aven-enforcer_MENFORCER-294-IBUS6H5LUW3LLGQ77JNQBEL74UE2BN3AO433QECSA2A76NFISVIQ/m/maven-enforcer-plugin/target/invoker-reports/BUILD-require-active-profile-from-settings.xml, /home/jenkins/jenkins-slave/workspace/aven-enforcer_MENFORCER-294-IBUS6H5LUW3LLGQ77JNQBEL74UE2BN3AO433QECSA2A76NFISVIQ/m/maven-enforcer-plugin/target/invoker-reports/BUILD-require-active-profile.xml, /home/jenkins/jenkins-slave/workspace/aven-enforcer_MENFORCER-294-IBUS6H5LUW3LLGQ77JNQBEL74UE2BN3AO433QECSA2A76NFISVIQ/m/maven-enforcer-plugin/target/invoker-reports/BUILD-require-file-checksum.xml, /home/jenkins/jenkins-slave/workspace/aven-enforcer_MENFORCER-294-IBUS6H5LUW3LLGQ77JNQBEL74UE2BN3AO433QECSA2A76NFISVIQ/m/maven-enforcer-plugin/target/invoker-reports/BUILD-require-files-dont-exist.xml, /home/jenkins/jenkins-slave/workspace/aven-enforcer_MENFORCER-294-IBUS6H5LUW3LLGQ77JNQBEL74UE2BN3AO433QECSA2A76NFISVIQ/m/maven-enforcer-plugin/target/invoker-reports/BUILD-require-files-exist.xml, /home/jenkins/jenkins-slave/workspace/aven-enforcer_MENFORCER-294-IBUS6H5LUW3LLGQ77JNQBEL74UE2BN3AO433QECSA2A76NFISVIQ/m/maven-enforcer-plugin/target/invoker-reports/BUILD-require-files-size.xml, /home/jenkins/jenkins-slave/workspace/aven-enforcer_MENFORCER-294-IBUS6H5LUW3LLGQ77JNQBEL74UE2BN3AO433QECSA2A76NFISVIQ/m/maven-enforcer-plugin/target/invoker-reports/BUILD-require-java-version.xml, /home/jenkins/jenkins-slave/workspace/aven-enforcer_MENFORCER-294-IBUS6H5LUW3LLGQ77JNQBEL74UE2BN3AO433QECSA2A76NFISVIQ/m/maven-enforcer-plugin/target/invoker-reports/BUILD-require-maven-version.xml, /home/jenkins/jenkins-slave/workspace/aven-enforcer_MENFORCER-294-IBUS6H5LUW3LLGQ77JNQBEL74UE2BN3AO433QECSA2A76NFISVIQ/m/maven-enforcer-plugin/target/invoker-reports/BUILD-require-no-repositories-allow-plugin-repo.xml, /home/jenkins/jenkins-slave/workspace/aven-enforcer_MENFORCER-294-IBUS6H5LUW3LLGQ77JNQBEL74UE2BN3AO433QECSA2A76NFISVIQ/m/maven-enforcer-plugin/target/invoker-reports/BUILD-require-no-repositories-allow-repo.xml, /home/jenkins/jenkins-slave/workspace/aven-enforcer_MENFORCER-294-IBUS6H5LUW3LLGQ77JNQBEL74UE2BN3AO433QECSA2A76NFISVIQ/m/maven-enforcer-plugin/target/invoker-reports/BUILD-require-no-repositories.xml, /home/jenkins/jenkins-slave/workspace/aven-enforcer_MENFORCER-294-IBUS6H5LUW3LLGQ77JNQBEL74UE2BN3AO433QECSA2A76NFISVIQ/m/maven-enforcer-plugin/target/invoker-reports/BUILD-require-no-repositories_failure.xml, /home/jenkins/jenkins-slave/workspace/aven-enforcer_MENFORCER-294-IBUS6H5LUW3LLGQ77JNQBEL74UE2BN3AO433QECSA2A76NFISVIQ/m/maven-enforcer-plugin/target/invoker-reports/BUILD-require-no-repositories_failure_allowed-plugin-repo.xml, /home/jenkins/jenkins-slave/workspace/aven-enforcer_MENFORCER-294-IBUS6H5LUW3LLGQ77JNQBEL74UE2BN3AO433QECSA2A76NFISVIQ/m/maven-enforcer-plugin/target/invoker-reports/BUILD-require-no-repositories_failure_plugin-repositories.xml, /home/jenkins/jenkins-slave/workspace/aven-enforcer_MENFORCER-294-IBUS6H5LUW3LLGQ77JNQBEL74UE2BN3AO433QECSA2A76NFISVIQ/m/maven-enforcer-plugin/target/invoker-reports/BUILD-require-no-repositories_failure_repositories.xml, /home/jenkins/jenkins-slave/workspace/aven-enforcer_MENFORCER-294-IBUS6H5LUW3LLGQ77JNQBEL74UE2BN3AO433QECSA2A76NFISVIQ/m/maven-enforcer-plugin/target/invoker-reports/BUILD-require-no-repositories_mm.xml, /home/jenkins/jenkins-slave/workspace/aven-enforcer_MENFORCER-294-IBUS6H5LUW3LLGQ77JNQBEL74UE2BN3AO433QECSA2A76NFISVIQ/m/maven-enforcer-plugin/target/invoker-reports/BUILD-require-no-repositories_mm_ci.xml, /home/jenkins/jenkins-slave/workspace/aven-enforcer_MENFORCER-294-IBUS6H5LUW3LLGQ77JNQBEL74UE2BN3AO433QECSA2A76NFISVIQ/m/maven-enforcer-plugin/target/invoker-reports/BUILD-require-plugin-versions-ci.xml, /home/jenkins/jenkins-slave/workspace/aven-enforcer_MENFORCER-294-IBUS6H5LUW3LLGQ77JNQBEL74UE2BN3AO433QECSA2A76NFISVIQ/m/maven-enforcer-plugin/target/invoker-reports/BUILD-require-plugin-versions-custom-packaging.xml, /home/jenkins/jenkins-slave/workspace/aven-enforcer_MENFORCER-294-IBUS6H5LUW3LLGQ77JNQBEL74UE2BN3AO433QECSA2A76NFISVIQ/m/maven-enforcer-plugin/target/invoker-reports/BUILD-require-plugin-versions-expressions.xml, /home/jenkins/jenkins-slave/workspace/aven-enforcer_MENFORCER-294-IBUS6H5LUW3LLGQ77JNQBEL74UE2BN3AO433QECSA2A76NFISVIQ/m/maven-enforcer-plugin/target/invoker-reports/BUILD-require-plugin-versions-mm-ci-friendly.xml, /home/jenkins/jenkins-slave/workspace/aven-enforcer_MENFORCER-294-IBUS6H5LUW3LLGQ77JNQBEL74UE2BN3AO433QECSA2A76NFISVIQ/m/maven-enforcer-plugin/target/invoker-reports/BUILD-require-plugin-versions-plugin-with-extensions.xml, /home/jenkins/jenkins-slave/workspace/aven-enforcer_MENFORCER-294-IBUS6H5LUW3LLGQ77JNQBEL74UE2BN3AO433QECSA2A76NFISVIQ/m/maven-enforcer-plugin/target/invoker-reports/BUILD-require-plugin-versions-plugin-with-integration-test-lifecycle.xml, /home/jenkins/jenkins-slave/workspace/aven-enforcer_MENFORCER-294-IBUS6H5LUW3LLGQ77JNQBEL74UE2BN3AO433QECSA2A76NFISVIQ/m/maven-enforcer-plugin/target/invoker-reports/BUILD-require-plugin-versions-projectGAVexpressions.xml, /home/jenkins/jenkins-slave/workspace/aven-enforcer_MENFORCER-294-IBUS6H5LUW3LLGQ77JNQBEL74UE2BN3AO433QECSA2A76NFISVIQ/m/maven-enforcer-plugin/target/invoker-reports/BUILD-require-plugin-versions.xml, /home/jenkins/jenkins-slave/workspace/aven-enforcer_MENFORCER-294-IBUS6H5LUW3LLGQ77JNQBEL74UE2BN3AO433QECSA2A76NFISVIQ/m/maven-enforcer-plugin/target/invoker-reports/BUILD-require-profile-ids-exist_failure.xml, /home/jenkins/jenkins-slave/workspace/aven-enforcer_MENFORCER-294-IBUS6H5LUW3LLGQ77JNQBEL74UE2BN3AO433QECSA2A76NFISVIQ/m/maven-enforcer-plugin/target/invoker-reports/BUILD-require-profile-ids-exist_success.xml, /home/jenkins/jenkins-slave/workspace/aven-enforcer_MENFORCER-294-IBUS6H5LUW3LLGQ77JNQBEL74UE2BN3AO433QECSA2A76NFISVIQ/m/maven-enforcer-plugin/target/invoker-reports/BUILD-require-property.xml, /home/jenkins/jenkins-slave/workspace/aven-enforcer_MENFORCER-294-IBUS6H5LUW3LLGQ77JNQBEL74UE2BN3AO433QECSA2A76NFISVIQ/m/maven-enforcer-plugin/target/invoker-reports/BUILD-require-release-dependencies-excludes.xml, /home/jenkins/jenkins-slave/workspace/aven-enforcer_MENFORCER-294-IBUS6H5LUW3LLGQ77JNQBEL74UE2BN3AO433QECSA2A76NFISVIQ/m/maven-enforcer-plugin/target/invoker-reports/BUILD-require-release-dependencies-excludes_failure.xml, /home/jenkins/jenkins-slave/workspace/aven-enforcer_MENFORCER-294-IBUS6H5LUW3LLGQ77JNQBEL74UE2BN3AO433QECSA2A76NFISVIQ/m/maven-enforcer-plugin/target/invoker-reports/BUILD-require-release-dependencies.xml, /home/jenkins/jenkins-slave/workspace/aven-enforcer_MENFORCER-294-IBUS6H5LUW3LLGQ77JNQBEL74UE2BN3AO433QECSA2A76NFISVIQ/m/maven-enforcer-plugin/target/invoker-reports/BUILD-require-release-version.xml, /home/jenkins/jenkins-slave/workspace/aven-enforcer_MENFORCER-294-IBUS6H5LUW3LLGQ77JNQBEL74UE2BN3AO433QECSA2A76NFISVIQ/m/maven-enforcer-plugin/target/invoker-reports/BUILD-require-same-versions_failure.xml, /home/jenkins/jenkins-slave/workspace/aven-enforcer_MENFORCER-294-IBUS6H5LUW3LLGQ77JNQBEL74UE2BN3AO433QECSA2A76NFISVIQ/m/maven-enforcer-plugin/target/invoker-reports/BUILD-require-same-versions_success.xml, /home/jenkins/jenkins-slave/workspace/aven-enforcer_MENFORCER-294-IBUS6H5LUW3LLGQ77JNQBEL74UE2BN3AO433QECSA2A76NFISVIQ/m/maven-enforcer-plugin/target/invoker-reports/BUILD-require-snapshot-version_failure.xml, /home/jenkins/jenkins-slave/workspace/aven-enforcer_MENFORCER-294-IBUS6H5LUW3LLGQ77JNQBEL74UE2BN3AO433QECSA2A76NFISVIQ/m/maven-enforcer-plugin/target/invoker-reports/BUILD-require-snapshot-version_success.xml, /home/jenkins/jenkins-slave/workspace/aven-enforcer_MENFORCER-294-IBUS6H5LUW3LLGQ77JNQBEL74UE2BN3AO433QECSA2A76NFISVIQ/m/maven-enforcer-plugin/target/invoker-reports/BUILD-require-upper-bound-dependencies-managed_failure.xml, /home/jenkins/jenkins-slave/workspace/aven-enforcer_MENFORCER-294-IBUS6H5LUW3LLGQ77JNQBEL74UE2BN3AO433QECSA2A76NFISVIQ/m/maven-enforcer-plugin/target/invoker-reports/BUILD-require-upper-bound-dependencies-managed_success.xml, /home/jenkins/jenkins-slave/workspace/aven-enforcer_MENFORCER-294-IBUS6H5LUW3LLGQ77JNQBEL74UE2BN3AO433QECSA2A76NFISVIQ/m/maven-enforcer-plugin/target/invoker-reports/BUILD-require-upper-bound-dependencies-unique_failure.xml, /home/jenkins/jenkins-slave/workspace/aven-enforcer_MENFORCER-294-IBUS6H5LUW3LLGQ77JNQBEL74UE2BN3AO433QECSA2A76NFISVIQ/m/maven-enforcer-plugin/target/invoker-reports/BUILD-require-upper-bound-dependencies-unique_success.xml, /home/jenkins/jenkins-slave/workspace/aven-enforcer_MENFORCER-294-IBUS6H5LUW3LLGQ77JNQBEL74UE2BN3AO433QECSA2A76NFISVIQ/m/maven-enforcer-plugin/target/invoker-reports/BUILD-require-upper-bound-deps_failure.xml, /home/jenkins/jenkins-slave/workspace/aven-enforcer_MENFORCER-294-IBUS6H5LUW3LLGQ77JNQBEL74UE2BN3AO433QECSA2A76NFISVIQ/m/maven-enforcer-plugin/target/invoker-reports/BUILD-require-upper-bound-deps_ignored.xml, /home/jenkins/jenkins-slave/workspace/aven-enforcer_MENFORCER-294-IBUS6H5LUW3LLGQ77JNQBEL74UE2BN3AO433QECSA2A76NFISVIQ/m/maven-enforcer-plugin/target/invoker-reports/BUILD-require-upper-bound-deps_success.xml, /home/jenkins/jenkins-slave/workspace/aven-enforcer_MENFORCER-294-IBUS6H5LUW3LLGQ77JNQBEL74UE2BN3AO433QECSA2A76NFISVIQ/m/maven-enforcer-plugin/target/invoker-reports/BUILD-resolve_collect_dependencies.xml]
[linux-jdk8] Found logs:[/home/jenkins/jenkins-slave/workspace/aven-enforcer_MENFORCER-294-IBUS6H5LUW3LLGQ77JNQBEL74UE2BN3AO433QECSA2A76NFISVIQ/m/maven-enforcer-plugin/target/it/always-fail-warn/build.log, /home/jenkins/jenkins-slave/workspace/aven-enforcer_MENFORCER-294-IBUS6H5LUW3LLGQ77JNQBEL74UE2BN3AO433QECSA2A76NFISVIQ/m/maven-enforcer-plugin/target/it/always-fail/build.log, /home/jenkins/jenkins-slave/workspace/aven-enforcer_MENFORCER-294-IBUS6H5LUW3LLGQ77JNQBEL74UE2BN3AO433QECSA2A76NFISVIQ/m/maven-enforcer-plugin/target/it/always-pass/build.log, /home/jenkins/jenkins-slave/workspace/aven-enforcer_MENFORCER-294-IBUS6H5LUW3LLGQ77JNQBEL74UE2BN3AO433QECSA2A76NFISVIQ/m/maven-enforcer-plugin/target/it/ban-distribution-management-multi-module-build/build.log, /home/jenkins/jenkins-slave/workspace/aven-enforcer_MENFORCER-294-IBUS6H5LUW3LLGQ77JNQBEL74UE2BN3AO433QECSA2A76NFISVIQ/m/maven-enforcer-plugin/target/it/ban-distribution-management-multi-module-except-site/build.log, /home/jenkins/jenkins-slave/workspace/aven-enforcer_MENFORCER-294-IBUS6H5LUW3LLGQ77JNQBEL74UE2BN3AO433QECSA2A76NFISVIQ/m/maven-enforcer-plugin/target/it/ban-distribution-management/build.log, /home/jenkins/jenkins-slave/workspace/aven-enforcer_MENFORCER-294-IBUS6H5LUW3LLGQ77JNQBEL74UE2BN3AO433QECSA2A76NFISVIQ/m/maven-enforcer-plugin/target/it/ban-pom-dependency-version/build.log, /home/jenkins/jenkins-slave/workspace/aven-enforcer_MENFORCER-294-IBUS6H5LUW3LLGQ77JNQBEL74UE2BN3AO433QECSA2A76NFISVIQ/m/maven-enforcer-plugin/target/it/ban-transitive-dependencies-fail/build.log, /home/jenkins/jenkins-slave/workspace/aven-enforcer_MENFORCER-294-IBUS6H5LUW3LLGQ77JNQBEL74UE2BN3AO433QECSA2A76NFISVIQ/m/maven-enforcer-plugin/target/it/ban-transitive-dependencies/build.log, /home/jenkins/jenkins-slave/workspace/aven-enforcer_MENFORCER-294-IBUS6H5LUW3LLGQ77JNQBEL74UE2BN3AO433QECSA2A76NFISVIQ/m/maven-enforcer-plugin/target/it/banned-dependencies-versionrange-fail/build.log, /home/jenkins/jenkins-slave/workspace/aven-enforcer_MENFORCER-294-IBUS6H5LUW3LLGQ77JNQBEL74UE2BN3AO433QECSA2A76NFISVIQ/m/maven-enforcer-plugin/target/it/banned-dependencies-versionrange/build.log, /home/jenkins/jenkins-slave/workspace/aven-enforcer_MENFORCER-294-IBUS6H5LUW3LLGQ77JNQBEL74UE2BN3AO433QECSA2A76NFISVIQ/m/maven-enforcer-plugin/target/it/banned-dependencies-wildcards/build.log, /home/jenkins/jenkins-slave/workspace/aven-enforcer_MENFORCER-294-IBUS6H5LUW3LLGQ77JNQBEL74UE2BN3AO433QECSA2A76NFISVIQ/m/maven-enforcer-plugin/target/it/banned-dependencies/build.log, /home/jenkins/jenkins-slave/workspace/aven-enforcer_MENFORCER-294-IBUS6H5LUW3LLGQ77JNQBEL74UE2BN3AO433QECSA2A76NFISVIQ/m/maven-enforcer-plugin/target/it/banned-plugins/build.log, /home/jenkins/jenkins-slave/workspace/aven-enforcer_MENFORCER-294-IBUS6H5LUW3LLGQ77JNQBEL74UE2BN3AO433QECSA2A76NFISVIQ/m/maven-enforcer-plugin/target/it/builds_a_pom_noop/build.log, /home/jenkins/jenkins-slave/workspace/aven-enforcer_MENFORCER-294-IBUS6H5LUW3LLGQ77JNQBEL74UE2BN3AO433QECSA2A76NFISVIQ/m/maven-enforcer-plugin/target/it/cli-always-fail/build.log, /home/jenkins/jenkins-slave/workspace/aven-enforcer_MENFORCER-294-IBUS6H5LUW3LLGQ77JNQBEL74UE2BN3AO433QECSA2A76NFISVIQ/m/maven-enforcer-plugin/target/it/cli-always-pass/build.log, /home/jenkins/jenkins-slave/workspace/aven-enforcer_MENFORCER-294-IBUS6H5LUW3LLGQ77JNQBEL74UE2BN3AO433QECSA2A76NFISVIQ/m/maven-enforcer-plugin/target/it/dependencies_converge/build.log, /home/jenkins/jenkins-slave/workspace/aven-enforcer_MENFORCER-294-IBUS6H5LUW3LLGQ77JNQBEL74UE2BN3AO433QECSA2A76NFISVIQ/m/maven-enforcer-plugin/target/it/dependencies_not_converging/build.log, /home/jenkins/jenkins-slave/workspace/aven-enforcer_MENFORCER-294-IBUS6H5LUW3LLGQ77JNQBEL74UE2BN3AO433QECSA2A76NFISVIQ/m/maven-enforcer-plugin/target/it/dependencies_not_converging_test_scope/build.log, /home/jenkins/jenkins-slave/workspace/aven-enforcer_MENFORCER-294-IBUS6H5LUW3LLGQ77JNQBEL74UE2BN3AO433QECSA2A76NFISVIQ/m/maven-enforcer-plugin/target/it/display-info/build.log, /home/jenkins/jenkins-slave/workspace/aven-enforcer_MENFORCER-294-IBUS6H5LUW3LLGQ77JNQBEL74UE2BN3AO433QECSA2A76NFISVIQ/m/maven-enforcer-plugin/target/it/evaluate-beanshell/build.log, /home/jenkins/jenkins-slave/workspace/aven-enforcer_MENFORCER-294-IBUS6H5LUW3LLGQ77JNQBEL74UE2BN3AO433QECSA2A76NFISVIQ/m/maven-enforcer-plugin/target/it/multimodule/build.log, /home/jenkins/jenkins-slave/workspace/aven-enforcer_MENFORCER-294-IBUS6H5LUW3LLGQ77JNQBEL74UE2BN3AO433QECSA2A76NFISVIQ/m/maven-enforcer-plugin/target/it/require-active-profile-all/build.log, /home/jenkins/jenkins-slave/workspace/aven-enforcer_MENFORCER-294-IBUS6H5LUW3LLGQ77JNQBEL74UE2BN3AO433QECSA2A76NFISVIQ/m/maven-enforcer-plugin/target/it/require-active-profile-from-settings/build.log, /home/jenkins/jenkins-slave/workspace/aven-enforcer_MENFORCER-294-IBUS6H5LUW3LLGQ77JNQBEL74UE2BN3AO433QECSA2A76NFISVIQ/m/maven-enforcer-plugin/target/it/require-active-profile/build.log, /home/jenkins/jenkins-slave/workspace/aven-enforcer_MENFORCER-294-IBUS6H5LUW3LLGQ77JNQBEL74UE2BN3AO433QECSA2A76NFISVIQ/m/maven-enforcer-plugin/target/it/require-file-checksum/build.log, /home/jenkins/jenkins-slave/workspace/aven-enforcer_MENFORCER-294-IBUS6H5LUW3LLGQ77JNQBEL74UE2BN3AO433QECSA2A76NFISVIQ/m/maven-enforcer-plugin/target/it/require-files-dont-exist/build.log, /home/jenkins/jenkins-slave/workspace/aven-enforcer_MENFORCER-294-IBUS6H5LUW3LLGQ77JNQBEL74UE2BN3AO433QECSA2A76NFISVIQ/m/maven-enforcer-plugin/target/it/require-files-exist/build.log, /home/jenkins/jenkins-slave/workspace/aven-enforcer_MENFORCER-294-IBUS6H5LUW3LLGQ77JNQBEL74UE2BN3AO433QECSA2A76NFISVIQ/m/maven-enforcer-plugin/target/it/require-files-size/build.log, /home/jenkins/jenkins-slave/workspace/aven-enforcer_MENFORCER-294-IBUS6H5LUW3LLGQ77JNQBEL74UE2BN3AO433QECSA2A76NFISVIQ/m/maven-enforcer-plugin/target/it/require-java-version/build.log, /home/jenkins/jenkins-slave/workspace/aven-enforcer_MENFORCER-294-IBUS6H5LUW3LLGQ77JNQBEL74UE2BN3AO433QECSA2A76NFISVIQ/m/maven-enforcer-plugin/target/it/require-maven-version/build.log, /home/jenkins/jenkins-slave/workspace/aven-enforcer_MENFORCER-294-IBUS6H5LUW3LLGQ77JNQBEL74UE2BN3AO433QECSA2A76NFISVIQ/m/maven-enforcer-plugin/target/it/require-no-repositories-allow-plugin-repo/build.log, /home/jenkins/jenkins-slave/workspace/aven-enforcer_MENFORCER-294-IBUS6H5LUW3LLGQ77JNQBEL74UE2BN3AO433QECSA2A76NFISVIQ/m/maven-enforcer-plugin/target/it/require-no-repositories-allow-repo/build.log, /home/jenkins/jenkins-slave/workspace/aven-enforcer_MENFORCER-294-IBUS6H5LUW3LLGQ77JNQBEL74UE2BN3AO433QECSA2A76NFISVIQ/m/maven-enforcer-plugin/target/it/require-no-repositories/build.log, /home/jenkins/jenkins-slave/workspace/aven-enforcer_MENFORCER-294-IBUS6H5LUW3LLGQ77JNQBEL74UE2BN3AO433QECSA2A76NFISVIQ/m/maven-enforcer-plugin/target/it/require-no-repositories_failure/build.log, /home/jenkins/jenkins-slave/workspace/aven-enforcer_MENFORCER-294-IBUS6H5LUW3LLGQ77JNQBEL74UE2BN3AO433QECSA2A76NFISVIQ/m/maven-enforcer-plugin/target/it/require-no-repositories_failure_allowed-plugin-repo/build.log, /home/jenkins/jenkins-slave/workspace/aven-enforcer_MENFORCER-294-IBUS6H5LUW3LLGQ77JNQBEL74UE2BN3AO433QECSA2A76NFISVIQ/m/maven-enforcer-plugin/target/it/require-no-repositories_failure_plugin-repositories/build.log, /home/jenkins/jenkins-slave/workspace/aven-enforcer_MENFORCER-294-IBUS6H5LUW3LLGQ77JNQBEL74UE2BN3AO433QECSA2A76NFISVIQ/m/maven-enforcer-plugin/target/it/require-no-repositories_failure_repositories/build.log, /home/jenkins/jenkins-slave/workspace/aven-enforcer_MENFORCER-294-IBUS6H5LUW3LLGQ77JNQBEL74UE2BN3AO433QECSA2A76NFISVIQ/m/maven-enforcer-plugin/target/it/require-no-repositories_mm/build.log, /home/jenkins/jenkins-slave/workspace/aven-enforcer_MENFORCER-294-IBUS6H5LUW3LLGQ77JNQBEL74UE2BN3AO433QECSA2A76NFISVIQ/m/maven-enforcer-plugin/target/it/require-no-repositories_mm_ci/build.log, /home/jenkins/jenkins-slave/workspace/aven-enforcer_MENFORCER-294-IBUS6H5LUW3LLGQ77JNQBEL74UE2BN3AO433QECSA2A76NFISVIQ/m/maven-enforcer-plugin/target/it/require-plugin-versions-ci/build.log, /home/jenkins/jenkins-slave/workspace/aven-enforcer_MENFORCER-294-IBUS6H5LUW3LLGQ77JNQBEL74UE2BN3AO433QECSA2A76NFISVIQ/m/maven-enforcer-plugin/target/it/require-plugin-versions-custom-packaging/build.log, /home/jenkins/jenkins-slave/workspace/aven-enforcer_MENFORCER-294-IBUS6H5LUW3LLGQ77JNQBEL74UE2BN3AO433QECSA2A76NFISVIQ/m/maven-enforcer-plugin/target/it/require-plugin-versions-expressions/build.log, /home/jenkins/jenkins-slave/workspace/aven-enforcer_MENFORCER-294-IBUS6H5LUW3LLGQ77JNQBEL74UE2BN3AO433QECSA2A76NFISVIQ/m/maven-enforcer-plugin/target/it/require-plugin-versions-mm-ci-friendly/build.log, /home/jenkins/jenkins-slave/workspace/aven-enforcer_MENFORCER-294-IBUS6H5LUW3LLGQ77JNQBEL74UE2BN3AO433QECSA2A76NFISVIQ/m/maven-enforcer-plugin/target/it/require-plugin-versions-plugin-with-extensions/build.log, /home/jenkins/jenkins-slave/workspace/aven-enforcer_MENFORCER-294-IBUS6H5LUW3LLGQ77JNQBEL74UE2BN3AO433QECSA2A76NFISVIQ/m/maven-enforcer-plugin/target/it/require-plugin-versions-plugin-with-integration-test-lifecycle/build.log, /home/jenkins/jenkins-slave/workspace/aven-enforcer_MENFORCER-294-IBUS6H5LUW3LLGQ77JNQBEL74UE2BN3AO433QECSA2A76NFISVIQ/m/maven-enforcer-plugin/target/it/require-plugin-versions-projectGAVexpressions/build.log, /home/jenkins/jenkins-slave/workspace/aven-enforcer_MENFORCER-294-IBUS6H5LUW3LLGQ77JNQBEL74UE2BN3AO433QECSA2A76NFISVIQ/m/maven-enforcer-plugin/target/it/require-plugin-versions/build.log, /home/jenkins/jenkins-slave/workspace/aven-enforcer_MENFORCER-294-IBUS6H5LUW3LLGQ77JNQBEL74UE2BN3AO433QECSA2A76NFISVIQ/m/maven-enforcer-plugin/target/it/require-profile-ids-exist_failure/build.log, /home/jenkins/jenkins-slave/workspace/aven-enforcer_MENFORCER-294-IBUS6H5LUW3LLGQ77JNQBEL74UE2BN3AO433QECSA2A76NFISVIQ/m/maven-enforcer-plugin/target/it/require-profile-ids-exist_success/build.log, /home/jenkins/jenkins-slave/workspace/aven-enforcer_MENFORCER-294-IBUS6H5LUW3LLGQ77JNQBEL74UE2BN3AO433QECSA2A76NFISVIQ/m/maven-enforcer-plugin/target/it/require-property/build.log, /home/jenkins/jenkins-slave/workspace/aven-enforcer_MENFORCER-294-IBUS6H5LUW3LLGQ77JNQBEL74UE2BN3AO433QECSA2A76NFISVIQ/m/maven-enforcer-plugin/target/it/require-release-dependencies-excludes/build.log, /home/jenkins/jenkins-slave/workspace/aven-enforcer_MENFORCER-294-IBUS6H5LUW3LLGQ77JNQBEL74UE2BN3AO433QECSA2A76NFISVIQ/m/maven-enforcer-plugin/target/it/require-release-dependencies-excludes_failure/build.log, /home/jenkins/jenkins-slave/workspace/aven-enforcer_MENFORCER-294-IBUS6H5LUW3LLGQ77JNQBEL74UE2BN3AO433QECSA2A76NFISVIQ/m/maven-enforcer-plugin/target/it/require-release-dependencies/build.log, /home/jenkins/jenkins-slave/workspace/aven-enforcer_MENFORCER-294-IBUS6H5LUW3LLGQ77JNQBEL74UE2BN3AO433QECSA2A76NFISVIQ/m/maven-enforcer-plugin/target/it/require-release-version/build.log, /home/jenkins/jenkins-slave/workspace/aven-enforcer_MENFORCER-294-IBUS6H5LUW3LLGQ77JNQBEL74UE2BN3AO433QECSA2A76NFISVIQ/m/maven-enforcer-plugin/target/it/require-same-versions_failure/build.log, /home/jenkins/jenkins-slave/workspace/aven-enforcer_MENFORCER-294-IBUS6H5LUW3LLGQ77JNQBEL74UE2BN3AO433QECSA2A76NFISVIQ/m/maven-enforcer-plugin/target/it/require-same-versions_success/build.log, /home/jenkins/jenkins-slave/workspace/aven-enforcer_MENFORCER-294-IBUS6H5LUW3LLGQ77JNQBEL74UE2BN3AO433QECSA2A76NFISVIQ/m/maven-enforcer-plugin/target/it/require-snapshot-version_failure/build.log, /home/jenkins/jenkins-slave/workspace/aven-enforcer_MENFORCER-294-IBUS6H5LUW3LLGQ77JNQBEL74UE2BN3AO433QECSA2A76NFISVIQ/m/maven-enforcer-plugin/target/it/require-snapshot-version_success/build.log, /home/jenkins/jenkins-slave/workspace/aven-enforcer_MENFORCER-294-IBUS6H5LUW3LLGQ77JNQBEL74UE2BN3AO433QECSA2A76NFISVIQ/m/maven-enforcer-plugin/target/it/require-upper-bound-dependencies-managed_failure/build.log, /home/jenkins/jenkins-slave/workspace/aven-enforcer_MENFORCER-294-IBUS6H5LUW3LLGQ77JNQBEL74UE2BN3AO433QECSA2A76NFISVIQ/m/maven-enforcer-plugin/target/it/require-upper-bound-dependencies-managed_success/build.log, /home/jenkins/jenkins-slave/workspace/aven-enforcer_MENFORCER-294-IBUS6H5LUW3LLGQ77JNQBEL74UE2BN3AO433QECSA2A76NFISVIQ/m/maven-enforcer-plugin/target/it/require-upper-bound-dependencies-unique_failure/build.log, /home/jenkins/jenkins-slave/workspace/aven-enforcer_MENFORCER-294-IBUS6H5LUW3LLGQ77JNQBEL74UE2BN3AO433QECSA2A76NFISVIQ/m/maven-enforcer-plugin/target/it/require-upper-bound-dependencies-unique_success/build.log, /home/jenkins/jenkins-slave/workspace/aven-enforcer_MENFORCER-294-IBUS6H5LUW3LLGQ77JNQBEL74UE2BN3AO433QECSA2A76NFISVIQ/m/maven-enforcer-plugin/target/it/require-upper-bound-deps_failure/build.log, /home/jenkins/jenkins-slave/workspace/aven-enforcer_MENFORCER-294-IBUS6H5LUW3LLGQ77JNQBEL74UE2BN3AO433QECSA2A76NFISVIQ/m/maven-enforcer-plugin/target/it/require-upper-bound-deps_ignored/build.log, /home/jenkins/jenkins-slave/workspace/aven-enforcer_MENFORCER-294-IBUS6H5LUW3LLGQ77JNQBEL74UE2BN3AO433QECSA2A76NFISVIQ/m/maven-enforcer-plugin/target/it/require-upper-bound-deps_success/build.log, /home/jenkins/jenkins-slave/workspace/aven-enforcer_MENFORCER-294-IBUS6H5LUW3LLGQ77JNQBEL74UE2BN3AO433QECSA2A76NFISVIQ/m/maven-enforcer-plugin/target/it/resolve_collect_dependencies/build.log]
[linux-jdk8] Finished parsing Maven Invoker results (found 68)
[linux-jdk8] [withMaven] junitPublisher - Archive test results for Maven artifact org.apache.maven.enforcer:enforcer-api:3.0.0-SNAPSHOT generated by maven-surefire-plugin:test (default-test): m/enforcer-api/target/surefire-reports/*.xml
[linux-jdk8] Recording test results
[linux-jdk8] None of the test reports contained any result
[linux-jdk8] [withMaven] junitPublisher - Archive test results for Maven artifact org.apache.maven.enforcer:enforcer-rules:3.0.0-SNAPSHOT generated by maven-surefire-plugin:test (default-test): m/enforcer-rules/target/surefire-reports/*.xml
[linux-jdk8] Recording test results
[linux-jdk8] [withMaven] junitPublisher - Archive test results for Maven artifact org.apache.maven.plugins:maven-enforcer-plugin:3.0.0-SNAPSHOT generated by maven-surefire-plugin:test (default-test): m/maven-enforcer-plugin/target/surefire-reports/*.xml
[linux-jdk8] Recording test results
[Pipeline] [windows-jdk10] // node
[Pipeline] [windows-jdk9] // withMaven
[Pipeline] [linux-jdk8] // withMaven
[Pipeline] [windows-jdk10] }
[Pipeline] [windows-jdk9] cleanWs
[Pipeline] [linux-jdk8] cleanWs
[Pipeline] [linux-jdk9] }
[Pipeline] [linux-jdk9] // stage
[Pipeline] [linux-jdk9] }
[Pipeline] [linux-jdk9] // node
[Pipeline] [linux-jdk9] }
[windows-jdk9] [WS-CLEANUP] Deleting project workspace...[WS-CLEANUP] done
[Pipeline] [windows-jdk9] }
[Pipeline] [windows-jdk9] // stage
[Pipeline] [windows-jdk9] }
[Pipeline] [windows-jdk9] // node
[Pipeline] [windows-jdk9] }
[linux-jdk8] [WS-CLEANUP] Deleting project workspace...[WS-CLEANUP] done
[Pipeline] [linux-jdk8] }
[Pipeline] [linux-jdk8] // stage
[Pipeline] [linux-jdk8] }
[Pipeline] [linux-jdk8] // node
[Pipeline] [linux-jdk8] }
[linux-jdk10] [INFO]           require-upper-bound-dependencies-unique_success/pom.xml SUCCESS (4.4 s)
[linux-jdk10] [INFO] Building: ban-distribution-management/pom.xml
[linux-jdk10] [INFO] run post-build script verify.groovy
[linux-jdk10] [INFO]           ban-distribution-management/pom.xml .............. SUCCESS (4.2 s)
[linux-jdk10] [INFO] Building: require-no-repositories_mm_ci/pom.xml
[linux-jdk10] [INFO]           require-no-repositories_mm_ci/pom.xml ............ SUCCESS (4.2 s)
[linux-jdk10] [INFO] Building: always-pass/pom.xml
[linux-jdk10] [INFO]           always-pass/pom.xml .............................. SUCCESS (3.9 s)
[linux-jdk10] [INFO] Building: display-info/pom.xml
[linux-jdk10] [INFO] run post-build script verify.groovy
[linux-jdk10] [INFO]           display-info/pom.xml ............................. SUCCESS (4.0 s)
[linux-jdk10] [INFO] Building: require-release-dependencies-excludes_failure/pom.xml
[linux-jdk10] [INFO]           require-release-dependencies-excludes_failure/pom.xml SUCCESS (4.5 s)
[linux-jdk10] [INFO] Building: require-no-repositories-allow-repo/pom.xml
[linux-jdk10] [INFO] run post-build script verify.groovy
[linux-jdk10] [INFO]           require-no-repositories-allow-repo/pom.xml ....... SUCCESS (4.2 s)
[linux-jdk10] [INFO] Building: require-plugin-versions-mm-ci-friendly/pom.xml
[linux-jdk10] [INFO]           require-plugin-versions-mm-ci-friendly/pom.xml ... SUCCESS (4.9 s)
[linux-jdk10] [INFO] Building: ban-transitive-dependencies-fail/pom.xml
[linux-jdk10] [INFO] run post-build script verify.groovy
[linux-jdk10] [INFO]           ban-transitive-dependencies-fail/pom.xml ......... SUCCESS (4.1 s)
[linux-jdk10] [INFO] Building: always-fail-warn/pom.xml
[linux-jdk10] [INFO] run post-build script verify.groovy
[linux-jdk10] [INFO]           always-fail-warn/pom.xml ......................... SUCCESS (4.1 s)
[linux-jdk10] [INFO] Building: resolve_collect_dependencies/pom.xml
[linux-jdk10] [INFO] run post-build script verify.groovy
[linux-jdk10] [INFO]           resolve_collect_dependencies/pom.xml ............. SUCCESS (6.1 s)
[linux-jdk10] [INFO] Building: require-upper-bound-dependencies-managed_success/pom.xml
[linux-jdk10] [INFO]           require-upper-bound-dependencies-managed_success/pom.xml SUCCESS (4.1 s)
[linux-jdk10] [INFO] Building: dependencies_not_converging_test_scope/pom.xml
[linux-jdk10] [INFO]           dependencies_not_converging_test_scope/pom.xml ... SUCCESS (4.0 s)
[linux-jdk10] [INFO] Building: require-files-dont-exist/pom.xml
[linux-jdk10] [INFO]           require-files-dont-exist/pom.xml ................. SUCCESS (4.0 s)
[linux-jdk10] [INFO] Building: ban-distribution-management-multi-module-build/pom.xml
[linux-jdk10] [INFO] run post-build script verify.groovy
[linux-jdk10] [INFO]           ban-distribution-management-multi-module-build/pom.xml SUCCESS (4.2 s)
[linux-jdk10] [INFO] Building: require-no-repositories_failure/pom.xml
[linux-jdk10] [INFO] run post-build script verify.groovy
[linux-jdk10] [INFO]           require-no-repositories_failure/pom.xml .......... SUCCESS (4.1 s)
[linux-jdk10] [INFO] Building: builds_a_pom_noop/pom.xml
[linux-jdk10] [INFO]           builds_a_pom_noop/pom.xml ........................ SUCCESS (4.1 s)
[linux-jdk10] [INFO] Building: require-upper-bound-dependencies-managed_failure/pom.xml
[linux-jdk10] [INFO] run post-build script verify.groovy
[linux-jdk10] [INFO]           require-upper-bound-dependencies-managed_failure/pom.xml SUCCESS (4.1 s)
[linux-jdk10] [INFO] Building: require-files-size/pom.xml
[linux-jdk10] [INFO]           require-files-size/pom.xml ....................... SUCCESS (4.1 s)
[linux-jdk10] [INFO] Building: require-upper-bound-deps_failure/pom.xml
[linux-jdk10] [INFO] run post-build script verify.groovy
[linux-jdk10] [INFO]           require-upper-bound-deps_failure/pom.xml ......... SUCCESS (4.2 s)
[linux-jdk10] [INFO] Building: require-no-repositories_failure_plugin-repositories/pom.xml
[linux-jdk10] [INFO] run post-build script verify.groovy
[linux-jdk10] [INFO]           require-no-repositories_failure_plugin-repositories/pom.xml SUCCESS (4.1 s)
[linux-jdk10] [INFO] Building: require-profile-ids-exist_failure/pom.xml
[linux-jdk10] [INFO] run post-build script verify.groovy
[linux-jdk10] [INFO]           require-profile-ids-exist_failure/pom.xml ........ SUCCESS (4.6 s)
[linux-jdk10] [INFO] Building: require-maven-version/pom.xml
[linux-jdk10] [INFO]           require-maven-version/pom.xml .................... SUCCESS (4.1 s)
[linux-jdk10] [INFO] Building: banned-plugins/pom.xml
[linux-jdk10] [INFO]           banned-plugins/pom.xml ........................... SUCCESS (4.0 s)
[linux-jdk10] [INFO] Building: require-upper-bound-deps_success/pom.xml
[linux-jdk10] [INFO]           require-upper-bound-deps_success/pom.xml ......... SUCCESS (4.3 s)
[linux-jdk10] [INFO] Building: require-active-profile/pom.xml
[linux-jdk10] [INFO]           require-active-profile/pom.xml ................... SUCCESS (4.1 s)
[linux-jdk10] [INFO] Building: ban-distribution-management-multi-module-except-site/pom.xml
[linux-jdk10] [INFO] run post-build script verify.groovy
[linux-jdk10] [INFO]           ban-distribution-management-multi-module-except-site/pom.xml SUCCESS (4.2 s)
[linux-jdk10] [INFO] Building: evaluate-beanshell/pom.xml
[linux-jdk10] [INFO]           evaluate-beanshell/pom.xml ....................... SUCCESS (4.1 s)
[linux-jdk10] [INFO] Building: require-active-profile-from-settings/pom.xml
[linux-jdk10] [INFO]           require-active-profile-from-settings/pom.xml ..... SUCCESS (4.2 s)
[linux-jdk10] [INFO] Building: require-release-version/pom.xml
[linux-jdk10] [INFO]           require-release-version/pom.xml .................. SUCCESS (4.1 s)
[linux-jdk10] [INFO] Building: banned-dependencies-versionrange-fail/pom.xml
[linux-jdk10] [INFO] run post-build script verify.groovy
[linux-jdk10] [INFO]           banned-dependencies-versionrange-fail/pom.xml .... SUCCESS (4.1 s)
[linux-jdk10] [INFO] Building: require-same-versions_success/pom.xml
[linux-jdk10] [INFO]           require-same-versions_success/pom.xml ............ SUCCESS (4.0 s)
[linux-jdk10] [INFO] Building: banned-dependencies-wildcards/pom.xml
[linux-jdk10] [INFO]           banned-dependencies-wildcards/pom.xml ............ SUCCESS (4.1 s)
[linux-jdk10] [INFO] Building: cli-always-pass/pom.xml
[linux-jdk10] [INFO]           cli-always-pass/pom.xml .......................... SUCCESS (4.0 s)
[linux-jdk10] [INFO] -------------------------------------------------
[linux-jdk10] [INFO] Build Summary:
[linux-jdk10] [INFO]   Passed: 68, Failed: 0, Errors: 0, Skipped: 0
[linux-jdk10] [INFO] -------------------------------------------------
[linux-jdk10] [INFO] 
[linux-jdk10] [INFO] --- mrm-maven-plugin:1.0.0:stop (default) @ maven-enforcer-plugin ---
[linux-jdk10] [INFO] Stopping Mock Repository Manager on http://localhost:39460
[linux-jdk10] [INFO] Mock Repository Manager http://localhost:39460 is stopped.
[linux-jdk10] [INFO] 
[linux-jdk10] [INFO] --- maven-checkstyle-plugin:3.0.0:check (checkstyle-check) @ maven-enforcer-plugin ---
[linux-jdk10] [INFO] ------------------------------------------------------------------------
[linux-jdk10] [INFO] Reactor Summary:
[linux-jdk10] [INFO] 
[linux-jdk10] [INFO] Apache Maven Enforcer 3.0.0-SNAPSHOT ............... SUCCESS [ 35.557 s]
[linux-jdk10] [INFO] Apache Maven Enforcer API .......................... SUCCESS [  5.797 s]
[linux-jdk10] [INFO] Apache Maven Enforcer Built-In Rules ............... SUCCESS [ 13.554 s]
[linux-jdk10] [INFO] Apache Maven Enforcer Plugin 3.0.0-SNAPSHOT ........ SUCCESS [05:16 min]
[linux-jdk10] [INFO] ------------------------------------------------------------------------
[linux-jdk10] [INFO] BUILD SUCCESS
[linux-jdk10] [INFO] ------------------------------------------------------------------------
[linux-jdk10] [INFO] Total time: 06:13 min
[linux-jdk10] [INFO] Finished at: 2018-08-20T05:21:58Z
[linux-jdk10] [INFO] ------------------------------------------------------------------------
[linux-jdk10] [INFO] [jenkins-event-spy] Generated /home/jenkins/jenkins-slave/workspace/aven-enforcer_MENFORCER-294-IBUS6H5LUW3LLGQ77JNQBEL74UE2BN3AO433QECSA2A76NFISVIQ@tmp/withMaven37c93e56/maven-spy-20180820-051545-53612963110374388836579.log
[Pipeline] [linux-jdk10] }
[Pipeline] [linux-jdk10] // dir
[Pipeline] [linux-jdk10] }
[linux-jdk10] [withMaven] invokerPublisher - Archive invoker results for Maven artifact MavenArtifact{org.apache.maven.plugins:maven-enforcer-plugin::3.0.0-SNAPSHOT(version: 3.0.0-SNAPSHOT, snapshot:false) } generated by PluginInvocation{org.apache.maven.plugins:maven-invoker-plugin:3.0.1@run  integration-test}: m/maven-enforcer-plugin/target/invoker-reports/*.xml
[linux-jdk10] performing MavenInvokerRecorder, reportsFilenamePattern:'**/m/maven-enforcer-plugin/target/invoker-reports/BUILD*.xml', invokerBuildDir:'**/m/maven-enforcer-plugin/target/it'
[linux-jdk10] Found reports:[/home/jenkins/jenkins-slave/workspace/aven-enforcer_MENFORCER-294-IBUS6H5LUW3LLGQ77JNQBEL74UE2BN3AO433QECSA2A76NFISVIQ/m/maven-enforcer-plugin/target/invoker-reports/BUILD-always-fail-warn.xml, /home/jenkins/jenkins-slave/workspace/aven-enforcer_MENFORCER-294-IBUS6H5LUW3LLGQ77JNQBEL74UE2BN3AO433QECSA2A76NFISVIQ/m/maven-enforcer-plugin/target/invoker-reports/BUILD-always-fail.xml, /home/jenkins/jenkins-slave/workspace/aven-enforcer_MENFORCER-294-IBUS6H5LUW3LLGQ77JNQBEL74UE2BN3AO433QECSA2A76NFISVIQ/m/maven-enforcer-plugin/target/invoker-reports/BUILD-always-pass.xml, /home/jenkins/jenkins-slave/workspace/aven-enforcer_MENFORCER-294-IBUS6H5LUW3LLGQ77JNQBEL74UE2BN3AO433QECSA2A76NFISVIQ/m/maven-enforcer-plugin/target/invoker-reports/BUILD-ban-distribution-management-multi-module-build.xml, /home/jenkins/jenkins-slave/workspace/aven-enforcer_MENFORCER-294-IBUS6H5LUW3LLGQ77JNQBEL74UE2BN3AO433QECSA2A76NFISVIQ/m/maven-enforcer-plugin/target/invoker-reports/BUILD-ban-distribution-management-multi-module-except-site.xml, /home/jenkins/jenkins-slave/workspace/aven-enforcer_MENFORCER-294-IBUS6H5LUW3LLGQ77JNQBEL74UE2BN3AO433QECSA2A76NFISVIQ/m/maven-enforcer-plugin/target/invoker-reports/BUILD-ban-distribution-management.xml, /home/jenkins/jenkins-slave/workspace/aven-enforcer_MENFORCER-294-IBUS6H5LUW3LLGQ77JNQBEL74UE2BN3AO433QECSA2A76NFISVIQ/m/maven-enforcer-plugin/target/invoker-reports/BUILD-ban-pom-dependency-version.xml, /home/jenkins/jenkins-slave/workspace/aven-enforcer_MENFORCER-294-IBUS6H5LUW3LLGQ77JNQBEL74UE2BN3AO433QECSA2A76NFISVIQ/m/maven-enforcer-plugin/target/invoker-reports/BUILD-ban-transitive-dependencies-fail.xml, /home/jenkins/jenkins-slave/workspace/aven-enforcer_MENFORCER-294-IBUS6H5LUW3LLGQ77JNQBEL74UE2BN3AO433QECSA2A76NFISVIQ/m/maven-enforcer-plugin/target/invoker-reports/BUILD-ban-transitive-dependencies.xml, /home/jenkins/jenkins-slave/workspace/aven-enforcer_MENFORCER-294-IBUS6H5LUW3LLGQ77JNQBEL74UE2BN3AO433QECSA2A76NFISVIQ/m/maven-enforcer-plugin/target/invoker-reports/BUILD-banned-dependencies-versionrange-fail.xml, /home/jenkins/jenkins-slave/workspace/aven-enforcer_MENFORCER-294-IBUS6H5LUW3LLGQ77JNQBEL74UE2BN3AO433QECSA2A76NFISVIQ/m/maven-enforcer-plugin/target/invoker-reports/BUILD-banned-dependencies-versionrange.xml, /home/jenkins/jenkins-slave/workspace/aven-enforcer_MENFORCER-294-IBUS6H5LUW3LLGQ77JNQBEL74UE2BN3AO433QECSA2A76NFISVIQ/m/maven-enforcer-plugin/target/invoker-reports/BUILD-banned-dependencies-wildcards.xml, /home/jenkins/jenkins-slave/workspace/aven-enforcer_MENFORCER-294-IBUS6H5LUW3LLGQ77JNQBEL74UE2BN3AO433QECSA2A76NFISVIQ/m/maven-enforcer-plugin/target/invoker-reports/BUILD-banned-dependencies.xml, /home/jenkins/jenkins-slave/workspace/aven-enforcer_MENFORCER-294-IBUS6H5LUW3LLGQ77JNQBEL74UE2BN3AO433QECSA2A76NFISVIQ/m/maven-enforcer-plugin/target/invoker-reports/BUILD-banned-plugins.xml, /home/jenkins/jenkins-slave/workspace/aven-enforcer_MENFORCER-294-IBUS6H5LUW3LLGQ77JNQBEL74UE2BN3AO433QECSA2A76NFISVIQ/m/maven-enforcer-plugin/target/invoker-reports/BUILD-builds_a_pom_noop.xml, /home/jenkins/jenkins-slave/workspace/aven-enforcer_MENFORCER-294-IBUS6H5LUW3LLGQ77JNQBEL74UE2BN3AO433QECSA2A76NFISVIQ/m/maven-enforcer-plugin/target/invoker-reports/BUILD-cli-always-fail.xml, /home/jenkins/jenkins-slave/workspace/aven-enforcer_MENFORCER-294-IBUS6H5LUW3LLGQ77JNQBEL74UE2BN3AO433QECSA2A76NFISVIQ/m/maven-enforcer-plugin/target/invoker-reports/BUILD-cli-always-pass.xml, /home/jenkins/jenkins-slave/workspace/aven-enforcer_MENFORCER-294-IBUS6H5LUW3LLGQ77JNQBEL74UE2BN3AO433QECSA2A76NFISVIQ/m/maven-enforcer-plugin/target/invoker-reports/BUILD-dependencies_converge.xml, /home/jenkins/jenkins-slave/workspace/aven-enforcer_MENFORCER-294-IBUS6H5LUW3LLGQ77JNQBEL74UE2BN3AO433QECSA2A76NFISVIQ/m/maven-enforcer-plugin/target/invoker-reports/BUILD-dependencies_not_converging.xml, /home/jenkins/jenkins-slave/workspace/aven-enforcer_MENFORCER-294-IBUS6H5LUW3LLGQ77JNQBEL74UE2BN3AO433QECSA2A76NFISVIQ/m/maven-enforcer-plugin/target/invoker-reports/BUILD-dependencies_not_converging_test_scope.xml, /home/jenkins/jenkins-slave/workspace/aven-enforcer_MENFORCER-294-IBUS6H5LUW3LLGQ77JNQBEL74UE2BN3AO433QECSA2A76NFISVIQ/m/maven-enforcer-plugin/target/invoker-reports/BUILD-display-info.xml, /home/jenkins/jenkins-slave/workspace/aven-enforcer_MENFORCER-294-IBUS6H5LUW3LLGQ77JNQBEL74UE2BN3AO433QECSA2A76NFISVIQ/m/maven-enforcer-plugin/target/invoker-reports/BUILD-evaluate-beanshell.xml, /home/jenkins/jenkins-slave/workspace/aven-enforcer_MENFORCER-294-IBUS6H5LUW3LLGQ77JNQBEL74UE2BN3AO433QECSA2A76NFISVIQ/m/maven-enforcer-plugin/target/invoker-reports/BUILD-multimodule.xml, /home/jenkins/jenkins-slave/workspace/aven-enforcer_MENFORCER-294-IBUS6H5LUW3LLGQ77JNQBEL74UE2BN3AO433QECSA2A76NFISVIQ/m/maven-enforcer-plugin/target/invoker-reports/BUILD-require-active-profile-all.xml, /home/jenkins/jenkins-slave/workspace/aven-enforcer_MENFORCER-294-IBUS6H5LUW3LLGQ77JNQBEL74UE2BN3AO433QECSA2A76NFISVIQ/m/maven-enforcer-plugin/target/invoker-reports/BUILD-require-active-profile-from-settings.xml, /home/jenkins/jenkins-slave/workspace/aven-enforcer_MENFORCER-294-IBUS6H5LUW3LLGQ77JNQBEL74UE2BN3AO433QECSA2A76NFISVIQ/m/maven-enforcer-plugin/target/invoker-reports/BUILD-require-active-profile.xml, /home/jenkins/jenkins-slave/workspace/aven-enforcer_MENFORCER-294-IBUS6H5LUW3LLGQ77JNQBEL74UE2BN3AO433QECSA2A76NFISVIQ/m/maven-enforcer-plugin/target/invoker-reports/BUILD-require-file-checksum.xml, /home/jenkins/jenkins-slave/workspace/aven-enforcer_MENFORCER-294-IBUS6H5LUW3LLGQ77JNQBEL74UE2BN3AO433QECSA2A76NFISVIQ/m/maven-enforcer-plugin/target/invoker-reports/BUILD-require-files-dont-exist.xml, /home/jenkins/jenkins-slave/workspace/aven-enforcer_MENFORCER-294-IBUS6H5LUW3LLGQ77JNQBEL74UE2BN3AO433QECSA2A76NFISVIQ/m/maven-enforcer-plugin/target/invoker-reports/BUILD-require-files-exist.xml, /home/jenkins/jenkins-slave/workspace/aven-enforcer_MENFORCER-294-IBUS6H5LUW3LLGQ77JNQBEL74UE2BN3AO433QECSA2A76NFISVIQ/m/maven-enforcer-plugin/target/invoker-reports/BUILD-require-files-size.xml, /home/jenkins/jenkins-slave/workspace/aven-enforcer_MENFORCER-294-IBUS6H5LUW3LLGQ77JNQBEL74UE2BN3AO433QECSA2A76NFISVIQ/m/maven-enforcer-plugin/target/invoker-reports/BUILD-require-java-version.xml, /home/jenkins/jenkins-slave/workspace/aven-enforcer_MENFORCER-294-IBUS6H5LUW3LLGQ77JNQBEL74UE2BN3AO433QECSA2A76NFISVIQ/m/maven-enforcer-plugin/target/invoker-reports/BUILD-require-maven-version.xml, /home/jenkins/jenkins-slave/workspace/aven-enforcer_MENFORCER-294-IBUS6H5LUW3LLGQ77JNQBEL74UE2BN3AO433QECSA2A76NFISVIQ/m/maven-enforcer-plugin/target/invoker-reports/BUILD-require-no-repositories-allow-plugin-repo.xml, /home/jenkins/jenkins-slave/workspace/aven-enforcer_MENFORCER-294-IBUS6H5LUW3LLGQ77JNQBEL74UE2BN3AO433QECSA2A76NFISVIQ/m/maven-enforcer-plugin/target/invoker-reports/BUILD-require-no-repositories-allow-repo.xml, /home/jenkins/jenkins-slave/workspace/aven-enforcer_MENFORCER-294-IBUS6H5LUW3LLGQ77JNQBEL74UE2BN3AO433QECSA2A76NFISVIQ/m/maven-enforcer-plugin/target/invoker-reports/BUILD-require-no-repositories.xml, /home/jenkins/jenkins-slave/workspace/aven-enforcer_MENFORCER-294-IBUS6H5LUW3LLGQ77JNQBEL74UE2BN3AO433QECSA2A76NFISVIQ/m/maven-enforcer-plugin/target/invoker-reports/BUILD-require-no-repositories_failure.xml, /home/jenkins/jenkins-slave/workspace/aven-enforcer_MENFORCER-294-IBUS6H5LUW3LLGQ77JNQBEL74UE2BN3AO433QECSA2A76NFISVIQ/m/maven-enforcer-plugin/target/invoker-reports/BUILD-require-no-repositories_failure_allowed-plugin-repo.xml, /home/jenkins/jenkins-slave/workspace/aven-enforcer_MENFORCER-294-IBUS6H5LUW3LLGQ77JNQBEL74UE2BN3AO433QECSA2A76NFISVIQ/m/maven-enforcer-plugin/target/invoker-reports/BUILD-require-no-repositories_failure_plugin-repositories.xml, /home/jenkins/jenkins-slave/workspace/aven-enforcer_MENFORCER-294-IBUS6H5LUW3LLGQ77JNQBEL74UE2BN3AO433QECSA2A76NFISVIQ/m/maven-enforcer-plugin/target/invoker-reports/BUILD-require-no-repositories_failure_repositories.xml, /home/jenkins/jenkins-slave/workspace/aven-enforcer_MENFORCER-294-IBUS6H5LUW3LLGQ77JNQBEL74UE2BN3AO433QECSA2A76NFISVIQ/m/maven-enforcer-plugin/target/invoker-reports/BUILD-require-no-repositories_mm.xml, /home/jenkins/jenkins-slave/workspace/aven-enforcer_MENFORCER-294-IBUS6H5LUW3LLGQ77JNQBEL74UE2BN3AO433QECSA2A76NFISVIQ/m/maven-enforcer-plugin/target/invoker-reports/BUILD-require-no-repositories_mm_ci.xml, /home/jenkins/jenkins-slave/workspace/aven-enforcer_MENFORCER-294-IBUS6H5LUW3LLGQ77JNQBEL74UE2BN3AO433QECSA2A76NFISVIQ/m/maven-enforcer-plugin/target/invoker-reports/BUILD-require-plugin-versions-ci.xml, /home/jenkins/jenkins-slave/workspace/aven-enforcer_MENFORCER-294-IBUS6H5LUW3LLGQ77JNQBEL74UE2BN3AO433QECSA2A76NFISVIQ/m/maven-enforcer-plugin/target/invoker-reports/BUILD-require-plugin-versions-custom-packaging.xml, /home/jenkins/jenkins-slave/workspace/aven-enforcer_MENFORCER-294-IBUS6H5LUW3LLGQ77JNQBEL74UE2BN3AO433QECSA2A76NFISVIQ/m/maven-enforcer-plugin/target/invoker-reports/BUILD-require-plugin-versions-expressions.xml, /home/jenkins/jenkins-slave/workspace/aven-enforcer_MENFORCER-294-IBUS6H5LUW3LLGQ77JNQBEL74UE2BN3AO433QECSA2A76NFISVIQ/m/maven-enforcer-plugin/target/invoker-reports/BUILD-require-plugin-versions-mm-ci-friendly.xml, /home/jenkins/jenkins-slave/workspace/aven-enforcer_MENFORCER-294-IBUS6H5LUW3LLGQ77JNQBEL74UE2BN3AO433QECSA2A76NFISVIQ/m/maven-enforcer-plugin/target/invoker-reports/BUILD-require-plugin-versions-plugin-with-extensions.xml, /home/jenkins/jenkins-slave/workspace/aven-enforcer_MENFORCER-294-IBUS6H5LUW3LLGQ77JNQBEL74UE2BN3AO433QECSA2A76NFISVIQ/m/maven-enforcer-plugin/target/invoker-reports/BUILD-require-plugin-versions-plugin-with-integration-test-lifecycle.xml, /home/jenkins/jenkins-slave/workspace/aven-enforcer_MENFORCER-294-IBUS6H5LUW3LLGQ77JNQBEL74UE2BN3AO433QECSA2A76NFISVIQ/m/maven-enforcer-plugin/target/invoker-reports/BUILD-require-plugin-versions-projectGAVexpressions.xml, /home/jenkins/jenkins-slave/workspace/aven-enforcer_MENFORCER-294-IBUS6H5LUW3LLGQ77JNQBEL74UE2BN3AO433QECSA2A76NFISVIQ/m/maven-enforcer-plugin/target/invoker-reports/BUILD-require-plugin-versions.xml, /home/jenkins/jenkins-slave/workspace/aven-enforcer_MENFORCER-294-IBUS6H5LUW3LLGQ77JNQBEL74UE2BN3AO433QECSA2A76NFISVIQ/m/maven-enforcer-plugin/target/invoker-reports/BUILD-require-profile-ids-exist_failure.xml, /home/jenkins/jenkins-slave/workspace/aven-enforcer_MENFORCER-294-IBUS6H5LUW3LLGQ77JNQBEL74UE2BN3AO433QECSA2A76NFISVIQ/m/maven-enforcer-plugin/target/invoker-reports/BUILD-require-profile-ids-exist_success.xml, /home/jenkins/jenkins-slave/workspace/aven-enforcer_MENFORCER-294-IBUS6H5LUW3LLGQ77JNQBEL74UE2BN3AO433QECSA2A76NFISVIQ/m/maven-enforcer-plugin/target/invoker-reports/BUILD-require-property.xml, /home/jenkins/jenkins-slave/workspace/aven-enforcer_MENFORCER-294-IBUS6H5LUW3LLGQ77JNQBEL74UE2BN3AO433QECSA2A76NFISVIQ/m/maven-enforcer-plugin/target/invoker-reports/BUILD-require-release-dependencies-excludes.xml, /home/jenkins/jenkins-slave/workspace/aven-enforcer_MENFORCER-294-IBUS6H5LUW3LLGQ77JNQBEL74UE2BN3AO433QECSA2A76NFISVIQ/m/maven-enforcer-plugin/target/invoker-reports/BUILD-require-release-dependencies-excludes_failure.xml, /home/jenkins/jenkins-slave/workspace/aven-enforcer_MENFORCER-294-IBUS6H5LUW3LLGQ77JNQBEL74UE2BN3AO433QECSA2A76NFISVIQ/m/maven-enforcer-plugin/target/invoker-reports/BUILD-require-release-dependencies.xml, /home/jenkins/jenkins-slave/workspace/aven-enforcer_MENFORCER-294-IBUS6H5LUW3LLGQ77JNQBEL74UE2BN3AO433QECSA2A76NFISVIQ/m/maven-enforcer-plugin/target/invoker-reports/BUILD-require-release-version.xml, /home/jenkins/jenkins-slave/workspace/aven-enforcer_MENFORCER-294-IBUS6H5LUW3LLGQ77JNQBEL74UE2BN3AO433QECSA2A76NFISVIQ/m/maven-enforcer-plugin/target/invoker-reports/BUILD-require-same-versions_failure.xml, /home/jenkins/jenkins-slave/workspace/aven-enforcer_MENFORCER-294-IBUS6H5LUW3LLGQ77JNQBEL74UE2BN3AO433QECSA2A76NFISVIQ/m/maven-enforcer-plugin/target/invoker-reports/BUILD-require-same-versions_success.xml, /home/jenkins/jenkins-slave/workspace/aven-enforcer_MENFORCER-294-IBUS6H5LUW3LLGQ77JNQBEL74UE2BN3AO433QECSA2A76NFISVIQ/m/maven-enforcer-plugin/target/invoker-reports/BUILD-require-snapshot-version_failure.xml, /home/jenkins/jenkins-slave/workspace/aven-enforcer_MENFORCER-294-IBUS6H5LUW3LLGQ77JNQBEL74UE2BN3AO433QECSA2A76NFISVIQ/m/maven-enforcer-plugin/target/invoker-reports/BUILD-require-snapshot-version_success.xml, /home/jenkins/jenkins-slave/workspace/aven-enforcer_MENFORCER-294-IBUS6H5LUW3LLGQ77JNQBEL74UE2BN3AO433QECSA2A76NFISVIQ/m/maven-enforcer-plugin/target/invoker-reports/BUILD-require-upper-bound-dependencies-managed_failure.xml, /home/jenkins/jenkins-slave/workspace/aven-enforcer_MENFORCER-294-IBUS6H5LUW3LLGQ77JNQBEL74UE2BN3AO433QECSA2A76NFISVIQ/m/maven-enforcer-plugin/target/invoker-reports/BUILD-require-upper-bound-dependencies-managed_success.xml, /home/jenkins/jenkins-slave/workspace/aven-enforcer_MENFORCER-294-IBUS6H5LUW3LLGQ77JNQBEL74UE2BN3AO433QECSA2A76NFISVIQ/m/maven-enforcer-plugin/target/invoker-reports/BUILD-require-upper-bound-dependencies-unique_failure.xml, /home/jenkins/jenkins-slave/workspace/aven-enforcer_MENFORCER-294-IBUS6H5LUW3LLGQ77JNQBEL74UE2BN3AO433QECSA2A76NFISVIQ/m/maven-enforcer-plugin/target/invoker-reports/BUILD-require-upper-bound-dependencies-unique_success.xml, /home/jenkins/jenkins-slave/workspace/aven-enforcer_MENFORCER-294-IBUS6H5LUW3LLGQ77JNQBEL74UE2BN3AO433QECSA2A76NFISVIQ/m/maven-enforcer-plugin/target/invoker-reports/BUILD-require-upper-bound-deps_failure.xml, /home/jenkins/jenkins-slave/workspace/aven-enforcer_MENFORCER-294-IBUS6H5LUW3LLGQ77JNQBEL74UE2BN3AO433QECSA2A76NFISVIQ/m/maven-enforcer-plugin/target/invoker-reports/BUILD-require-upper-bound-deps_ignored.xml, /home/jenkins/jenkins-slave/workspace/aven-enforcer_MENFORCER-294-IBUS6H5LUW3LLGQ77JNQBEL74UE2BN3AO433QECSA2A76NFISVIQ/m/maven-enforcer-plugin/target/invoker-reports/BUILD-require-upper-bound-deps_success.xml, /home/jenkins/jenkins-slave/workspace/aven-enforcer_MENFORCER-294-IBUS6H5LUW3LLGQ77JNQBEL74UE2BN3AO433QECSA2A76NFISVIQ/m/maven-enforcer-plugin/target/invoker-reports/BUILD-resolve_collect_dependencies.xml]
[linux-jdk10] Found logs:[/home/jenkins/jenkins-slave/workspace/aven-enforcer_MENFORCER-294-IBUS6H5LUW3LLGQ77JNQBEL74UE2BN3AO433QECSA2A76NFISVIQ/m/maven-enforcer-plugin/target/it/always-fail-warn/build.log, /home/jenkins/jenkins-slave/workspace/aven-enforcer_MENFORCER-294-IBUS6H5LUW3LLGQ77JNQBEL74UE2BN3AO433QECSA2A76NFISVIQ/m/maven-enforcer-plugin/target/it/always-fail/build.log, /home/jenkins/jenkins-slave/workspace/aven-enforcer_MENFORCER-294-IBUS6H5LUW3LLGQ77JNQBEL74UE2BN3AO433QECSA2A76NFISVIQ/m/maven-enforcer-plugin/target/it/always-pass/build.log, /home/jenkins/jenkins-slave/workspace/aven-enforcer_MENFORCER-294-IBUS6H5LUW3LLGQ77JNQBEL74UE2BN3AO433QECSA2A76NFISVIQ/m/maven-enforcer-plugin/target/it/ban-distribution-management-multi-module-build/build.log, /home/jenkins/jenkins-slave/workspace/aven-enforcer_MENFORCER-294-IBUS6H5LUW3LLGQ77JNQBEL74UE2BN3AO433QECSA2A76NFISVIQ/m/maven-enforcer-plugin/target/it/ban-distribution-management-multi-module-except-site/build.log, /home/jenkins/jenkins-slave/workspace/aven-enforcer_MENFORCER-294-IBUS6H5LUW3LLGQ77JNQBEL74UE2BN3AO433QECSA2A76NFISVIQ/m/maven-enforcer-plugin/target/it/ban-distribution-management/build.log, /home/jenkins/jenkins-slave/workspace/aven-enforcer_MENFORCER-294-IBUS6H5LUW3LLGQ77JNQBEL74UE2BN3AO433QECSA2A76NFISVIQ/m/maven-enforcer-plugin/target/it/ban-pom-dependency-version/build.log, /home/jenkins/jenkins-slave/workspace/aven-enforcer_MENFORCER-294-IBUS6H5LUW3LLGQ77JNQBEL74UE2BN3AO433QECSA2A76NFISVIQ/m/maven-enforcer-plugin/target/it/ban-transitive-dependencies-fail/build.log, /home/jenkins/jenkins-slave/workspace/aven-enforcer_MENFORCER-294-IBUS6H5LUW3LLGQ77JNQBEL74UE2BN3AO433QECSA2A76NFISVIQ/m/maven-enforcer-plugin/target/it/ban-transitive-dependencies/build.log, /home/jenkins/jenkins-slave/workspace/aven-enforcer_MENFORCER-294-IBUS6H5LUW3LLGQ77JNQBEL74UE2BN3AO433QECSA2A76NFISVIQ/m/maven-enforcer-plugin/target/it/banned-dependencies-versionrange-fail/build.log, /home/jenkins/jenkins-slave/workspace/aven-enforcer_MENFORCER-294-IBUS6H5LUW3LLGQ77JNQBEL74UE2BN3AO433QECSA2A76NFISVIQ/m/maven-enforcer-plugin/target/it/banned-dependencies-versionrange/build.log, /home/jenkins/jenkins-slave/workspace/aven-enforcer_MENFORCER-294-IBUS6H5LUW3LLGQ77JNQBEL74UE2BN3AO433QECSA2A76NFISVIQ/m/maven-enforcer-plugin/target/it/banned-dependencies-wildcards/build.log, /home/jenkins/jenkins-slave/workspace/aven-enforcer_MENFORCER-294-IBUS6H5LUW3LLGQ77JNQBEL74UE2BN3AO433QECSA2A76NFISVIQ/m/maven-enforcer-plugin/target/it/banned-dependencies/build.log, /home/jenkins/jenkins-slave/workspace/aven-enforcer_MENFORCER-294-IBUS6H5LUW3LLGQ77JNQBEL74UE2BN3AO433QECSA2A76NFISVIQ/m/maven-enforcer-plugin/target/it/banned-plugins/build.log, /home/jenkins/jenkins-slave/workspace/aven-enforcer_MENFORCER-294-IBUS6H5LUW3LLGQ77JNQBEL74UE2BN3AO433QECSA2A76NFISVIQ/m/maven-enforcer-plugin/target/it/builds_a_pom_noop/build.log, /home/jenkins/jenkins-slave/workspace/aven-enforcer_MENFORCER-294-IBUS6H5LUW3LLGQ77JNQBEL74UE2BN3AO433QECSA2A76NFISVIQ/m/maven-enforcer-plugin/target/it/cli-always-fail/build.log, /home/jenkins/jenkins-slave/workspace/aven-enforcer_MENFORCER-294-IBUS6H5LUW3LLGQ77JNQBEL74UE2BN3AO433QECSA2A76NFISVIQ/m/maven-enforcer-plugin/target/it/cli-always-pass/build.log, /home/jenkins/jenkins-slave/workspace/aven-enforcer_MENFORCER-294-IBUS6H5LUW3LLGQ77JNQBEL74UE2BN3AO433QECSA2A76NFISVIQ/m/maven-enforcer-plugin/target/it/dependencies_converge/build.log, /home/jenkins/jenkins-slave/workspace/aven-enforcer_MENFORCER-294-IBUS6H5LUW3LLGQ77JNQBEL74UE2BN3AO433QECSA2A76NFISVIQ/m/maven-enforcer-plugin/target/it/dependencies_not_converging/build.log, /home/jenkins/jenkins-slave/workspace/aven-enforcer_MENFORCER-294-IBUS6H5LUW3LLGQ77JNQBEL74UE2BN3AO433QECSA2A76NFISVIQ/m/maven-enforcer-plugin/target/it/dependencies_not_converging_test_scope/build.log, /home/jenkins/jenkins-slave/workspace/aven-enforcer_MENFORCER-294-IBUS6H5LUW3LLGQ77JNQBEL74UE2BN3AO433QECSA2A76NFISVIQ/m/maven-enforcer-plugin/target/it/display-info/build.log, /home/jenkins/jenkins-slave/workspace/aven-enforcer_MENFORCER-294-IBUS6H5LUW3LLGQ77JNQBEL74UE2BN3AO433QECSA2A76NFISVIQ/m/maven-enforcer-plugin/target/it/evaluate-beanshell/build.log, /home/jenkins/jenkins-slave/workspace/aven-enforcer_MENFORCER-294-IBUS6H5LUW3LLGQ77JNQBEL74UE2BN3AO433QECSA2A76NFISVIQ/m/maven-enforcer-plugin/target/it/multimodule/build.log, /home/jenkins/jenkins-slave/workspace/aven-enforcer_MENFORCER-294-IBUS6H5LUW3LLGQ77JNQBEL74UE2BN3AO433QECSA2A76NFISVIQ/m/maven-enforcer-plugin/target/it/require-active-profile-all/build.log, /home/jenkins/jenkins-slave/workspace/aven-enforcer_MENFORCER-294-IBUS6H5LUW3LLGQ77JNQBEL74UE2BN3AO433QECSA2A76NFISVIQ/m/maven-enforcer-plugin/target/it/require-active-profile-from-settings/build.log, /home/jenkins/jenkins-slave/workspace/aven-enforcer_MENFORCER-294-IBUS6H5LUW3LLGQ77JNQBEL74UE2BN3AO433QECSA2A76NFISVIQ/m/maven-enforcer-plugin/target/it/require-active-profile/build.log, /home/jenkins/jenkins-slave/workspace/aven-enforcer_MENFORCER-294-IBUS6H5LUW3LLGQ77JNQBEL74UE2BN3AO433QECSA2A76NFISVIQ/m/maven-enforcer-plugin/target/it/require-file-checksum/build.log, /home/jenkins/jenkins-slave/workspace/aven-enforcer_MENFORCER-294-IBUS6H5LUW3LLGQ77JNQBEL74UE2BN3AO433QECSA2A76NFISVIQ/m/maven-enforcer-plugin/target/it/require-files-dont-exist/build.log, /home/jenkins/jenkins-slave/workspace/aven-enforcer_MENFORCER-294-IBUS6H5LUW3LLGQ77JNQBEL74UE2BN3AO433QECSA2A76NFISVIQ/m/maven-enforcer-plugin/target/it/require-files-exist/build.log, /home/jenkins/jenkins-slave/workspace/aven-enforcer_MENFORCER-294-IBUS6H5LUW3LLGQ77JNQBEL74UE2BN3AO433QECSA2A76NFISVIQ/m/maven-enforcer-plugin/target/it/require-files-size/build.log, /home/jenkins/jenkins-slave/workspace/aven-enforcer_MENFORCER-294-IBUS6H5LUW3LLGQ77JNQBEL74UE2BN3AO433QECSA2A76NFISVIQ/m/maven-enforcer-plugin/target/it/require-java-version/build.log, /home/jenkins/jenkins-slave/workspace/aven-enforcer_MENFORCER-294-IBUS6H5LUW3LLGQ77JNQBEL74UE2BN3AO433QECSA2A76NFISVIQ/m/maven-enforcer-plugin/target/it/require-maven-version/build.log, /home/jenkins/jenkins-slave/workspace/aven-enforcer_MENFORCER-294-IBUS6H5LUW3LLGQ77JNQBEL74UE2BN3AO433QECSA2A76NFISVIQ/m/maven-enforcer-plugin/target/it/require-no-repositories-allow-plugin-repo/build.log, /home/jenkins/jenkins-slave/workspace/aven-enforcer_MENFORCER-294-IBUS6H5LUW3LLGQ77JNQBEL74UE2BN3AO433QECSA2A76NFISVIQ/m/maven-enforcer-plugin/target/it/require-no-repositories-allow-repo/build.log, /home/jenkins/jenkins-slave/workspace/aven-enforcer_MENFORCER-294-IBUS6H5LUW3LLGQ77JNQBEL74UE2BN3AO433QECSA2A76NFISVIQ/m/maven-enforcer-plugin/target/it/require-no-repositories/build.log, /home/jenkins/jenkins-slave/workspace/aven-enforcer_MENFORCER-294-IBUS6H5LUW3LLGQ77JNQBEL74UE2BN3AO433QECSA2A76NFISVIQ/m/maven-enforcer-plugin/target/it/require-no-repositories_failure/build.log, /home/jenkins/jenkins-slave/workspace/aven-enforcer_MENFORCER-294-IBUS6H5LUW3LLGQ77JNQBEL74UE2BN3AO433QECSA2A76NFISVIQ/m/maven-enforcer-plugin/target/it/require-no-repositories_failure_allowed-plugin-repo/build.log, /home/jenkins/jenkins-slave/workspace/aven-enforcer_MENFORCER-294-IBUS6H5LUW3LLGQ77JNQBEL74UE2BN3AO433QECSA2A76NFISVIQ/m/maven-enforcer-plugin/target/it/require-no-repositories_failure_plugin-repositories/build.log, /home/jenkins/jenkins-slave/workspace/aven-enforcer_MENFORCER-294-IBUS6H5LUW3LLGQ77JNQBEL74UE2BN3AO433QECSA2A76NFISVIQ/m/maven-enforcer-plugin/target/it/require-no-repositories_failure_repositories/build.log, /home/jenkins/jenkins-slave/workspace/aven-enforcer_MENFORCER-294-IBUS6H5LUW3LLGQ77JNQBEL74UE2BN3AO433QECSA2A76NFISVIQ/m/maven-enforcer-plugin/target/it/require-no-repositories_mm/build.log, /home/jenkins/jenkins-slave/workspace/aven-enforcer_MENFORCER-294-IBUS6H5LUW3LLGQ77JNQBEL74UE2BN3AO433QECSA2A76NFISVIQ/m/maven-enforcer-plugin/target/it/require-no-repositories_mm_ci/build.log, /home/jenkins/jenkins-slave/workspace/aven-enforcer_MENFORCER-294-IBUS6H5LUW3LLGQ77JNQBEL74UE2BN3AO433QECSA2A76NFISVIQ/m/maven-enforcer-plugin/target/it/require-plugin-versions-ci/build.log, /home/jenkins/jenkins-slave/workspace/aven-enforcer_MENFORCER-294-IBUS6H5LUW3LLGQ77JNQBEL74UE2BN3AO433QECSA2A76NFISVIQ/m/maven-enforcer-plugin/target/it/require-plugin-versions-custom-packaging/build.log, /home/jenkins/jenkins-slave/workspace/aven-enforcer_MENFORCER-294-IBUS6H5LUW3LLGQ77JNQBEL74UE2BN3AO433QECSA2A76NFISVIQ/m/maven-enforcer-plugin/target/it/require-plugin-versions-expressions/build.log, /home/jenkins/jenkins-slave/workspace/aven-enforcer_MENFORCER-294-IBUS6H5LUW3LLGQ77JNQBEL74UE2BN3AO433QECSA2A76NFISVIQ/m/maven-enforcer-plugin/target/it/require-plugin-versions-mm-ci-friendly/build.log, /home/jenkins/jenkins-slave/workspace/aven-enforcer_MENFORCER-294-IBUS6H5LUW3LLGQ77JNQBEL74UE2BN3AO433QECSA2A76NFISVIQ/m/maven-enforcer-plugin/target/it/require-plugin-versions-plugin-with-extensions/build.log, /home/jenkins/jenkins-slave/workspace/aven-enforcer_MENFORCER-294-IBUS6H5LUW3LLGQ77JNQBEL74UE2BN3AO433QECSA2A76NFISVIQ/m/maven-enforcer-plugin/target/it/require-plugin-versions-plugin-with-integration-test-lifecycle/build.log, /home/jenkins/jenkins-slave/workspace/aven-enforcer_MENFORCER-294-IBUS6H5LUW3LLGQ77JNQBEL74UE2BN3AO433QECSA2A76NFISVIQ/m/maven-enforcer-plugin/target/it/require-plugin-versions-projectGAVexpressions/build.log, /home/jenkins/jenkins-slave/workspace/aven-enforcer_MENFORCER-294-IBUS6H5LUW3LLGQ77JNQBEL74UE2BN3AO433QECSA2A76NFISVIQ/m/maven-enforcer-plugin/target/it/require-plugin-versions/build.log, /home/jenkins/jenkins-slave/workspace/aven-enforcer_MENFORCER-294-IBUS6H5LUW3LLGQ77JNQBEL74UE2BN3AO433QECSA2A76NFISVIQ/m/maven-enforcer-plugin/target/it/require-profile-ids-exist_failure/build.log, /home/jenkins/jenkins-slave/workspace/aven-enforcer_MENFORCER-294-IBUS6H5LUW3LLGQ77JNQBEL74UE2BN3AO433QECSA2A76NFISVIQ/m/maven-enforcer-plugin/target/it/require-profile-ids-exist_success/build.log, /home/jenkins/jenkins-slave/workspace/aven-enforcer_MENFORCER-294-IBUS6H5LUW3LLGQ77JNQBEL74UE2BN3AO433QECSA2A76NFISVIQ/m/maven-enforcer-plugin/target/it/require-property/build.log, /home/jenkins/jenkins-slave/workspace/aven-enforcer_MENFORCER-294-IBUS6H5LUW3LLGQ77JNQBEL74UE2BN3AO433QECSA2A76NFISVIQ/m/maven-enforcer-plugin/target/it/require-release-dependencies-excludes/build.log, /home/jenkins/jenkins-slave/workspace/aven-enforcer_MENFORCER-294-IBUS6H5LUW3LLGQ77JNQBEL74UE2BN3AO433QECSA2A76NFISVIQ/m/maven-enforcer-plugin/target/it/require-release-dependencies-excludes_failure/build.log, /home/jenkins/jenkins-slave/workspace/aven-enforcer_MENFORCER-294-IBUS6H5LUW3LLGQ77JNQBEL74UE2BN3AO433QECSA2A76NFISVIQ/m/maven-enforcer-plugin/target/it/require-release-dependencies/build.log, /home/jenkins/jenkins-slave/workspace/aven-enforcer_MENFORCER-294-IBUS6H5LUW3LLGQ77JNQBEL74UE2BN3AO433QECSA2A76NFISVIQ/m/maven-enforcer-plugin/target/it/require-release-version/build.log, /home/jenkins/jenkins-slave/workspace/aven-enforcer_MENFORCER-294-IBUS6H5LUW3LLGQ77JNQBEL74UE2BN3AO433QECSA2A76NFISVIQ/m/maven-enforcer-plugin/target/it/require-same-versions_failure/build.log, /home/jenkins/jenkins-slave/workspace/aven-enforcer_MENFORCER-294-IBUS6H5LUW3LLGQ77JNQBEL74UE2BN3AO433QECSA2A76NFISVIQ/m/maven-enforcer-plugin/target/it/require-same-versions_success/build.log, /home/jenkins/jenkins-slave/workspace/aven-enforcer_MENFORCER-294-IBUS6H5LUW3LLGQ77JNQBEL74UE2BN3AO433QECSA2A76NFISVIQ/m/maven-enforcer-plugin/target/it/require-snapshot-version_failure/build.log, /home/jenkins/jenkins-slave/workspace/aven-enforcer_MENFORCER-294-IBUS6H5LUW3LLGQ77JNQBEL74UE2BN3AO433QECSA2A76NFISVIQ/m/maven-enforcer-plugin/target/it/require-snapshot-version_success/build.log, /home/jenkins/jenkins-slave/workspace/aven-enforcer_MENFORCER-294-IBUS6H5LUW3LLGQ77JNQBEL74UE2BN3AO433QECSA2A76NFISVIQ/m/maven-enforcer-plugin/target/it/require-upper-bound-dependencies-managed_failure/build.log, /home/jenkins/jenkins-slave/workspace/aven-enforcer_MENFORCER-294-IBUS6H5LUW3LLGQ77JNQBEL74UE2BN3AO433QECSA2A76NFISVIQ/m/maven-enforcer-plugin/target/it/require-upper-bound-dependencies-managed_success/build.log, /home/jenkins/jenkins-slave/workspace/aven-enforcer_MENFORCER-294-IBUS6H5LUW3LLGQ77JNQBEL74UE2BN3AO433QECSA2A76NFISVIQ/m/maven-enforcer-plugin/target/it/require-upper-bound-dependencies-unique_failure/build.log, /home/jenkins/jenkins-slave/workspace/aven-enforcer_MENFORCER-294-IBUS6H5LUW3LLGQ77JNQBEL74UE2BN3AO433QECSA2A76NFISVIQ/m/maven-enforcer-plugin/target/it/require-upper-bound-dependencies-unique_success/build.log, /home/jenkins/jenkins-slave/workspace/aven-enforcer_MENFORCER-294-IBUS6H5LUW3LLGQ77JNQBEL74UE2BN3AO433QECSA2A76NFISVIQ/m/maven-enforcer-plugin/target/it/require-upper-bound-deps_failure/build.log, /home/jenkins/jenkins-slave/workspace/aven-enforcer_MENFORCER-294-IBUS6H5LUW3LLGQ77JNQBEL74UE2BN3AO433QECSA2A76NFISVIQ/m/maven-enforcer-plugin/target/it/require-upper-bound-deps_ignored/build.log, /home/jenkins/jenkins-slave/workspace/aven-enforcer_MENFORCER-294-IBUS6H5LUW3LLGQ77JNQBEL74UE2BN3AO433QECSA2A76NFISVIQ/m/maven-enforcer-plugin/target/it/require-upper-bound-deps_success/build.log, /home/jenkins/jenkins-slave/workspace/aven-enforcer_MENFORCER-294-IBUS6H5LUW3LLGQ77JNQBEL74UE2BN3AO433QECSA2A76NFISVIQ/m/maven-enforcer-plugin/target/it/resolve_collect_dependencies/build.log]
[linux-jdk10] Finished parsing Maven Invoker results (found 68)
[linux-jdk10] [withMaven] junitPublisher - Archive test results for Maven artifact org.apache.maven.enforcer:enforcer-api:3.0.0-SNAPSHOT generated by maven-surefire-plugin:test (default-test): m/enforcer-api/target/surefire-reports/*.xml
[linux-jdk10] Recording test results
[linux-jdk10] None of the test reports contained any result
[linux-jdk10] [withMaven] junitPublisher - Archive test results for Maven artifact org.apache.maven.enforcer:enforcer-rules:3.0.0-SNAPSHOT generated by maven-surefire-plugin:test (default-test): m/enforcer-rules/target/surefire-reports/*.xml
[linux-jdk10] Recording test results
[linux-jdk10] [withMaven] junitPublisher - Archive test results for Maven artifact org.apache.maven.plugins:maven-enforcer-plugin:3.0.0-SNAPSHOT generated by maven-surefire-plugin:test (default-test): m/maven-enforcer-plugin/target/surefire-reports/*.xml
[linux-jdk10] Recording test results
[Pipeline] [linux-jdk10] // withMaven
[Pipeline] [linux-jdk10] cleanWs
[linux-jdk10] [WS-CLEANUP] Deleting project workspace...[WS-CLEANUP] done
[Pipeline] [linux-jdk10] }
[Pipeline] [linux-jdk10] // stage
[Pipeline] [linux-jdk10] }
[Pipeline] [linux-jdk10] // node
[Pipeline] [linux-jdk10] }
[Pipeline] // parallel
[Pipeline] stage
[Pipeline] { (Notifications)
[Pipeline] echo
Build result: UNSTABLE
[Pipeline] jiraIssueSelector
[Pipeline] emailext