You are viewing a plain text version of this content. The canonical link for it is here.
Posted to dev@hive.apache.org by Murli Varadachari <mv...@facebook.com> on 2009/04/08 02:58:08 UTC
*UNIT TEST FAILURE for apache HIVE* based on SVN Rev# 763043.117
[junit] Test org.apache.hadoop.hive.cli.TestCliDriver FAILED
BUILD FAILED
[junit] Test org.apache.hadoop.hive.cli.TestCliDriver FAILED
BUILD FAILED