You are viewing a plain text version of this content. The canonical link for it is here.
Posted to dev@lucene.apache.org by Policeman Jenkins Server <je...@thetaphi.de> on 2019/04/07 20:22:43 UTC

[JENKINS] Lucene-Solr-master-Linux (64bit/jdk1.8.0_172) - Build # 23882 - Unstable!

Build: https://jenkins.thetaphi.de/job/Lucene-Solr-master-Linux/23882/
Java: 64bit/jdk1.8.0_172 -XX:-UseCompressedOops -XX:+UseG1GC

1 tests failed.
FAILED:  org.apache.solr.cloud.api.collections.TestCollectionAPI.test

Error Message:
Could not find a healthy node to handle the request.

Stack Trace:
org.apache.solr.common.SolrException: Could not find a healthy node to handle the request.
	at __randomizedtesting.SeedInfo.seed([2C3A633764C1BE0F:A46E5CEDCA3DD3F7]:0)
	at org.apache.solr.client.solrj.impl.BaseCloudSolrClient.sendRequest(BaseCloudSolrClient.java:1049)
	at org.apache.solr.client.solrj.impl.BaseCloudSolrClient.requestWithRetryOnStaleState(BaseCloudSolrClient.java:830)
	at org.apache.solr.client.solrj.impl.BaseCloudSolrClient.request(BaseCloudSolrClient.java:763)
	at org.apache.solr.client.solrj.SolrRequest.process(SolrRequest.java:207)
	at org.apache.solr.client.solrj.SolrClient.commit(SolrClient.java:504)
	at org.apache.solr.client.solrj.SolrClient.commit(SolrClient.java:460)
	at org.apache.solr.cloud.api.collections.TestCollectionAPI.testClusterStateMigration(TestCollectionAPI.java:833)
	at org.apache.solr.cloud.api.collections.TestCollectionAPI.test(TestCollectionAPI.java:93)
	at sun.reflect.NativeMethodAccessorImpl.invoke0(Native Method)
	at sun.reflect.NativeMethodAccessorImpl.invoke(NativeMethodAccessorImpl.java:62)
	at sun.reflect.DelegatingMethodAccessorImpl.invoke(DelegatingMethodAccessorImpl.java:43)
	at java.lang.reflect.Method.invoke(Method.java:498)
	at com.carrotsearch.randomizedtesting.RandomizedRunner.invoke(RandomizedRunner.java:1750)
	at com.carrotsearch.randomizedtesting.RandomizedRunner$8.evaluate(RandomizedRunner.java:938)
	at com.carrotsearch.randomizedtesting.RandomizedRunner$9.evaluate(RandomizedRunner.java:974)
	at com.carrotsearch.randomizedtesting.RandomizedRunner$10.evaluate(RandomizedRunner.java:988)
	at org.apache.solr.BaseDistributedSearchTestCase$ShardsRepeatRule$ShardsFixedStatement.callStatement(BaseDistributedSearchTestCase.java:1082)
	at org.apache.solr.BaseDistributedSearchTestCase$ShardsRepeatRule$ShardsStatement.evaluate(BaseDistributedSearchTestCase.java:1054)
	at com.carrotsearch.randomizedtesting.rules.SystemPropertiesRestoreRule$1.evaluate(SystemPropertiesRestoreRule.java:57)
	at org.apache.lucene.util.TestRuleSetupTeardownChained$1.evaluate(TestRuleSetupTeardownChained.java:49)
	at org.apache.lucene.util.AbstractBeforeAfterRule$1.evaluate(AbstractBeforeAfterRule.java:45)
	at org.apache.lucene.util.TestRuleThreadAndTestName$1.evaluate(TestRuleThreadAndTestName.java:48)
	at org.apache.lucene.util.TestRuleIgnoreAfterMaxFailures$1.evaluate(TestRuleIgnoreAfterMaxFailures.java:64)
	at org.apache.lucene.util.TestRuleMarkFailure$1.evaluate(TestRuleMarkFailure.java:47)
	at com.carrotsearch.randomizedtesting.rules.StatementAdapter.evaluate(StatementAdapter.java:36)
	at com.carrotsearch.randomizedtesting.ThreadLeakControl$StatementRunner.run(ThreadLeakControl.java:368)
	at com.carrotsearch.randomizedtesting.ThreadLeakControl.forkTimeoutingTask(ThreadLeakControl.java:817)
	at com.carrotsearch.randomizedtesting.ThreadLeakControl$3.evaluate(ThreadLeakControl.java:468)
	at com.carrotsearch.randomizedtesting.RandomizedRunner.runSingleTest(RandomizedRunner.java:947)
	at com.carrotsearch.randomizedtesting.RandomizedRunner$5.evaluate(RandomizedRunner.java:832)
	at com.carrotsearch.randomizedtesting.RandomizedRunner$6.evaluate(RandomizedRunner.java:883)
	at com.carrotsearch.randomizedtesting.RandomizedRunner$7.evaluate(RandomizedRunner.java:894)
	at com.carrotsearch.randomizedtesting.rules.StatementAdapter.evaluate(StatementAdapter.java:36)
	at com.carrotsearch.randomizedtesting.rules.SystemPropertiesRestoreRule$1.evaluate(SystemPropertiesRestoreRule.java:57)
	at org.apache.lucene.util.AbstractBeforeAfterRule$1.evaluate(AbstractBeforeAfterRule.java:45)
	at com.carrotsearch.randomizedtesting.rules.StatementAdapter.evaluate(StatementAdapter.java:36)
	at org.apache.lucene.util.TestRuleStoreClassName$1.evaluate(TestRuleStoreClassName.java:41)
	at com.carrotsearch.randomizedtesting.rules.NoShadowingOrOverridesOnMethodsRule$1.evaluate(NoShadowingOrOverridesOnMethodsRule.java:40)
	at com.carrotsearch.randomizedtesting.rules.NoShadowingOrOverridesOnMethodsRule$1.evaluate(NoShadowingOrOverridesOnMethodsRule.java:40)
	at com.carrotsearch.randomizedtesting.rules.StatementAdapter.evaluate(StatementAdapter.java:36)
	at com.carrotsearch.randomizedtesting.rules.StatementAdapter.evaluate(StatementAdapter.java:36)
	at com.carrotsearch.randomizedtesting.rules.StatementAdapter.evaluate(StatementAdapter.java:36)
	at org.apache.lucene.util.TestRuleAssertionsRequired$1.evaluate(TestRuleAssertionsRequired.java:53)
	at org.apache.lucene.util.TestRuleMarkFailure$1.evaluate(TestRuleMarkFailure.java:47)
	at org.apache.lucene.util.TestRuleIgnoreAfterMaxFailures$1.evaluate(TestRuleIgnoreAfterMaxFailures.java:64)
	at org.apache.lucene.util.TestRuleIgnoreTestSuites$1.evaluate(TestRuleIgnoreTestSuites.java:54)
	at com.carrotsearch.randomizedtesting.rules.StatementAdapter.evaluate(StatementAdapter.java:36)
	at com.carrotsearch.randomizedtesting.ThreadLeakControl$StatementRunner.run(ThreadLeakControl.java:368)
	at java.lang.Thread.run(Thread.java:748)




Build Log:
[...truncated 13505 lines...]
   [junit4] Suite: org.apache.solr.cloud.api.collections.TestCollectionAPI
   [junit4]   2> Creating dataDir: /home/jenkins/workspace/Lucene-Solr-master-Linux/solr/build/solr-core/test/J1/temp/solr.cloud.api.collections.TestCollectionAPI_2C3A633764C1BE0F-001/init-core-data-001
   [junit4]   2> 661459 WARN  (SUITE-TestCollectionAPI-seed#[2C3A633764C1BE0F]-worker) [    ] o.a.s.SolrTestCaseJ4 startTrackingSearchers: numOpens=13 numCloses=13
   [junit4]   2> 661460 INFO  (SUITE-TestCollectionAPI-seed#[2C3A633764C1BE0F]-worker) [    ] o.a.s.SolrTestCaseJ4 Using PointFields (NUMERIC_POINTS_SYSPROP=true) w/NUMERIC_DOCVALUES_SYSPROP=true
   [junit4]   2> 661469 INFO  (SUITE-TestCollectionAPI-seed#[2C3A633764C1BE0F]-worker) [    ] o.a.s.SolrTestCaseJ4 Randomized ssl (false) and clientAuth (false) via: @org.apache.solr.util.RandomizeSSL(reason=, value=NaN, ssl=NaN, clientAuth=NaN)
   [junit4]   2> 661469 INFO  (SUITE-TestCollectionAPI-seed#[2C3A633764C1BE0F]-worker) [    ] o.a.s.SolrTestCaseJ4 SecureRandom sanity checks: test.solr.allowed.securerandom=null & java.security.egd=file:/dev/./urandom
   [junit4]   2> 661470 INFO  (SUITE-TestCollectionAPI-seed#[2C3A633764C1BE0F]-worker) [    ] o.a.s.BaseDistributedSearchTestCase Setting hostContext system property: /
   [junit4]   2> 661478 INFO  (TEST-TestCollectionAPI.test-seed#[2C3A633764C1BE0F]) [    ] o.a.s.c.ZkTestServer STARTING ZK TEST SERVER
   [junit4]   2> 661479 INFO  (ZkTestServer Run Thread) [    ] o.a.s.c.ZkTestServer client port:0.0.0.0/0.0.0.0:0
   [junit4]   2> 661479 INFO  (ZkTestServer Run Thread) [    ] o.a.s.c.ZkTestServer Starting server
   [junit4]   2> 661579 INFO  (TEST-TestCollectionAPI.test-seed#[2C3A633764C1BE0F]) [    ] o.a.s.c.ZkTestServer start zk server on port:42973
   [junit4]   2> 661579 INFO  (TEST-TestCollectionAPI.test-seed#[2C3A633764C1BE0F]) [    ] o.a.s.c.ZkTestServer parse host and port list: 127.0.0.1:42973
   [junit4]   2> 661579 INFO  (TEST-TestCollectionAPI.test-seed#[2C3A633764C1BE0F]) [    ] o.a.s.c.ZkTestServer connecting to 127.0.0.1 42973
   [junit4]   2> 661605 INFO  (zkConnectionManagerCallback-3779-thread-1) [    ] o.a.s.c.c.ConnectionManager zkClient has connected
   [junit4]   2> 661613 INFO  (zkConnectionManagerCallback-3781-thread-1) [    ] o.a.s.c.c.ConnectionManager zkClient has connected
   [junit4]   2> 661614 INFO  (TEST-TestCollectionAPI.test-seed#[2C3A633764C1BE0F]) [    ] o.a.s.c.ZkTestServer put /home/jenkins/workspace/Lucene-Solr-master-Linux/solr/core/src/test-files/solr/collection1/conf/solrconfig-tlog.xml to /configs/conf1/solrconfig.xml
   [junit4]   2> 661614 INFO  (TEST-TestCollectionAPI.test-seed#[2C3A633764C1BE0F]) [    ] o.a.s.c.ZkTestServer put /home/jenkins/workspace/Lucene-Solr-master-Linux/solr/core/src/test-files/solr/collection1/conf/schema15.xml to /configs/conf1/schema.xml
   [junit4]   2> 661615 INFO  (TEST-TestCollectionAPI.test-seed#[2C3A633764C1BE0F]) [    ] o.a.s.c.ZkTestServer put /home/jenkins/workspace/Lucene-Solr-master-Linux/solr/core/src/test-files/solr/collection1/conf/solrconfig.snippet.randomindexconfig.xml to /configs/conf1/solrconfig.snippet.randomindexconfig.xml
   [junit4]   2> 661615 INFO  (TEST-TestCollectionAPI.test-seed#[2C3A633764C1BE0F]) [    ] o.a.s.c.ZkTestServer put /home/jenkins/workspace/Lucene-Solr-master-Linux/solr/core/src/test-files/solr/collection1/conf/stopwords.txt to /configs/conf1/stopwords.txt
   [junit4]   2> 661616 INFO  (TEST-TestCollectionAPI.test-seed#[2C3A633764C1BE0F]) [    ] o.a.s.c.ZkTestServer put /home/jenkins/workspace/Lucene-Solr-master-Linux/solr/core/src/test-files/solr/collection1/conf/protwords.txt to /configs/conf1/protwords.txt
   [junit4]   2> 661616 INFO  (TEST-TestCollectionAPI.test-seed#[2C3A633764C1BE0F]) [    ] o.a.s.c.ZkTestServer put /home/jenkins/workspace/Lucene-Solr-master-Linux/solr/core/src/test-files/solr/collection1/conf/currency.xml to /configs/conf1/currency.xml
   [junit4]   2> 661617 INFO  (TEST-TestCollectionAPI.test-seed#[2C3A633764C1BE0F]) [    ] o.a.s.c.ZkTestServer put /home/jenkins/workspace/Lucene-Solr-master-Linux/solr/core/src/test-files/solr/collection1/conf/enumsConfig.xml to /configs/conf1/enumsConfig.xml
   [junit4]   2> 661617 INFO  (TEST-TestCollectionAPI.test-seed#[2C3A633764C1BE0F]) [    ] o.a.s.c.ZkTestServer put /home/jenkins/workspace/Lucene-Solr-master-Linux/solr/core/src/test-files/solr/collection1/conf/open-exchange-rates.json to /configs/conf1/open-exchange-rates.json
   [junit4]   2> 661618 INFO  (TEST-TestCollectionAPI.test-seed#[2C3A633764C1BE0F]) [    ] o.a.s.c.ZkTestServer put /home/jenkins/workspace/Lucene-Solr-master-Linux/solr/core/src/test-files/solr/collection1/conf/mapping-ISOLatin1Accent.txt to /configs/conf1/mapping-ISOLatin1Accent.txt
   [junit4]   2> 661619 INFO  (TEST-TestCollectionAPI.test-seed#[2C3A633764C1BE0F]) [    ] o.a.s.c.ZkTestServer put /home/jenkins/workspace/Lucene-Solr-master-Linux/solr/core/src/test-files/solr/collection1/conf/old_synonyms.txt to /configs/conf1/old_synonyms.txt
   [junit4]   2> 661619 INFO  (TEST-TestCollectionAPI.test-seed#[2C3A633764C1BE0F]) [    ] o.a.s.c.ZkTestServer put /home/jenkins/workspace/Lucene-Solr-master-Linux/solr/core/src/test-files/solr/collection1/conf/synonyms.txt to /configs/conf1/synonyms.txt
   [junit4]   2> 661620 INFO  (TEST-TestCollectionAPI.test-seed#[2C3A633764C1BE0F]) [    ] o.a.s.c.AbstractFullDistribZkTestBase Will use NRT replicas unless explicitly asked otherwise
   [junit4]   2> 661708 WARN  (TEST-TestCollectionAPI.test-seed#[2C3A633764C1BE0F]) [    ] o.e.j.s.AbstractConnector Ignoring deprecated socket close linger time
   [junit4]   2> 661709 INFO  (TEST-TestCollectionAPI.test-seed#[2C3A633764C1BE0F]) [    ] o.a.s.c.s.e.JettySolrRunner Start Jetty (original configured port=0)
   [junit4]   2> 661709 INFO  (TEST-TestCollectionAPI.test-seed#[2C3A633764C1BE0F]) [    ] o.a.s.c.s.e.JettySolrRunner Trying to start Jetty on port 0 try number 1 ...
   [junit4]   2> 661709 INFO  (TEST-TestCollectionAPI.test-seed#[2C3A633764C1BE0F]) [    ] o.e.j.s.Server jetty-9.4.14.v20181114; built: 2018-11-14T21:20:31.478Z; git: c4550056e785fb5665914545889f21dc136ad9e6; jvm 1.8.0_172-b11
   [junit4]   2> 661731 INFO  (TEST-TestCollectionAPI.test-seed#[2C3A633764C1BE0F]) [    ] o.e.j.s.session DefaultSessionIdManager workerName=node0
   [junit4]   2> 661731 INFO  (TEST-TestCollectionAPI.test-seed#[2C3A633764C1BE0F]) [    ] o.e.j.s.session No SessionScavenger set, using defaults
   [junit4]   2> 661731 INFO  (TEST-TestCollectionAPI.test-seed#[2C3A633764C1BE0F]) [    ] o.e.j.s.session node0 Scavenging every 600000ms
   [junit4]   2> 661731 INFO  (TEST-TestCollectionAPI.test-seed#[2C3A633764C1BE0F]) [    ] o.e.j.s.h.ContextHandler Started o.e.j.s.ServletContextHandler@ea8aa5c{/,null,AVAILABLE}
   [junit4]   2> 661734 INFO  (TEST-TestCollectionAPI.test-seed#[2C3A633764C1BE0F]) [    ] o.e.j.s.AbstractConnector Started ServerConnector@4f9a5be3{HTTP/1.1,[http/1.1, h2c]}{127.0.0.1:40161}
   [junit4]   2> 661734 INFO  (TEST-TestCollectionAPI.test-seed#[2C3A633764C1BE0F]) [    ] o.e.j.s.Server Started @661873ms
   [junit4]   2> 661734 INFO  (TEST-TestCollectionAPI.test-seed#[2C3A633764C1BE0F]) [    ] o.a.s.c.s.e.JettySolrRunner Jetty properties: {solr.data.dir=/home/jenkins/workspace/Lucene-Solr-master-Linux/solr/build/solr-core/test/J1/temp/solr.cloud.api.collections.TestCollectionAPI_2C3A633764C1BE0F-001/tempDir-001/control/data, hostContext=/, hostPort=40161, coreRootDirectory=/home/jenkins/workspace/Lucene-Solr-master-Linux/solr/build/solr-core/test/J1/../../../../../../../../../home/jenkins/workspace/Lucene-Solr-master-Linux/solr/build/solr-core/test/J1/temp/solr.cloud.api.collections.TestCollectionAPI_2C3A633764C1BE0F-001/control-001/cores}
   [junit4]   2> 661735 ERROR (TEST-TestCollectionAPI.test-seed#[2C3A633764C1BE0F]) [    ] o.a.s.u.StartupLoggingUtils Missing Java Option solr.log.dir. Logging may be missing or incomplete.
   [junit4]   2> 661735 INFO  (TEST-TestCollectionAPI.test-seed#[2C3A633764C1BE0F]) [    ] o.a.s.s.SolrDispatchFilter Using logger factory org.apache.logging.slf4j.Log4jLoggerFactory
   [junit4]   2> 661735 INFO  (TEST-TestCollectionAPI.test-seed#[2C3A633764C1BE0F]) [    ] o.a.s.s.SolrDispatchFilter  ___      _       Welcome to Apache Solr? version 9.0.0
   [junit4]   2> 661735 INFO  (TEST-TestCollectionAPI.test-seed#[2C3A633764C1BE0F]) [    ] o.a.s.s.SolrDispatchFilter / __| ___| |_ _   Starting in cloud mode on port null
   [junit4]   2> 661735 INFO  (TEST-TestCollectionAPI.test-seed#[2C3A633764C1BE0F]) [    ] o.a.s.s.SolrDispatchFilter \__ \/ _ \ | '_|  Install dir: null
   [junit4]   2> 661735 INFO  (TEST-TestCollectionAPI.test-seed#[2C3A633764C1BE0F]) [    ] o.a.s.s.SolrDispatchFilter |___/\___/_|_|    Start time: 2019-04-07T19:26:14.153Z
   [junit4]   2> 661741 INFO  (zkConnectionManagerCallback-3783-thread-1) [    ] o.a.s.c.c.ConnectionManager zkClient has connected
   [junit4]   2> 661742 INFO  (TEST-TestCollectionAPI.test-seed#[2C3A633764C1BE0F]) [    ] o.a.s.s.SolrDispatchFilter Loading solr.xml from SolrHome (not found in ZooKeeper)
   [junit4]   2> 661742 INFO  (TEST-TestCollectionAPI.test-seed#[2C3A633764C1BE0F]) [    ] o.a.s.c.SolrXmlConfig Loading container configuration from /home/jenkins/workspace/Lucene-Solr-master-Linux/solr/build/solr-core/test/J1/temp/solr.cloud.api.collections.TestCollectionAPI_2C3A633764C1BE0F-001/control-001/solr.xml
   [junit4]   2> 661744 INFO  (TEST-TestCollectionAPI.test-seed#[2C3A633764C1BE0F]) [    ] o.a.s.c.SolrXmlConfig Configuration parameter autoReplicaFailoverWorkLoopDelay is ignored
   [junit4]   2> 661744 INFO  (TEST-TestCollectionAPI.test-seed#[2C3A633764C1BE0F]) [    ] o.a.s.c.SolrXmlConfig Configuration parameter autoReplicaFailoverBadNodeExpiration is ignored
   [junit4]   2> 661745 INFO  (TEST-TestCollectionAPI.test-seed#[2C3A633764C1BE0F]) [    ] o.a.s.c.SolrXmlConfig MBean server found: com.sun.jmx.mbeanserver.JmxMBeanServer@148acbb, but no JMX reporters were configured - adding default JMX reporter.
   [junit4]   2> 661848 INFO  (TEST-TestCollectionAPI.test-seed#[2C3A633764C1BE0F]) [    ] o.a.s.h.c.HttpShardHandlerFactory Host whitelist initialized: WhitelistHostChecker [whitelistHosts=null, whitelistHostCheckingEnabled=false]
   [junit4]   2> 661857 WARN  (TEST-TestCollectionAPI.test-seed#[2C3A633764C1BE0F]) [    ] o.e.j.u.s.S.config No Client EndPointIdentificationAlgorithm configured for SslContextFactory@a09431d[provider=null,keyStore=null,trustStore=null]
   [junit4]   2> 661882 WARN  (TEST-TestCollectionAPI.test-seed#[2C3A633764C1BE0F]) [    ] o.e.j.u.s.S.config No Client EndPointIdentificationAlgorithm configured for SslContextFactory@2fa6536e[provider=null,keyStore=null,trustStore=null]
   [junit4]   2> 661883 INFO  (TEST-TestCollectionAPI.test-seed#[2C3A633764C1BE0F]) [    ] o.a.s.c.ZkContainer Zookeeper client=127.0.0.1:42973/solr
   [junit4]   2> 661897 INFO  (zkConnectionManagerCallback-3790-thread-1) [    ] o.a.s.c.c.ConnectionManager zkClient has connected
   [junit4]   2> 661954 INFO  (zkConnectionManagerCallback-3792-thread-1) [    ] o.a.s.c.c.ConnectionManager zkClient has connected
   [junit4]   2> 662019 INFO  (TEST-TestCollectionAPI.test-seed#[2C3A633764C1BE0F]) [n:127.0.0.1:40161_    ] o.a.s.c.OverseerElectionContext I am going to be the leader 127.0.0.1:40161_
   [junit4]   2> 662019 INFO  (TEST-TestCollectionAPI.test-seed#[2C3A633764C1BE0F]) [n:127.0.0.1:40161_    ] o.a.s.c.Overseer Overseer (id=72335450382532612-127.0.0.1:40161_-n_0000000000) starting
   [junit4]   2> 662024 INFO  (zkConnectionManagerCallback-3799-thread-1) [    ] o.a.s.c.c.ConnectionManager zkClient has connected
   [junit4]   2> 662026 INFO  (TEST-TestCollectionAPI.test-seed#[2C3A633764C1BE0F]) [n:127.0.0.1:40161_    ] o.a.s.c.s.i.ZkClientClusterStateProvider Cluster at 127.0.0.1:42973/solr ready
   [junit4]   2> 662029 INFO  (OverseerStateUpdate-72335450382532612-127.0.0.1:40161_-n_0000000000) [n:127.0.0.1:40161_    ] o.a.s.c.Overseer Starting to work on the main queue : 127.0.0.1:40161_
   [junit4]   2> 662029 INFO  (TEST-TestCollectionAPI.test-seed#[2C3A633764C1BE0F]) [n:127.0.0.1:40161_    ] o.a.s.c.ZkController Register node as live in ZooKeeper:/live_nodes/127.0.0.1:40161_
   [junit4]   2> 662029 INFO  (OverseerStateUpdate-72335450382532612-127.0.0.1:40161_-n_0000000000) [n:127.0.0.1:40161_    ] o.a.s.c.c.ZkStateReader Updated live nodes from ZooKeeper... (0) -> (1)
   [junit4]   2> 662029 INFO  (zkCallback-3798-thread-1) [    ] o.a.s.c.c.ZkStateReader Updated live nodes from ZooKeeper... (0) -> (1)
   [junit4]   2> 662059 INFO  (TEST-TestCollectionAPI.test-seed#[2C3A633764C1BE0F]) [n:127.0.0.1:40161_    ] o.a.s.h.a.MetricsHistoryHandler No .system collection, keeping metrics history in memory.
   [junit4]   2> 662071 INFO  (TEST-TestCollectionAPI.test-seed#[2C3A633764C1BE0F]) [n:127.0.0.1:40161_    ] o.a.s.m.r.SolrJmxReporter JMX monitoring for 'solr.node' (registry 'solr.node') enabled at server: com.sun.jmx.mbeanserver.JmxMBeanServer@148acbb
   [junit4]   2> 662078 INFO  (TEST-TestCollectionAPI.test-seed#[2C3A633764C1BE0F]) [n:127.0.0.1:40161_    ] o.a.s.m.r.SolrJmxReporter JMX monitoring for 'solr.jvm' (registry 'solr.jvm') enabled at server: com.sun.jmx.mbeanserver.JmxMBeanServer@148acbb
   [junit4]   2> 662124 INFO  (TEST-TestCollectionAPI.test-seed#[2C3A633764C1BE0F]) [n:127.0.0.1:40161_    ] o.a.s.m.r.SolrJmxReporter JMX monitoring for 'solr.jetty' (registry 'solr.jetty') enabled at server: com.sun.jmx.mbeanserver.JmxMBeanServer@148acbb
   [junit4]   2> 662125 INFO  (TEST-TestCollectionAPI.test-seed#[2C3A633764C1BE0F]) [n:127.0.0.1:40161_    ] o.a.s.c.CorePropertiesLocator Found 0 core definitions underneath /home/jenkins/workspace/Lucene-Solr-master-Linux/solr/build/solr-core/test/J1/../../../../../../../../../home/jenkins/workspace/Lucene-Solr-master-Linux/solr/build/solr-core/test/J1/temp/solr.cloud.api.collections.TestCollectionAPI_2C3A633764C1BE0F-001/control-001/cores
   [junit4]   2> 662157 INFO  (zkConnectionManagerCallback-3805-thread-1) [    ] o.a.s.c.c.ConnectionManager zkClient has connected
   [junit4]   2> 662157 INFO  (TEST-TestCollectionAPI.test-seed#[2C3A633764C1BE0F]) [    ] o.a.s.c.c.ZkStateReader Updated live nodes from ZooKeeper... (0) -> (1)
   [junit4]   2> 662158 INFO  (TEST-TestCollectionAPI.test-seed#[2C3A633764C1BE0F]) [    ] o.a.s.c.s.i.ZkClientClusterStateProvider Cluster at 127.0.0.1:42973/solr ready
   [junit4]   2> 662165 INFO  (qtp1797003792-10191) [n:127.0.0.1:40161_    ] o.a.s.h.a.CollectionsHandler Invoked Collection Action :create with params collection.configName=conf1&name=control_collection&nrtReplicas=1&action=CREATE&numShards=1&createNodeSet=127.0.0.1:40161_&wt=javabin&version=2 and sendToOCPQueue=true
   [junit4]   2> 662173 INFO  (OverseerThreadFactory-3152-thread-1-processing-n:127.0.0.1:40161_) [n:127.0.0.1:40161_    ] o.a.s.c.a.c.CreateCollectionCmd Create collection control_collection
   [junit4]   2> 662276 INFO  (qtp1797003792-10190) [n:127.0.0.1:40161_    x:control_collection_shard1_replica_n1] o.a.s.h.a.CoreAdminOperation core create command qt=/admin/cores&collection.configName=conf1&newCollection=true&name=control_collection_shard1_replica_n1&action=CREATE&numShards=1&collection=control_collection&shard=shard1&wt=javabin&version=2&replicaType=NRT
   [junit4]   2> 662277 INFO  (qtp1797003792-10190) [n:127.0.0.1:40161_    x:control_collection_shard1_replica_n1] o.a.s.c.TransientSolrCoreCacheDefault Allocating transient cache for 4 transient cores
   [junit4]   2> 663301 INFO  (qtp1797003792-10190) [n:127.0.0.1:40161_ c:control_collection s:shard1  x:control_collection_shard1_replica_n1] o.a.s.c.SolrConfig Using Lucene MatchVersion: 9.0.0
   [junit4]   2> 663312 INFO  (qtp1797003792-10190) [n:127.0.0.1:40161_ c:control_collection s:shard1  x:control_collection_shard1_replica_n1] o.a.s.s.IndexSchema [control_collection_shard1_replica_n1] Schema name=test
   [junit4]   2> 663409 INFO  (qtp1797003792-10190) [n:127.0.0.1:40161_ c:control_collection s:shard1  x:control_collection_shard1_replica_n1] o.a.s.s.IndexSchema Loaded schema test/1.6 with uniqueid field id
   [junit4]   2> 663417 INFO  (qtp1797003792-10190) [n:127.0.0.1:40161_ c:control_collection s:shard1  x:control_collection_shard1_replica_n1] o.a.s.c.CoreContainer Creating SolrCore 'control_collection_shard1_replica_n1' using configuration from collection control_collection, trusted=true
   [junit4]   2> 663417 INFO  (qtp1797003792-10190) [n:127.0.0.1:40161_ c:control_collection s:shard1  x:control_collection_shard1_replica_n1] o.a.s.m.r.SolrJmxReporter JMX monitoring for 'solr.core.control_collection.shard1.replica_n1' (registry 'solr.core.control_collection.shard1.replica_n1') enabled at server: com.sun.jmx.mbeanserver.JmxMBeanServer@148acbb
   [junit4]   2> 663417 INFO  (qtp1797003792-10190) [n:127.0.0.1:40161_ c:control_collection s:shard1  x:control_collection_shard1_replica_n1] o.a.s.c.SolrCore [[control_collection_shard1_replica_n1] ] Opening new SolrCore at [/home/jenkins/workspace/Lucene-Solr-master-Linux/solr/build/solr-core/test/J1/temp/solr.cloud.api.collections.TestCollectionAPI_2C3A633764C1BE0F-001/control-001/cores/control_collection_shard1_replica_n1], dataDir=[/home/jenkins/workspace/Lucene-Solr-master-Linux/solr/build/solr-core/test/J1/../../../../../../../../../home/jenkins/workspace/Lucene-Solr-master-Linux/solr/build/solr-core/test/J1/temp/solr.cloud.api.collections.TestCollectionAPI_2C3A633764C1BE0F-001/control-001/cores/control_collection_shard1_replica_n1/data/]
   [junit4]   2> 663419 INFO  (qtp1797003792-10190) [n:127.0.0.1:40161_ c:control_collection s:shard1  x:control_collection_shard1_replica_n1] o.a.s.u.RandomMergePolicy RandomMergePolicy wrapping class org.apache.lucene.index.LogByteSizeMergePolicy: [LogByteSizeMergePolicy: minMergeSize=1677721, mergeFactor=16, maxMergeSize=2147483648, maxMergeSizeForForcedMerge=9223372036854775807, calibrateSizeByDeletes=false, maxMergeDocs=2147483647, maxCFSSegmentSizeMB=8.796093022207999E12, noCFSRatio=1.0]
   [junit4]   2> 663421 WARN  (qtp1797003792-10190) [n:127.0.0.1:40161_ c:control_collection s:shard1  x:control_collection_shard1_replica_n1] o.a.s.c.RequestHandlers INVALID paramSet a in requestHandler {type = requestHandler,name = /dump,class = DumpRequestHandler,attributes = {initParams=a, name=/dump, class=DumpRequestHandler},args = {defaults={a=A,b=B}}}
   [junit4]   2> 663489 INFO  (qtp1797003792-10190) [n:127.0.0.1:40161_ c:control_collection s:shard1  x:control_collection_shard1_replica_n1] o.a.s.u.UpdateHandler Using UpdateLog implementation: org.apache.solr.update.UpdateLog
   [junit4]   2> 663489 INFO  (qtp1797003792-10190) [n:127.0.0.1:40161_ c:control_collection s:shard1  x:control_collection_shard1_replica_n1] o.a.s.u.UpdateLog Initializing UpdateLog: dataDir= defaultSyncLevel=FLUSH numRecordsToKeep=100 maxNumLogsToKeep=10 numVersionBuckets=65536
   [junit4]   2> 663491 INFO  (qtp1797003792-10190) [n:127.0.0.1:40161_ c:control_collection s:shard1  x:control_collection_shard1_replica_n1] o.a.s.u.CommitTracker Hard AutoCommit: disabled
   [junit4]   2> 663491 INFO  (qtp1797003792-10190) [n:127.0.0.1:40161_ c:control_collection s:shard1  x:control_collection_shard1_replica_n1] o.a.s.u.CommitTracker Soft AutoCommit: disabled
   [junit4]   2> 663491 INFO  (qtp1797003792-10190) [n:127.0.0.1:40161_ c:control_collection s:shard1  x:control_collection_shard1_replica_n1] o.a.s.u.RandomMergePolicy RandomMergePolicy wrapping class org.apache.lucene.index.LogByteSizeMergePolicy: [LogByteSizeMergePolicy: minMergeSize=1677721, mergeFactor=21, maxMergeSize=2147483648, maxMergeSizeForForcedMerge=9223372036854775807, calibrateSizeByDeletes=true, maxMergeDocs=2147483647, maxCFSSegmentSizeMB=8.796093022207999E12, noCFSRatio=1.0]
   [junit4]   2> 663491 INFO  (qtp1797003792-10190) [n:127.0.0.1:40161_ c:control_collection s:shard1  x:control_collection_shard1_replica_n1] o.a.s.s.SolrIndexSearcher Opening [Searcher@56a036a3[control_collection_shard1_replica_n1] main]
   [junit4]   2> 663492 INFO  (qtp1797003792-10190) [n:127.0.0.1:40161_ c:control_collection s:shard1  x:control_collection_shard1_replica_n1] o.a.s.r.ManagedResourceStorage Configured ZooKeeperStorageIO with znodeBase: /configs/conf1
   [junit4]   2> 663492 INFO  (qtp1797003792-10190) [n:127.0.0.1:40161_ c:control_collection s:shard1  x:control_collection_shard1_replica_n1] o.a.s.r.ManagedResourceStorage Loaded null at path _rest_managed.json using ZooKeeperStorageIO:path=/configs/conf1
   [junit4]   2> 663492 INFO  (qtp1797003792-10190) [n:127.0.0.1:40161_ c:control_collection s:shard1  x:control_collection_shard1_replica_n1] o.a.s.h.ReplicationHandler Commits will be reserved for 10000ms.
   [junit4]   2> 663493 INFO  (qtp1797003792-10190) [n:127.0.0.1:40161_ c:control_collection s:shard1  x:control_collection_shard1_replica_n1] o.a.s.u.UpdateLog Could not find max version in index or recent updates, using new clock 1630184591496052736
   [junit4]   2> 663495 INFO  (searcherExecutor-3157-thread-1-processing-n:127.0.0.1:40161_ x:control_collection_shard1_replica_n1 c:control_collection s:shard1) [n:127.0.0.1:40161_ c:control_collection s:shard1  x:control_collection_shard1_replica_n1] o.a.s.c.SolrCore [control_collection_shard1_replica_n1] Registered new searcher Searcher@56a036a3[control_collection_shard1_replica_n1] main{ExitableDirectoryReader(UninvertingDirectoryReader())}
   [junit4]   2> 663507 INFO  (qtp1797003792-10190) [n:127.0.0.1:40161_ c:control_collection s:shard1  x:control_collection_shard1_replica_n1] o.a.s.c.ZkShardTerms Successful update of terms at /collections/control_collection/terms/shard1 to Terms{values={core_node2=0}, version=0}
   [junit4]   2> 663507 INFO  (qtp1797003792-10190) [n:127.0.0.1:40161_ c:control_collection s:shard1  x:control_collection_shard1_replica_n1] o.a.s.c.ShardLeaderElectionContextBase make sure parent is created /collections/control_collection/leaders/shard1
   [junit4]   2> 663508 INFO  (qtp1797003792-10190) [n:127.0.0.1:40161_ c:control_collection s:shard1  x:control_collection_shard1_replica_n1] o.a.s.c.ShardLeaderElectionContext Enough replicas found to continue.
   [junit4]   2> 663508 INFO  (qtp1797003792-10190) [n:127.0.0.1:40161_ c:control_collection s:shard1  x:control_collection_shard1_replica_n1] o.a.s.c.ShardLeaderElectionContext I may be the new leader - try and sync
   [junit4]   2> 663508 INFO  (qtp1797003792-10190) [n:127.0.0.1:40161_ c:control_collection s:shard1  x:control_collection_shard1_replica_n1] o.a.s.c.SyncStrategy Sync replicas to http://127.0.0.1:40161/control_collection_shard1_replica_n1/
   [junit4]   2> 663508 INFO  (qtp1797003792-10190) [n:127.0.0.1:40161_ c:control_collection s:shard1  x:control_collection_shard1_replica_n1] o.a.s.c.SyncStrategy Sync Success - now sync replicas to me
   [junit4]   2> 663509 INFO  (qtp1797003792-10190) [n:127.0.0.1:40161_ c:control_collection s:shard1  x:control_collection_shard1_replica_n1] o.a.s.c.SyncStrategy http://127.0.0.1:40161/control_collection_shard1_replica_n1/ has no replicas
   [junit4]   2> 663509 INFO  (qtp1797003792-10190) [n:127.0.0.1:40161_ c:control_collection s:shard1  x:control_collection_shard1_replica_n1] o.a.s.c.ShardLeaderElectionContextBase Creating leader registration node /collections/control_collection/leaders/shard1/leader after winning as /collections/control_collection/leader_elect/shard1/election/72335450382532612-core_node2-n_0000000000
   [junit4]   2> 663509 INFO  (qtp1797003792-10190) [n:127.0.0.1:40161_ c:control_collection s:shard1  x:control_collection_shard1_replica_n1] o.a.s.c.ShardLeaderElectionContext I am the new leader: http://127.0.0.1:40161/control_collection_shard1_replica_n1/ shard1
   [junit4]   2> 663610 INFO  (zkCallback-3791-thread-1) [    ] o.a.s.c.c.ZkStateReader A cluster state change: [WatchedEvent state:SyncConnected type:NodeDataChanged path:/collections/control_collection/state.json] for collection [control_collection] has occurred - updating... (live nodes size: [1])
   [junit4]   2> 663611 INFO  (zkCallback-3791-thread-2) [    ] o.a.s.c.c.ZkStateReader A cluster state change: [WatchedEvent state:SyncConnected type:NodeDataChanged path:/collections/control_collection/state.json] for collection [control_collection] has occurred - updating... (live nodes size: [1])
   [junit4]   2> 663611 INFO  (qtp1797003792-10190) [n:127.0.0.1:40161_ c:control_collection s:shard1  x:control_collection_shard1_replica_n1] o.a.s.c.ZkController I am the leader, no recovery necessary
   [junit4]   2> 663612 INFO  (qtp1797003792-10190) [n:127.0.0.1:40161_ c:control_collection s:shard1  x:control_collection_shard1_replica_n1] o.a.s.s.HttpSolrCall [admin] webapp=null path=/admin/cores params={qt=/admin/cores&collection.configName=conf1&newCollection=true&name=control_collection_shard1_replica_n1&action=CREATE&numShards=1&collection=control_collection&shard=shard1&wt=javabin&version=2&replicaType=NRT} status=0 QTime=1336
   [junit4]   2> 663615 INFO  (qtp1797003792-10191) [n:127.0.0.1:40161_    ] o.a.s.h.a.CollectionsHandler Wait for new collection to be active for at most 45 seconds. Check all shard replicas
   [junit4]   2> 663712 INFO  (zkCallback-3791-thread-1) [    ] o.a.s.c.c.ZkStateReader A cluster state change: [WatchedEvent state:SyncConnected type:NodeDataChanged path:/collections/control_collection/state.json] for collection [control_collection] has occurred - updating... (live nodes size: [1])
   [junit4]   2> 663712 INFO  (zkCallback-3791-thread-2) [    ] o.a.s.c.c.ZkStateReader A cluster state change: [WatchedEvent state:SyncConnected type:NodeDataChanged path:/collections/control_collection/state.json] for collection [control_collection] has occurred - updating... (live nodes size: [1])
   [junit4]   2> 663712 INFO  (zkCallback-3791-thread-3) [    ] o.a.s.c.c.ZkStateReader A cluster state change: [WatchedEvent state:SyncConnected type:NodeDataChanged path:/collections/control_collection/state.json] for collection [control_collection] has occurred - updating... (live nodes size: [1])
   [junit4]   2> 663712 INFO  (qtp1797003792-10191) [n:127.0.0.1:40161_    ] o.a.s.s.HttpSolrCall [admin] webapp=null path=/admin/collections params={collection.configName=conf1&name=control_collection&nrtReplicas=1&action=CREATE&numShards=1&createNodeSet=127.0.0.1:40161_&wt=javabin&version=2} status=0 QTime=1547
   [junit4]   2> 663725 INFO  (zkConnectionManagerCallback-3811-thread-1) [    ] o.a.s.c.c.ConnectionManager zkClient has connected
   [junit4]   2> 663725 INFO  (TEST-TestCollectionAPI.test-seed#[2C3A633764C1BE0F]) [    ] o.a.s.c.c.ZkStateReader Updated live nodes from ZooKeeper... (0) -> (1)
   [junit4]   2> 663725 INFO  (TEST-TestCollectionAPI.test-seed#[2C3A633764C1BE0F]) [    ] o.a.s.c.s.i.ZkClientClusterStateProvider Cluster at 127.0.0.1:42973/solr ready
   [junit4]   2> 663726 INFO  (TEST-TestCollectionAPI.test-seed#[2C3A633764C1BE0F]) [    ] o.a.s.c.ChaosMonkey monkey: init - expire sessions:false cause connection loss:false
   [junit4]   2> 663726 INFO  (qtp1797003792-10192) [n:127.0.0.1:40161_    ] o.a.s.h.a.CollectionsHandler Invoked Collection Action :create with params collection.configName=conf1&name=collection1&nrtReplicas=1&action=CREATE&numShards=2&createNodeSet=&stateFormat=1&wt=javabin&version=2 and sendToOCPQueue=true
   [junit4]   2> 663733 INFO  (OverseerThreadFactory-3152-thread-2-processing-n:127.0.0.1:40161_) [n:127.0.0.1:40161_    ] o.a.s.c.a.c.CreateCollectionCmd Create collection collection1
   [junit4]   2> 663733 INFO  (OverseerCollectionConfigSetProcessor-72335450382532612-127.0.0.1:40161_-n_0000000000) [n:127.0.0.1:40161_    ] o.a.s.c.OverseerTaskQueue Response ZK path: /overseer/collection-queue-work/qnr-0000000000 doesn't exist.  Requestor may have disconnected from ZooKeeper
   [junit4]   2> 663934 WARN  (OverseerThreadFactory-3152-thread-2-processing-n:127.0.0.1:40161_) [n:127.0.0.1:40161_    ] o.a.s.c.a.c.CreateCollectionCmd It is unusual to create a collection (collection1) without cores.
   [junit4]   2> 663935 INFO  (qtp1797003792-10192) [n:127.0.0.1:40161_    ] o.a.s.h.a.CollectionsHandler Wait for new collection to be active for at most 45 seconds. Check all shard replicas
   [junit4]   2> 663936 INFO  (qtp1797003792-10192) [n:127.0.0.1:40161_    ] o.a.s.s.HttpSolrCall [admin] webapp=null path=/admin/collections params={collection.configName=conf1&name=collection1&nrtReplicas=1&action=CREATE&numShards=2&createNodeSet=&stateFormat=1&wt=javabin&version=2} status=0 QTime=209
   [junit4]   2> 663936 INFO  (TEST-TestCollectionAPI.test-seed#[2C3A633764C1BE0F]) [    ] o.a.s.c.AbstractFullDistribZkTestBase Creating jetty instances pullReplicaCount=0 numOtherReplicas=2
   [junit4]   2> 664036 INFO  (TEST-TestCollectionAPI.test-seed#[2C3A633764C1BE0F]) [    ] o.a.s.c.AbstractFullDistribZkTestBase create jetty 1 in directory /home/jenkins/workspace/Lucene-Solr-master-Linux/solr/build/solr-core/test/J1/temp/solr.cloud.api.collections.TestCollectionAPI_2C3A633764C1BE0F-001/shard-1-001 of type NRT
   [junit4]   2> 664047 WARN  (closeThreadPool-3812-thread-1) [    ] o.e.j.s.AbstractConnector Ignoring deprecated socket close linger time
   [junit4]   2> 664048 INFO  (closeThreadPool-3812-thread-1) [    ] o.a.s.c.s.e.JettySolrRunner Start Jetty (original configured port=0)
   [junit4]   2> 664048 INFO  (closeThreadPool-3812-thread-1) [    ] o.a.s.c.s.e.JettySolrRunner Trying to start Jetty on port 0 try number 1 ...
   [junit4]   2> 664048 INFO  (closeThreadPool-3812-thread-1) [    ] o.e.j.s.Server jetty-9.4.14.v20181114; built: 2018-11-14T21:20:31.478Z; git: c4550056e785fb5665914545889f21dc136ad9e6; jvm 1.8.0_172-b11
   [junit4]   2> 664049 INFO  (closeThreadPool-3812-thread-1) [    ] o.e.j.s.session DefaultSessionIdManager workerName=node0
   [junit4]   2> 664049 INFO  (closeThreadPool-3812-thread-1) [    ] o.e.j.s.session No SessionScavenger set, using defaults
   [junit4]   2> 664049 INFO  (closeThreadPool-3812-thread-1) [    ] o.e.j.s.session node0 Scavenging every 600000ms
   [junit4]   2> 664049 INFO  (closeThreadPool-3812-thread-1) [    ] o.e.j.s.h.ContextHandler Started o.e.j.s.ServletContextHandler@667b56c0{/,null,AVAILABLE}
   [junit4]   2> 664049 INFO  (closeThreadPool-3812-thread-1) [    ] o.e.j.s.AbstractConnector Started ServerConnector@412eeabd{HTTP/1.1,[http/1.1, h2c]}{127.0.0.1:36495}
   [junit4]   2> 664049 INFO  (closeThreadPool-3812-thread-1) [    ] o.e.j.s.Server Started @664188ms
   [junit4]   2> 664049 INFO  (closeThreadPool-3812-thread-1) [    ] o.a.s.c.s.e.JettySolrRunner Jetty properties: {solr.data.dir=/home/jenkins/workspace/Lucene-Solr-master-Linux/solr/build/solr-core/test/J1/temp/solr.cloud.api.collections.TestCollectionAPI_2C3A633764C1BE0F-001/tempDir-001/jetty1, solrconfig=solrconfig.xml, hostContext=/, hostPort=36495, coreRootDirectory=/home/jenkins/workspace/Lucene-Solr-master-Linux/solr/build/solr-core/test/J1/temp/solr.cloud.api.collections.TestCollectionAPI_2C3A633764C1BE0F-001/shard-1-001/cores}
   [junit4]   2> 664049 ERROR (closeThreadPool-3812-thread-1) [    ] o.a.s.u.StartupLoggingUtils Missing Java Option solr.log.dir. Logging may be missing or incomplete.
   [junit4]   2> 664049 INFO  (closeThreadPool-3812-thread-1) [    ] o.a.s.s.SolrDispatchFilter Using logger factory org.apache.logging.slf4j.Log4jLoggerFactory
   [junit4]   2> 664050 INFO  (closeThreadPool-3812-thread-1) [    ] o.a.s.s.SolrDispatchFilter  ___      _       Welcome to Apache Solr? version 9.0.0
   [junit4]   2> 664050 INFO  (closeThreadPool-3812-thread-1) [    ] o.a.s.s.SolrDispatchFilter / __| ___| |_ _   Starting in cloud mode on port null
   [junit4]   2> 664050 INFO  (closeThreadPool-3812-thread-1) [    ] o.a.s.s.SolrDispatchFilter \__ \/ _ \ | '_|  Install dir: null
   [junit4]   2> 664050 INFO  (closeThreadPool-3812-thread-1) [    ] o.a.s.s.SolrDispatchFilter |___/\___/_|_|    Start time: 2019-04-07T19:26:16.468Z
   [junit4]   2> 664051 INFO  (zkConnectionManagerCallback-3814-thread-1) [    ] o.a.s.c.c.ConnectionManager zkClient has connected
   [junit4]   2> 664053 INFO  (closeThreadPool-3812-thread-1) [    ] o.a.s.s.SolrDispatchFilter Loading solr.xml from SolrHome (not found in ZooKeeper)
   [junit4]   2> 664053 INFO  (closeThreadPool-3812-thread-1) [    ] o.a.s.c.SolrXmlConfig Loading container configuration from /home/jenkins/workspace/Lucene-Solr-master-Linux/solr/build/solr-core/test/J1/temp/solr.cloud.api.collections.TestCollectionAPI_2C3A633764C1BE0F-001/shard-1-001/solr.xml
   [junit4]   2> 664056 INFO  (closeThreadPool-3812-thread-1) [    ] o.a.s.c.SolrXmlConfig Configuration parameter autoReplicaFailoverWorkLoopDelay is ignored
   [junit4]   2> 664056 INFO  (closeThreadPool-3812-thread-1) [    ] o.a.s.c.SolrXmlConfig Configuration parameter autoReplicaFailoverBadNodeExpiration is ignored
   [junit4]   2> 664058 INFO  (closeThreadPool-3812-thread-1) [    ] o.a.s.c.SolrXmlConfig MBean server found: com.sun.jmx.mbeanserver.JmxMBeanServer@148acbb, but no JMX reporters were configured - adding default JMX reporter.
   [junit4]   2> 664100 INFO  (closeThreadPool-3812-thread-1) [    ] o.a.s.h.c.HttpShardHandlerFactory Host whitelist initialized: WhitelistHostChecker [whitelistHosts=null, whitelistHostCheckingEnabled=false]
   [junit4]   2> 664117 WARN  (closeThreadPool-3812-thread-1) [    ] o.e.j.u.s.S.config No Client EndPointIdentificationAlgorithm configured for SslContextFactory@2d0d23d4[provider=null,keyStore=null,trustStore=null]
   [junit4]   2> 664137 WARN  (closeThreadPool-3812-thread-1) [    ] o.e.j.u.s.S.config No Client EndPointIdentificationAlgorithm configured for SslContextFactory@33dca689[provider=null,keyStore=null,trustStore=null]
   [junit4]   2> 664138 INFO  (closeThreadPool-3812-thread-1) [    ] o.a.s.c.ZkContainer Zookeeper client=127.0.0.1:42973/solr
   [junit4]   2> 664154 INFO  (TEST-TestCollectionAPI.test-seed#[2C3A633764C1BE0F]) [    ] o.a.s.c.AbstractFullDistribZkTestBase create jetty 2 in directory /home/jenkins/workspace/Lucene-Solr-master-Linux/solr/build/solr-core/test/J1/temp/solr.cloud.api.collections.TestCollectionAPI_2C3A633764C1BE0F-001/shard-2-001 of type NRT
   [junit4]   2> 664156 INFO  (zkConnectionManagerCallback-3821-thread-1) [    ] o.a.s.c.c.ConnectionManager zkClient has connected
   [junit4]   2> 664157 WARN  (closeThreadPool-3812-thread-2) [    ] o.e.j.s.AbstractConnector Ignoring deprecated socket close linger time
   [junit4]   2> 664157 INFO  (closeThreadPool-3812-thread-2) [    ] o.a.s.c.s.e.JettySolrRunner Start Jetty (original configured port=0)
   [junit4]   2> 664157 INFO  (closeThreadPool-3812-thread-2) [    ] o.a.s.c.s.e.JettySolrRunner Trying to start Jetty on port 0 try number 1 ...
   [junit4]   2> 664157 INFO  (closeThreadPool-3812-thread-2) [    ] o.e.j.s.Server jetty-9.4.14.v20181114; built: 2018-11-14T21:20:31.478Z; git: c4550056e785fb5665914545889f21dc136ad9e6; jvm 1.8.0_172-b11
   [junit4]   2> 664176 INFO  (closeThreadPool-3812-thread-2) [    ] o.e.j.s.session DefaultSessionIdManager workerName=node0
   [junit4]   2> 664176 INFO  (closeThreadPool-3812-thread-2) [    ] o.e.j.s.session No SessionScavenger set, using defaults
   [junit4]   2> 664176 INFO  (closeThreadPool-3812-thread-2) [    ] o.e.j.s.session node0 Scavenging every 660000ms
   [junit4]   2> 664181 INFO  (closeThreadPool-3812-thread-2) [    ] o.e.j.s.h.ContextHandler Started o.e.j.s.ServletContextHandler@197541e7{/,null,AVAILABLE}
   [junit4]   2> 664185 INFO  (zkConnectionManagerCallback-3823-thread-1) [    ] o.a.s.c.c.ConnectionManager zkClient has connected
   [junit4]   2> 664185 INFO  (closeThreadPool-3812-thread-2) [    ] o.e.j.s.AbstractConnector Started ServerConnector@798e677c{HTTP/1.1,[http/1.1, h2c]}{127.0.0.1:36627}
   [junit4]   2> 664185 INFO  (closeThreadPool-3812-thread-2) [    ] o.e.j.s.Server Started @664324ms
   [junit4]   2> 664185 INFO  (closeThreadPool-3812-thread-2) [    ] o.a.s.c.s.e.JettySolrRunner Jetty properties: {solr.data.dir=/home/jenkins/workspace/Lucene-Solr-master-Linux/solr/build/solr-core/test/J1/temp/solr.cloud.api.collections.TestCollectionAPI_2C3A633764C1BE0F-001/tempDir-001/jetty2, solrconfig=solrconfig.xml, hostContext=/, hostPort=36627, coreRootDirectory=/home/jenkins/workspace/Lucene-Solr-master-Linux/solr/build/solr-core/test/J1/temp/solr.cloud.api.collections.TestCollectionAPI_2C3A633764C1BE0F-001/shard-2-001/cores}
   [junit4]   2> 664185 ERROR (closeThreadPool-3812-thread-2) [    ] o.a.s.u.StartupLoggingUtils Missing Java Option solr.log.dir. Logging may be missing or incomplete.
   [junit4]   2> 664185 INFO  (closeThreadPool-3812-thread-2) [    ] o.a.s.s.SolrDispatchFilter Using logger factory org.apache.logging.slf4j.Log4jLoggerFactory
   [junit4]   2> 664185 INFO  (closeThreadPool-3812-thread-2) [    ] o.a.s.s.SolrDispatchFilter  ___      _       Welcome to Apache Solr? version 9.0.0
   [junit4]   2> 664185 INFO  (closeThreadPool-3812-thread-2) [    ] o.a.s.s.SolrDispatchFilter / __| ___| |_ _   Starting in cloud mode on port null
   [junit4]   2> 664185 INFO  (closeThreadPool-3812-thread-2) [    ] o.a.s.s.SolrDispatchFilter \__ \/ _ \ | '_|  Install dir: null
   [junit4]   2> 664185 INFO  (closeThreadPool-3812-thread-2) [    ] o.a.s.s.SolrDispatchFilter |___/\___/_|_|    Start time: 2019-04-07T19:26:16.603Z
   [junit4]   2> 664186 INFO  (closeThreadPool-3812-thread-1) [n:127.0.0.1:36495_    ] o.a.s.c.c.ZkStateReader Updated live nodes from ZooKeeper... (0) -> (1)
   [junit4]   2> 664188 INFO  (closeThreadPool-3812-thread-1) [n:127.0.0.1:36495_    ] o.a.s.c.ZkController Publish node=127.0.0.1:36495_ as DOWN
   [junit4]   2> 664188 INFO  (closeThreadPool-3812-thread-1) [n:127.0.0.1:36495_    ] o.a.s.c.TransientSolrCoreCacheDefault Allocating transient cache for 4 transient cores
   [junit4]   2> 664188 INFO  (closeThreadPool-3812-thread-1) [n:127.0.0.1:36495_    ] o.a.s.c.ZkController Register node as live in ZooKeeper:/live_nodes/127.0.0.1:36495_
   [junit4]   2> 664189 INFO  (zkCallback-3791-thread-3) [    ] o.a.s.c.c.ZkStateReader Updated live nodes from ZooKeeper... (1) -> (2)
   [junit4]   2> 664189 INFO  (zkCallback-3798-thread-1) [    ] o.a.s.c.c.ZkStateReader Updated live nodes from ZooKeeper... (1) -> (2)
   [junit4]   2> 664189 INFO  (zkCallback-3810-thread-1) [    ] o.a.s.c.c.ZkStateReader Updated live nodes from ZooKeeper... (1) -> (2)
   [junit4]   2> 664189 INFO  (zkCallback-3822-thread-1) [    ] o.a.s.c.c.ZkStateReader Updated live nodes from ZooKeeper... (1) -> (2)
   [junit4]   2> 664197 INFO  (zkConnectionManagerCallback-3827-thread-1) [    ] o.a.s.c.c.ConnectionManager zkClient has connected
   [junit4]   2> 664197 INFO  (closeThreadPool-3812-thread-2) [    ] o.a.s.s.SolrDispatchFilter Loading solr.xml from SolrHome (not found in ZooKeeper)
   [junit4]   2> 664197 INFO  (closeThreadPool-3812-thread-2) [    ] o.a.s.c.SolrXmlConfig Loading container configuration from /home/jenkins/workspace/Lucene-Solr-master-Linux/solr/build/solr-core/test/J1/temp/solr.cloud.api.collections.TestCollectionAPI_2C3A633764C1BE0F-001/shard-2-001/solr.xml
   [junit4]   2> 664199 INFO  (closeThreadPool-3812-thread-2) [    ] o.a.s.c.SolrXmlConfig Configuration parameter autoReplicaFailoverWorkLoopDelay is ignored
   [junit4]   2> 664199 INFO  (closeThreadPool-3812-thread-2) [    ] o.a.s.c.SolrXmlConfig Configuration parameter autoReplicaFailoverBadNodeExpiration is ignored
   [junit4]   2> 664200 INFO  (closeThreadPool-3812-thread-2) [    ] o.a.s.c.SolrXmlConfig MBean server found: com.sun.jmx.mbeanserver.JmxMBeanServer@148acbb, but no JMX reporters were configured - adding default JMX reporter.
   [junit4]   2> 664290 INFO  (closeThreadPool-3812-thread-2) [    ] o.a.s.h.c.HttpShardHandlerFactory Host whitelist initialized: WhitelistHostChecker [whitelistHosts=null, whitelistHostCheckingEnabled=false]
   [junit4]   2> 664295 WARN  (closeThreadPool-3812-thread-2) [    ] o.e.j.u.s.S.config No Client EndPointIdentificationAlgorithm configured for SslContextFactory@52f55735[provider=null,keyStore=null,trustStore=null]
   [junit4]   2> 664296 INFO  (zkConnectionManagerCallback-3833-thread-1) [    ] o.a.s.c.c.ConnectionManager zkClient has connected
   [junit4]   2> 664297 INFO  (closeThreadPool-3812-thread-1) [n:127.0.0.1:36495_    ] o.a.s.c.c.ZkStateReader Updated live nodes from ZooKeeper... (0) -> (2)
   [junit4]   2> 664298 INFO  (closeThreadPool-3812-thread-1) [n:127.0.0.1:36495_    ] o.a.s.c.s.i.ZkClientClusterStateProvider Cluster at 127.0.0.1:42973/solr ready
   [junit4]   2> 664324 INFO  (closeThreadPool-3812-thread-1) [n:127.0.0.1:36495_    ] o.a.s.h.a.MetricsHistoryHandler No .system collection, keeping metrics history in memory.
   [junit4]   2> 664340 INFO  (closeThreadPool-3812-thread-1) [n:127.0.0.1:36495_    ] o.a.s.m.r.SolrJmxReporter JMX monitoring for 'solr.node' (registry 'solr.node') enabled at server: com.sun.jmx.mbeanserver.JmxMBeanServer@148acbb
   [junit4]   2> 664348 INFO  (closeThreadPool-3812-thread-1) [n:127.0.0.1:36495_    ] o.a.s.m.r.SolrJmxReporter JMX monitoring for 'solr.jvm' (registry 'solr.jvm') enabled at server: com.sun.jmx.mbeanserver.JmxMBeanServer@148acbb
   [junit4]   2> 664348 INFO  (closeThreadPool-3812-thread-1) [n:127.0.0.1:36495_    ] o.a.s.m.r.SolrJmxReporter JMX monitoring for 'solr.jetty' (registry 'solr.jetty') enabled at server: com.sun.jmx.mbeanserver.JmxMBeanServer@148acbb
   [junit4]   2> 664349 INFO  (closeThreadPool-3812-thread-1) [n:127.0.0.1:36495_    ] o.a.s.c.CorePropertiesLocator Found 0 core definitions underneath /home/jenkins/workspace/Lucene-Solr-master-Linux/solr/build/solr-core/test/J1/temp/solr.cloud.api.collections.TestCollectionAPI_2C3A633764C1BE0F-001/shard-1-001/cores
   [junit4]   2> 664361 WARN  (closeThreadPool-3812-thread-2) [    ] o.e.j.u.s.S.config No Client EndPointIdentificationAlgorithm configured for SslContextFactory@12313362[provider=null,keyStore=null,trustStore=null]
   [junit4]   2> 664362 INFO  (closeThreadPool-3812-thread-2) [    ] o.a.s.c.ZkContainer Zookeeper client=127.0.0.1:42973/solr
   [junit4]   2> 664417 INFO  (zkConnectionManagerCallback-3840-thread-1) [    ] o.a.s.c.c.ConnectionManager zkClient has connected
   [junit4]   2> 664460 INFO  (zkConnectionManagerCallback-3842-thread-1) [    ] o.a.s.c.c.ConnectionManager zkClient has connected
   [junit4]   2> 664466 INFO  (closeThreadPool-3812-thread-2) [n:127.0.0.1:36627_    ] o.a.s.c.c.ZkStateReader Updated live nodes from ZooKeeper... (0) -> (2)
   [junit4]   2> 664467 INFO  (closeThreadPool-3812-thread-2) [n:127.0.0.1:36627_    ] o.a.s.c.ZkController Publish node=127.0.0.1:36627_ as DOWN
   [junit4]   2> 664467 INFO  (closeThreadPool-3812-thread-2) [n:127.0.0.1:36627_    ] o.a.s.c.TransientSolrCoreCacheDefault Allocating transient cache for 4 transient cores
   [junit4]   2> 664467 INFO  (closeThreadPool-3812-thread-2) [n:127.0.0.1:36627_    ] o.a.s.c.ZkController Register node as live in ZooKeeper:/live_nodes/127.0.0.1:36627_
   [junit4]   2> 664468 INFO  (zkCallback-3810-thread-1) [    ] o.a.s.c.c.ZkStateReader Updated live nodes from ZooKeeper... (2) -> (3)
   [junit4]   2> 664468 INFO  (zkCallback-3791-thread-3) [    ] o.a.s.c.c.ZkStateReader Updated live nodes from ZooKeeper... (2) -> (3)
   [junit4]   2> 664468 INFO  (zkCallback-3798-thread-1) [    ] o.a.s.c.c.ZkStateReader Updated live nodes from ZooKeeper... (2) -> (3)
   [junit4]   2> 664468 INFO  (zkCallback-3822-thread-1) [    ] o.a.s.c.c.ZkStateReader Updated live nodes from ZooKeeper... (2) -> (3)
   [junit4]   2> 664468 INFO  (zkCallback-3841-thread-1) [    ] o.a.s.c.c.ZkStateReader Updated live nodes from ZooKeeper... (2) -> (3)
   [junit4]   2> 664468 INFO  (zkCallback-3832-thread-1) [    ] o.a.s.c.c.ZkStateReader Updated live nodes from ZooKeeper... (2) -> (3)
   [junit4]   2> 664483 INFO  (zkConnectionManagerCallback-3849-thread-1) [    ] o.a.s.c.c.ConnectionManager zkClient has connected
   [junit4]   2> 664484 INFO  (closeThreadPool-3812-thread-2) [n:127.0.0.1:36627_    ] o.a.s.c.c.ZkStateReader Updated live nodes from ZooKeeper... (0) -> (3)
   [junit4]   2> 664484 INFO  (closeThreadPool-3812-thread-2) [n:127.0.0.1:36627_    ] o.a.s.c.s.i.ZkClientClusterStateProvider Cluster at 127.0.0.1:42973/solr ready
   [junit4]   2> 664485 INFO  (closeThreadPool-3812-thread-2) [n:127.0.0.1:36627_    ] o.a.s.h.a.MetricsHistoryHandler No .system collection, keeping metrics history in memory.
   [junit4]   2> 664500 INFO  (closeThreadPool-3812-thread-2) [n:127.0.0.1:36627_    ] o.a.s.m.r.SolrJmxReporter JMX monitoring for 'solr.node' (registry 'solr.node') enabled at server: com.sun.jmx.mbeanserver.JmxMBeanServer@148acbb
   [junit4]   2> 664509 INFO  (closeThreadPool-3812-thread-2) [n:127.0.0.1:36627_    ] o.a.s.m.r.SolrJmxReporter JMX monitoring for 'solr.jvm' (registry 'solr.jvm') enabled at server: com.sun.jmx.mbeanserver.JmxMBeanServer@148acbb
   [junit4]   2> 664510 INFO  (closeThreadPool-3812-thread-2) [n:127.0.0.1:36627_    ] o.a.s.m.r.SolrJmxReporter JMX monitoring for 'solr.jetty' (registry 'solr.jetty') enabled at server: com.sun.jmx.mbeanserver.JmxMBeanServer@148acbb
   [junit4]   2> 664511 INFO  (closeThreadPool-3812-thread-2) [n:127.0.0.1:36627_    ] o.a.s.c.CorePropertiesLocator Found 0 core definitions underneath /home/jenkins/workspace/Lucene-Solr-master-Linux/solr/build/solr-core/test/J1/temp/solr.cloud.api.collections.TestCollectionAPI_2C3A633764C1BE0F-001/shard-2-001/cores
   [junit4]   2> 664557 INFO  (qtp625389845-10253) [n:127.0.0.1:36495_    ] o.a.s.h.a.CollectionsHandler Invoked Collection Action :addreplica with params node=127.0.0.1:36627_&action=ADDREPLICA&collection=collection1&shard=shard1&type=NRT&wt=javabin&version=2 and sendToOCPQueue=true
   [junit4]   2> 664557 INFO  (qtp625389845-10254) [n:127.0.0.1:36495_    ] o.a.s.h.a.CollectionsHandler Invoked Collection Action :addreplica with params node=127.0.0.1:36495_&action=ADDREPLICA&collection=collection1&shard=shard2&type=NRT&wt=javabin&version=2 and sendToOCPQueue=true
   [junit4]   2> 664564 INFO  (OverseerThreadFactory-3152-thread-3-processing-n:127.0.0.1:40161_) [n:127.0.0.1:40161_ c:collection1 s:shard1  ] o.a.s.c.a.c.AddReplicaCmd Node Identified 127.0.0.1:36627_ for creating new replica of shard shard1 for collection collection1
   [junit4]   2> 664564 INFO  (OverseerThreadFactory-3152-thread-3-processing-n:127.0.0.1:40161_) [n:127.0.0.1:40161_ c:collection1 s:shard1  ] o.a.s.c.a.c.AddReplicaCmd Returning CreateReplica command.
   [junit4]   2> 664569 INFO  (OverseerCollectionConfigSetProcessor-72335450382532612-127.0.0.1:40161_-n_0000000000) [n:127.0.0.1:40161_    ] o.a.s.c.OverseerTaskQueue Response ZK path: /overseer/collection-queue-work/qnr-0000000002 doesn't exist.  Requestor may have disconnected from ZooKeeper
   [junit4]   2> 664569 INFO  (OverseerThreadFactory-3152-thread-4-processing-n:127.0.0.1:40161_) [n:127.0.0.1:40161_ c:collection1 s:shard2  ] o.a.s.c.a.c.AddReplicaCmd Node Identified 127.0.0.1:36495_ for creating new replica of shard shard2 for collection collection1
   [junit4]   2> 664570 INFO  (OverseerThreadFactory-3152-thread-4-processing-n:127.0.0.1:40161_) [n:127.0.0.1:40161_ c:collection1 s:shard2  ] o.a.s.c.a.c.AddReplicaCmd Returning CreateReplica command.
   [junit4]   2> 664625 INFO  (qtp1195611840-10275) [n:127.0.0.1:36627_    x:collection1_shard1_replica_n1] o.a.s.h.a.CoreAdminOperation core create command qt=/admin/cores&collection.configName=conf1&name=collection1_shard1_replica_n1&action=CREATE&collection=collection1&shard=shard1&wt=javabin&version=2&replicaType=NRT
   [junit4]   2> 664627 INFO  (qtp625389845-10325) [n:127.0.0.1:36495_    x:collection1_shard2_replica_n2] o.a.s.h.a.CoreAdminOperation core create command qt=/admin/cores&collection.configName=conf1&name=collection1_shard2_replica_n2&action=CREATE&collection=collection1&shard=shard2&wt=javabin&version=2&replicaType=NRT
   [junit4]   2> 665872 INFO  (qtp625389845-10325) [n:127.0.0.1:36495_ c:collection1 s:shard2  x:collection1_shard2_replica_n2] o.a.s.c.SolrConfig Using Lucene MatchVersion: 9.0.0
   [junit4]   2> 665875 INFO  (qtp1195611840-10275) [n:127.0.0.1:36627_ c:collection1 s:shard1  x:collection1_shard1_replica_n1] o.a.s.c.SolrConfig Using Lucene MatchVersion: 9.0.0
   [junit4]   2> 665888 INFO  (qtp625389845-10325) [n:127.0.0.1:36495_ c:collection1 s:shard2  x:collection1_shard2_replica_n2] o.a.s.s.IndexSchema [collection1_shard2_replica_n2] Schema name=test
   [junit4]   2> 665888 INFO  (qtp1195611840-10275) [n:127.0.0.1:36627_ c:collection1 s:shard1  x:collection1_shard1_replica_n1] o.a.s.s.IndexSchema [collection1_shard1_replica_n1] Schema name=test
   [junit4]   2> 666045 INFO  (qtp1195611840-10275) [n:127.0.0.1:36627_ c:collection1 s:shard1  x:collection1_shard1_replica_n1] o.a.s.s.IndexSchema Loaded schema test/1.6 with uniqueid field id
   [junit4]   2> 666049 INFO  (qtp625389845-10325) [n:127.0.0.1:36495_ c:collection1 s:shard2  x:collection1_shard2_replica_n2] o.a.s.s.IndexSchema Loaded schema test/1.6 with uniqueid field id
   [junit4]   2> 666070 INFO  (qtp1195611840-10275) [n:127.0.0.1:36627_ c:collection1 s:shard1  x:collection1_shard1_replica_n1] o.a.s.c.CoreContainer Creating SolrCore 'collection1_shard1_replica_n1' using configuration from collection collection1, trusted=true
   [junit4]   2> 666071 INFO  (qtp1195611840-10275) [n:127.0.0.1:36627_ c:collection1 s:shard1  x:collection1_shard1_replica_n1] o.a.s.m.r.SolrJmxReporter JMX monitoring for 'solr.core.collection1.shard1.replica_n1' (registry 'solr.core.collection1.shard1.replica_n1') enabled at server: com.sun.jmx.mbeanserver.JmxMBeanServer@148acbb
   [junit4]   2> 666071 INFO  (qtp1195611840-10275) [n:127.0.0.1:36627_ c:collection1 s:shard1  x:collection1_shard1_replica_n1] o.a.s.c.SolrCore [[collection1_shard1_replica_n1] ] Opening new SolrCore at [/home/jenkins/workspace/Lucene-Solr-master-Linux/solr/build/solr-core/test/J1/temp/solr.cloud.api.collections.TestCollectionAPI_2C3A633764C1BE0F-001/shard-2-001/cores/collection1_shard1_replica_n1], dataDir=[/home/jenkins/workspace/Lucene-Solr-master-Linux/solr/build/solr-core/test/J1/temp/solr.cloud.api.collections.TestCollectionAPI_2C3A633764C1BE0F-001/shard-2-001/cores/collection1_shard1_replica_n1/data/]
   [junit4]   2> 666072 INFO  (qtp1195611840-10275) [n:127.0.0.1:36627_ c:collection1 s:shard1  x:collection1_shard1_replica_n1] o.a.s.u.RandomMergePolicy RandomMergePolicy wrapping class org.apache.lucene.index.LogByteSizeMergePolicy: [LogByteSizeMergePolicy: minMergeSize=1677721, mergeFactor=16, maxMergeSize=2147483648, maxMergeSizeForForcedMerge=9223372036854775807, calibrateSizeByDeletes=false, maxMergeDocs=2147483647, maxCFSSegmentSizeMB=8.796093022207999E12, noCFSRatio=1.0]
   [junit4]   2> 666072 INFO  (qtp625389845-10325) [n:127.0.0.1:36495_ c:collection1 s:shard2  x:collection1_shard2_replica_n2] o.a.s.c.CoreContainer Creating SolrCore 'collection1_shard2_replica_n2' using configuration from collection collection1, trusted=true
   [junit4]   2> 666073 INFO  (qtp625389845-10325) [n:127.0.0.1:36495_ c:collection1 s:shard2  x:collection1_shard2_replica_n2] o.a.s.m.r.SolrJmxReporter JMX monitoring for 'solr.core.collection1.shard2.replica_n2' (registry 'solr.core.collection1.shard2.replica_n2') enabled at server: com.sun.jmx.mbeanserver.JmxMBeanServer@148acbb
   [junit4]   2> 666073 INFO  (qtp625389845-10325) [n:127.0.0.1:36495_ c:collection1 s:shard2  x:collection1_shard2_replica_n2] o.a.s.c.SolrCore [[collection1_shard2_replica_n2] ] Opening new SolrCore at [/home/jenkins/workspace/Lucene-Solr-master-Linux/solr/build/solr-core/test/J1/temp/solr.cloud.api.collections.TestCollectionAPI_2C3A633764C1BE0F-001/shard-1-001/cores/collection1_shard2_replica_n2], dataDir=[/home/jenkins/workspace/Lucene-Solr-master-Linux/solr/build/solr-core/test/J1/temp/solr.cloud.api.collections.TestCollectionAPI_2C3A633764C1BE0F-001/shard-1-001/cores/collection1_shard2_replica_n2/data/]
   [junit4]   2> 666074 INFO  (qtp625389845-10325) [n:127.0.0.1:36495_ c:collection1 s:shard2  x:collection1_shard2_replica_n2] o.a.s.u.RandomMergePolicy RandomMergePolicy wrapping class org.apache.lucene.index.LogByteSizeMergePolicy: [LogByteSizeMergePolicy: minMergeSize=1677721, mergeFactor=16, maxMergeSize=2147483648, maxMergeSizeForForcedMerge=9223372036854775807, calibrateSizeByDeletes=false, maxMergeDocs=2147483647, maxCFSSegmentSizeMB=8.796093022207999E12, noCFSRatio=1.0]
   [junit4]   2> 666077 WARN  (qtp1195611840-10275) [n:127.0.0.1:36627_ c:collection1 s:shard1  x:collection1_shard1_replica_n1] o.a.s.c.RequestHandlers INVALID paramSet a in requestHandler {type = requestHandler,name = /dump,class = DumpRequestHandler,attributes = {initParams=a, name=/dump, class=DumpRequestHandler},args = {defaults={a=A,b=B}}}
   [junit4]   2> 666086 WARN  (qtp625389845-10325) [n:127.0.0.1:36495_ c:collection1 s:shard2  x:collection1_shard2_replica_n2] o.a.s.c.RequestHandlers INVALID paramSet a in requestHandler {type = requestHandler,name = /dump,class = DumpRequestHandler,attributes = {initParams=a, name=/dump, class=DumpRequestHandler},args = {defaults={a=A,b=B}}}
   [junit4]   2> 666113 INFO  (qtp1195611840-10275) [n:127.0.0.1:36627_ c:collection1 s:shard1  x:collection1_shard1_replica_n1] o.a.s.u.UpdateHandler Using UpdateLog implementation: org.apache.solr.update.UpdateLog
   [junit4]   2> 666113 INFO  (qtp1195611840-10275) [n:127.0.0.1:36627_ c:collection1 s:shard1  x:collection1_shard1_replica_n1] o.a.s.u.UpdateLog Initializing UpdateLog: dataDir= defaultSyncLevel=FLUSH numRecordsToKeep=100 maxNumLogsToKeep=10 numVersionBuckets=65536
   [junit4]   2> 666114 INFO  (qtp625389845-10325) [n:127.0.0.1:36495_ c:collection1 s:shard2  x:collection1_shard2_replica_n2] o.a.s.u.UpdateHandler Using UpdateLog implementation: org.apache.solr.update.UpdateLog
   [junit4]   2> 666114 INFO  (qtp625389845-10325) [n:127.0.0.1:36495_ c:collection1 s:shard2  x:collection1_shard2_replica_n2] o.a.s.u.UpdateLog Initializing UpdateLog: dataDir= defaultSyncLevel=FLUSH numRecordsToKeep=100 maxNumLogsToKeep=10 numVersionBuckets=65536
   [junit4]   2> 666115 INFO  (qtp1195611840-10275) [n:127.0.0.1:36627_ c:collection1 s:shard1  x:collection1_shard1_replica_n1] o.a.s.u.CommitTracker Hard AutoCommit: disabled
   [junit4]   2> 666116 INFO  (qtp1195611840-10275) [n:127.0.0.1:36627_ c:collection1 s:shard1  x:collection1_shard1_replica_n1] o.a.s.u.CommitTracker Soft AutoCommit: disabled
   [junit4]   2> 666116 INFO  (qtp1195611840-10275) [n:127.0.0.1:36627_ c:collection1 s:shard1  x:collection1_shard1_replica_n1] o.a.s.u.RandomMergePolicy RandomMergePolicy wrapping class org.apache.lucene.index.LogByteSizeMergePolicy: [LogByteSizeMergePolicy: minMergeSize=1677721, mergeFactor=21, maxMergeSize=2147483648, maxMergeSizeForForcedMerge=9223372036854775807, calibrateSizeByDeletes=true, maxMergeDocs=2147483647, maxCFSSegmentSizeMB=8.796093022207999E12, noCFSRatio=1.0]
   [junit4]   2> 666116 INFO  (qtp625389845-10325) [n:127.0.0.1:36495_ c:collection1 s:shard2  x:collection1_shard2_replica_n2] o.a.s.u.CommitTracker Hard AutoCommit: disabled
   [junit4]   2> 666116 INFO  (qtp625389845-10325) [n:127.0.0.1:36495_ c:collection1 s:shard2  x:collection1_shard2_replica_n2] o.a.s.u.CommitTracker Soft AutoCommit: disabled
   [junit4]   2> 666116 INFO  (qtp1195611840-10275) [n:127.0.0.1:36627_ c:collection1 s:shard1  x:collection1_shard1_replica_n1] o.a.s.s.SolrIndexSearcher Opening [Searcher@32f260f8[collection1_shard1_replica_n1] main]
   [junit4]   2> 666117 INFO  (qtp625389845-10325) [n:127.0.0.1:36495_ c:collection1 s:shard2  x:collection1_shard2_replica_n2] o.a.s.u.RandomMergePolicy RandomMergePolicy wrapping class org.apache.lucene.index.LogByteSizeMergePolicy: [LogByteSizeMergePolicy: minMergeSize=1677721, mergeFactor=21, maxMergeSize=2147483648, maxMergeSizeForForcedMerge=9223372036854775807, calibrateSizeByDeletes=true, maxMergeDocs=2147483647, maxCFSSegmentSizeMB=8.796093022207999E12, noCFSRatio=1.0]
   [junit4]   2> 666117 INFO  (qtp1195611840-10275) [n:127.0.0.1:36627_ c:collection1 s:shard1  x:collection1_shard1_replica_n1] o.a.s.r.ManagedResourceStorage Configured ZooKeeperStorageIO with znodeBase: /configs/conf1
   [junit4]   2> 666117 INFO  (qtp625389845-10325) [n:127.0.0.1:36495_ c:collection1 s:shard2  x:collection1_shard2_replica_n2] o.a.s.s.SolrIndexSearcher Opening [Searcher@5f61fc1[collection1_shard2_replica_n2] main]
   [junit4]   2> 666117 INFO  (qtp1195611840-10275) [n:127.0.0.1:36627_ c:collection1 s:shard1  x:collection1_shard1_replica_n1] o.a.s.r.ManagedResourceStorage Loaded null at path _rest_managed.json using ZooKeeperStorageIO:path=/configs/conf1
   [junit4]   2> 666117 INFO  (qtp1195611840-10275) [n:127.0.0.1:36627_ c:collection1 s:shard1  x:collection1_shard1_replica_n1] o.a.s.h.ReplicationHandler Commits will be reserved for 10000ms.
   [junit4]   2> 666118 INFO  (qtp1195611840-10275) [n:127.0.0.1:36627_ c:collection1 s:shard1  x:collection1_shard1_replica_n1] o.a.s.u.UpdateLog Could not find max version in index or recent updates, using new clock 1630184594248564736
   [junit4]   2> 666118 INFO  (qtp625389845-10325) [n:127.0.0.1:36495_ c:collection1 s:shard2  x:collection1_shard2_replica_n2] o.a.s.r.ManagedResourceStorage Configured ZooKeeperStorageIO with znodeBase: /configs/conf1
   [junit4]   2> 666118 INFO  (qtp625389845-10325) [n:127.0.0.1:36495_ c:collection1 s:shard2  x:collection1_shard2_replica_n2] o.a.s.r.ManagedResourceStorage Loaded null at path _rest_managed.json using ZooKeeperStorageIO:path=/configs/conf1
   [junit4]   2> 666118 INFO  (qtp625389845-10325) [n:127.0.0.1:36495_ c:collection1 s:shard2  x:collection1_shard2_replica_n2] o.a.s.h.ReplicationHandler Commits will be reserved for 10000ms.
   [junit4]   2> 666118 INFO  (qtp625389845-10325) [n:127.0.0.1:36495_ c:collection1 s:shard2  x:collection1_shard2_replica_n2] o.a.s.u.UpdateLog Could not find max version in index or recent updates, using new clock 1630184594248564736
   [junit4]   2> 666121 INFO  (searcherExecutor-3180-thread-1-processing-n:127.0.0.1:36627_ x:collection1_shard1_replica_n1 c:collection1 s:shard1) [n:127.0.0.1:36627_ c:collection1 s:shard1  x:collection1_shard1_replica_n1] o.a.s.c.SolrCore [collection1_shard1_replica_n1] Registered new searcher Searcher@32f260f8[collection1_shard1_replica_n1] main{ExitableDirectoryReader(UninvertingDirectoryReader())}
   [junit4]   2> 666122 INFO  (searcherExecutor-3181-thread-1-processing-n:127.0.0.1:36495_ x:collection1_shard2_replica_n2 c:collection1 s:shard2) [n:127.0.0.1:36495_ c:collection1 s:shard2  x:collection1_shard2_replica_n2] o.a.s.c.SolrCore [collection1_shard2_replica_n2] Registered new searcher Searcher@5f61fc1[collection1_shard2_replica_n2] main{ExitableDirectoryReader(UninvertingDirectoryReader())}
   [junit4]   2> 666126 INFO  (qtp625389845-10325) [n:127.0.0.1:36495_ c:collection1 s:shard2  x:collection1_shard2_replica_n2] o.a.s.c.ZkShardTerms Successful update of terms at /collections/collection1/terms/shard2 to Terms{values={core_node4=0}, version=0}
   [junit4]   2> 666126 INFO  (qtp625389845-10325) [n:127.0.0.1:36495_ c:collection1 s:shard2  x:collection1_shard2_replica_n2] o.a.s.c.ShardLeaderElectionContextBase make sure parent is created /collections/collection1/leaders/shard2
   [junit4]   2> 666126 INFO  (qtp1195611840-10275) [n:127.0.0.1:36627_ c:collection1 s:shard1  x:collection1_shard1_replica_n1] o.a.s.c.ZkShardTerms Successful update of terms at /collections/collection1/terms/shard1 to Terms{values={core_node3=0}, version=0}
   [junit4]   2> 666126 INFO  (qtp1195611840-10275) [n:127.0.0.1:36627_ c:collection1 s:shard1  x:collection1_shard1_replica_n1] o.a.s.c.ShardLeaderElectionContextBase make sure parent is created /collections/collection1/leaders/shard1
   [junit4]   2> 666127 INFO  (qtp1195611840-10275) [n:127.0.0.1:36627_ c:collection1 s:shard1  x:collection1_shard1_replica_n1] o.a.s.c.ShardLeaderElectionContext Enough replicas found to continue.
   [junit4]   2> 666127 INFO  (qtp1195611840-10275) [n:127.0.0.1:36627_ c:collection1 s:shard1  x:collection1_shard1_replica_n1] o.a.s.c.ShardLeaderElectionContext I may be the new leader - try and sync
   [junit4]   2> 666127 INFO  (qtp1195611840-10275) [n:127.0.0.1:36627_ c:collection1 s:shard1  x:collection1_shard1_replica_n1] o.a.s.c.SyncStrategy Sync replicas to http://127.0.0.1:36627/collection1_shard1_replica_n1/
   [junit4]   2> 666127 INFO  (qtp1195611840-10275) [n:127.0.0.1:36627_ c:collection1 s:shard1  x:collection1_shard1_replica_n1] o.a.s.c.SyncStrategy Sync Success - now sync replicas to me
   [junit4]   2> 666127 INFO  (qtp625389845-10325) [n:127.0.0.1:36495_ c:collection1 s:shard2  x:collection1_shard2_replica_n2] o.a.s.c.ShardLeaderElectionContext Enough replicas found to continue.
   [junit4]   2> 666127 INFO  (qtp1195611840-10275) [n:127.0.0.1:36627_ c:collection1 s:shard1  x:collection1_shard1_replica_n1] o.a.s.c.SyncStrategy http://127.0.0.1:36627/collection1_shard1_replica_n1/ has no replicas
   [junit4]   2> 666127 INFO  (qtp625389845-10325) [n:127.0.0.1:36495_ c:collection1 s:shard2  x:collection1_shard2_replica_n2] o.a.s.c.ShardLeaderElectionContext I may be the new leader - try and sync
   [junit4]   2> 666127 INFO  (qtp625389845-10325) [n:127.0.0.1:36495_ c:collection1 s:shard2  x:collection1_shard2_replica_n2] o.a.s.c.SyncStrategy Sync replicas to http://127.0.0.1:36495/collection1_shard2_replica_n2/
   [junit4]   2> 666127 INFO  (qtp625389845-10325) [n:127.0.0.1:36495_ c:collection1 s:shard2  x:collection1_shard2_replica_n2] o.a.s.c.SyncStrategy Sync Success - now sync replicas to me
   [junit4]   2> 666127 INFO  (qtp1195611840-10275) [n:127.0.0.1:36627_ c:collection1 s:shard1  x:collection1_shard1_replica_n1] o.a.s.c.ShardLeaderElectionContextBase Creating leader registration node /collections/collection1/leaders/shard1/leader after winning as /collections/collection1/leader_elect/shard1/election/72335450382532622-core_node3-n_0000000000
   [junit4]   2> 666127 INFO  (qtp625389845-10325) [n:127.0.0.1:36495_ c:collection1 s:shard2  x:collection1_shard2_replica_n2] o.a.s.c.SyncStrategy http://127.0.0.1:36495/collection1_shard2_replica_n2/ has no replicas
   [junit4]   2> 666127 INFO  (qtp625389845-10325) [n:127.0.0.1:36495_ c:collection1 s:shard2  x:collection1_shard2_replica_n2] o.a.s.c.ShardLeaderElectionContextBase Creating leader registration node /collections/collection1/leaders/shard2/leader after winning as /collections/collection1/leader_elect/shard2/election/72335450382532618-core_node4-n_0000000000
   [junit4]   2> 666128 INFO  (qtp1195611840-10275) [n:127.0.0.1:36627_ c:collection1 s:shard1  x:collection1_shard1_replica_n1] o.a.s.c.ShardLeaderElectionContext I am the new leader: http://127.0.0.1:36627/collection1_shard1_replica_n1/ shard1
   [junit4]   2> 666128 INFO  (qtp625389845-10325) [n:127.0.0.1:36495_ c:collection1 s:shard2  x:collection1_shard2_replica_n2] o.a.s.c.ShardLeaderElectionContext I am the new leader: http://127.0.0.1:36495/collection1_shard2_replica_n2/ shard2
   [junit4]   2> 666231 INFO  (qtp625389845-10325) [n:127.0.0.1:36495_ c:collection1 s:shard2  x:collection1_shard2_replica_n2] o.a.s.c.ZkController I am the leader, no recovery necessary
   [junit4]   2> 666233 INFO  (qtp625389845-10325) [n:127.0.0.1:36495_ c:collection1 s:shard2  x:collection1_shard2_replica_n2] o.a.s.s.HttpSolrCall [admin] webapp=null path=/admin/cores params={qt=/admin/cores&collection.configName=conf1&name=collection1_shard2_replica_n2&action=CREATE&collection=collection1&shard=shard2&wt=javabin&version=2&replicaType=NRT} status=0 QTime=1605
   [junit4]   2> 666235 INFO  (qtp625389845-10254) [n:127.0.0.1:36495_ c:collection1   ] o.a.s.s.HttpSolrCall [admin] webapp=null path=/admin/collections params={node=127.0.0.1:36495_&action=ADDREPLICA&collection=collection1&shard=shard2&type=NRT&wt=javabin&version=2} status=0 QTime=1677
   [junit4]   2> 666239 INFO  (qtp1195611840-10275) [n:127.0.0.1:36627_ c:collection1 s:shard1  x:collection1_shard1_replica_n1] o.a.s.c.ZkController I am the leader, no recovery necessary
   [junit4]   2> 666240 INFO  (qtp1195611840-10275) [n:127.0.0.1:36627_ c:collection1 s:shard1  x:collection1_shard1_replica_n1] o.a.s.s.HttpSolrCall [admin] webapp=null path=/admin/cores params={qt=/admin/cores&collection.configName=conf1&name=collection1_shard1_replica_n1&action=CREATE&collection=collection1&shard=shard1&wt=javabin&version=2&replicaType=NRT} status=0 QTime=1615
   [junit4]   2> 666245 INFO  (qtp625389845-10253) [n:127.0.0.1:36495_ c:collection1   ] o.a.s.s.HttpSolrCall [admin] webapp=null path=/admin/collections params={node=127.0.0.1:36627_&action=ADDREPLICA&collection=collection1&shard=shard1&type=NRT&wt=javabin&version=2} status=0 QTime=1687
   [junit4]   2> 666246 INFO  (TEST-TestCollectionAPI.test-seed#[2C3A633764C1BE0F]) [    ] o.a.s.SolrTestCaseJ4 ###Starting test
   [junit4]   2> 666333 INFO  (zkConnectionManagerCallback-3859-thread-1) [    ] o.a.s.c.c.ConnectionManager zkClient has connected
   [junit4]   2> 666333 INFO  (TEST-TestCollectionAPI.test-seed#[2C3A633764C1BE0F]) [    ] o.a.s.c.c.ZkStateReader Updated live nodes from ZooKeeper... (0) -> (3)
   [junit4]   2> 666334 INFO  (TEST-TestCollectionAPI.test-seed#[2C3A633764C1BE0F]) [    ] o.a.s.c.s.i.ZkClientClusterStateProvider Cluster at 127.0.0.1:42973/solr ready
   [junit4]   2> 666365 INFO  (OverseerCollectionConfigSetProcessor-72335450382532612-127.0.0.1:40161_-n_0000000000) [n:127.0.0.1:40161_    ] o.a.s.c.OverseerTaskQueue Response ZK path: /overseer/collection-queue-work/qnr-0000000004 doesn't exist.  Requestor may have disconnected from ZooKeeper
   [junit4]   2> 666366 INFO  (OverseerCollectionConfigSetProcessor-72335450382532612-127.0.0.1:40161_-n_0000000000) [n:127.0.0.1:40161_    ] o.a.s.c.OverseerTaskQueue Response ZK path: /overseer/collection-queue-work/qnr-0000000005 doesn't exist.  Requestor may have disconnected from ZooKeeper
   [junit4]   2> 666367 INFO  (OverseerThreadFactory-3152-thread-5-processing-n:127.0.0.1:40161_) [n:127.0.0.1:40161_    ] o.a.s.c.a.c.CreateCollectionCmd Create collection testcollection
   [junit4]   2> 666578 INFO  (qtp1797003792-10192) [n:127.0.0.1:40161_    x:testcollection_shard1_replica_n1] o.a.s.h.a.CoreAdminOperation core create command qt=/admin/cores&collection.configName=conf1&newCollection=true&name=testcollection_shard1_replica_n1&action=CREATE&numShards=2&collection=testcollection&shard=shard1&wt=javabin&version=2&replicaType=NRT
   [junit4]   2> 666579 INFO  (qtp625389845-10326) [n:127.0.0.1:36495_    x:testcollection_shard1_replica_p2] o.a.s.h.a.CoreAdminOperation core create command qt=/admin/cores&collection.configName=conf1&newCollection=true&name=testcollection_shard1_replica_p2&action=CREATE&numShards=2&collection=testcollection&shard=shard1&wt=javabin&version=2&replicaType=PULL
   [junit4]   2> 666581 INFO  (qtp1195611840-10274) [n:127.0.0.1:36627_    x:testcollection_shard2_replica_n3] o.a.s.h.a.CoreAdminOperation core create command qt=/admin/cores&collection.configName=conf1&newCollection=true&name=testcollection_shard2_replica_n3&action=CREATE&numShards=2&collection=testcollection&shard=shard2&wt=javabin&version=2&replicaType=NRT
   [junit4]   2> 666589 INFO  (qtp1797003792-10190) [n:127.0.0.1:40161_    x:testcollection_shard2_replica_p4] o.a.s.h.a.CoreAdminOperation core create command qt=/admin/cores&collection.configName=conf1&newCollection=true&name=testcollection_shard2_replica_p4&action=CREATE&numShards=2&collection=testcollection&shard=shard2&wt=javabin&version=2&replicaType=PULL
   [junit4]   2> 667595 INFO  (qtp1797003792-10192) [n:127.0.0.1:40161_ c:testcollection s:shard1  x:testcollection_shard1_replica_n1] o.a.s.c.SolrConfig Using Lucene MatchVersion: 9.0.0
   [junit4]   2> 667599 INFO  (qtp1195611840-10274) [n:127.0.0.1:36627_ c:testcollection s:shard2  x:testcollection_shard2_replica_n3] o.a.s.c.SolrConfig Using Lucene MatchVersion: 9.0.0
   [junit4]   2> 667602 INFO  (qtp625389845-10326) [n:127.0.0.1:36495_ c:testcollection s:shard1  x:testcollection_shard1_replica_p2] o.a.s.c.SolrConfig Using Lucene MatchVersion: 9.0.0
   [junit4]   2> 667605 INFO  (qtp1797003792-10190) [n:127.0.0.1:40161_ c:testcollection s:shard2  x:testcollection_shard2_replica_p4] o.a.s.c.SolrConfig Using Lucene MatchVersion: 9.0.0
   [junit4]   2> 667644 INFO  (qtp1797003792-10192) [n:127.0.0.1:40161_ c:testcollection s:shard1  x:testcollection_shard1_replica_n1] o.a.s.s.IndexSchema [testcollection_shard1_replica_n1] Schema name=test
   [junit4]   2> 667650 INFO  (qtp1797003792-10190) [n:127.0.0.1:40161_ c:testcollection s:shard2  x:testcollection_shard2_replica_p4] o.a.s.s.IndexSchema [testcollection_shard2_replica_p4] Schema name=test
   [junit4]   2> 667652 INFO  (qtp625389845-10326) [n:127.0.0.1:36495_ c:testcollection s:shard1  x:testcollection_shard1_replica_p2] o.a.s.s.IndexSchema [testcollection_shard1_replica_p2] Schema name=test
   [junit4]   2> 667702 INFO  (qtp1195611840-10274) [n:127.0.0.1:36627_ c:testcollection s:shard2  x:testcollection_shard2_replica_n3] o.a.s.s.IndexSchema [testcollection_shard2_replica_n3] Schema name=test
   [junit4]   2> 667894 INFO  (qtp625389845-10326) [n:127.0.0.1:36495_ c:testcollection s:shard1  x:testcollection_shard1_replica_p2] o.a.s.s.IndexSchema Loaded schema test/1.6 with uniqueid field id
   [junit4]   2> 667928 INFO  (qtp1797003792-10192) [n:127.0.0.1:40161_ c:testcollection s:shard1  x:testcollection_shard1_replica_n1] o.a.s.s.IndexSchema Loaded schema test/1.6 with uniqueid field id
   [junit4]   2> 667935 INFO  (qtp625389845-10326) [n:127.0.0.1:36495_ c:testcollection s:shard1  x:testcollection_shard1_replica_p2] o.a.s.c.CoreContainer Creating SolrCore 'testcollection_shard1_replica_p2' using configuration from collection testcollection, trusted=true
   [junit4]   2> 667935 INFO  (qtp625389845-10326) [n:127.0.0.1:36495_ c:testcollection s:shard1  x:testcollection_shard1_replica_p2] o.a.s.m.r.SolrJmxReporter JMX monitoring for 'solr.core.testcollection.shard1.replica_p2' (registry 'solr.core.testcollection.shard1.replica_p2') enabled at server: com.sun.jmx.mbeanserver.JmxMBeanServer@148acbb
   [junit4]   2> 667936 INFO  (qtp625389845-10326) [n:127.0.0.1:36495_ c:testcollection s:shard1  x:testcollection_shard1_replica_p2] o.a.s.c.SolrCore [[testcollection_shard1_replica_p2] ] Opening new SolrCore at [/home/jenkins/workspace/Lucene-Solr-master-Linux/solr/build/solr-core/test/J1/temp/solr.cloud.api.collections.TestCollectionAPI_2C3A633764C1BE0F-001/shard-1-001/cores/testcollection_shard1_replica_p2], dataDir=[/home/jenkins/workspace/Lucene-Solr-master-Linux/solr/build/solr-core/test/J1/temp/solr.cloud.api.collections.TestCollectionAPI_2C3A633764C1BE0F-001/shard-1-001/cores/testcollection_shard1_replica_p2/data/]
   [junit4]   2> 667941 INFO  (qtp1797003792-10190) [n:127.0.0.1:40161_ c:testcollection s:shard2  x:testcollection_shard2_replica_p4] o.a.s.s.IndexSchema Loaded schema test/1.6 with uniqueid field id
   [junit4]   2> 667943 INFO  (qtp625389845-10326) [n:127.0.0.1:36495_ c:testcollection s:shard1  x:testcollection_shard1_replica_p2] o.a.s.u.RandomMergePolicy RandomMergePolicy wrapping class org.apache.lucene.index.LogByteSizeMergePolicy: [LogByteSizeMergePolicy: minMergeSize=1677721, mergeFactor=16, maxMergeSize=2147483648, maxMergeSizeForForcedMerge=9223372036854775807, calibrateSizeByDeletes=false, maxMergeDocs=2147483647, maxCFSSegmentSizeMB=8.796093022207999E12, noCFSRatio=1.0]
   [junit4]   2> 667949 INFO  (qtp1797003792-10192) [n:127.0.0.1:40161_ c:testcollection s:shard1  x:testcollection_shard1_replica_n1] o.a.s.c.CoreContainer Creating SolrCore 'testcollection_shard1_replica_n1' using configuration from collection testcollection, trusted=true
   [junit4]   2> 667949 INFO  (qtp1797003792-10192) [n:127.0.0.1:40161_ c:testcollection s:shard1  x:testcollection_shard1_replica_n1] o.a.s.m.r.SolrJmxReporter JMX monitoring for 'solr.core.testcollection.shard1.replica_n1' (registry 'solr.core.testcollection.shard1.replica_n1') enabled at server: com.sun.jmx.mbeanserver.JmxMBeanServer@148acbb
   [junit4]   2> 667950 INFO  (qtp1195611840-10274) [n:127.0.0.1:36627_ c:testcollection s:shard2  x:testcollection_shard2_replica_n3] o.a.s.s.IndexSchema Loaded schema test/1.6 with uniqueid field id
   [junit4]   2> 667949 INFO  (qtp1797003792-10192) [n:127.0.0.1:40161_ c:testcollection s:shard1  x:testcollection_shard1_replica_n1] o.a.s.c.SolrCore [[testcollection_shard1_replica_n1] ] Opening new SolrCore at [/home/jenkins/workspace/Lucene-Solr-master-Linux/solr/build/solr-core/test/J1/temp/solr.cloud.api.collections.TestCollectionAPI_2C3A633764C1BE0F-001/control-001/cores/testcollection_shard1_replica_n1], dataDir=[/home/jenkins/workspace/Lucene-Solr-master-Linux/solr/build/solr-core/test/J1/../../../../../../../../../home/jenkins/workspace/Lucene-Solr-master-Linux/solr/build/solr-core/test/J1/temp/solr.cloud.api.collections.TestCollectionAPI_2C3A633764C1BE0F-001/control-001/cores/testcollection_shard1_replica_n1/data/]
   [junit4]   2> 667952 INFO  (qtp1797003792-10192) [n:127.0.0.1:40161_ c:testcollection s:shard1  x:testcollection_shard1_replica_n1] o.a.s.u.RandomMergePolicy RandomMergePolicy wrapping class org.apache.lucene.index.LogByteSizeMergePolicy: [LogByteSizeMergePolicy: minMergeSize=1677721, mergeFactor=16, maxMergeSize=2147483648, maxMergeSizeForForcedMerge=9223372036854775807, calibrateSizeByDeletes=false, maxMergeDocs=2147483647, maxCFSSegmentSizeMB=8.796093022207999E12, noCFSRatio=1.0]
   [junit4]   2> 667957 WARN  (qtp625389845-10326) [n:127.0.0.1:36495_ c:testcollection s:shard1  x:testcollection_shard1_replica_p2] o.a.s.c.RequestHandlers INVALID paramSet a in requestHandler {type = requestHandler,name = /dump,class = DumpRequestHandler,attributes = {initParams=a, name=/dump, class=DumpRequestHandler},args = {defaults={a=A,b=B}}}
   [junit4]   2> 667959 INFO  (qtp1797003792-10190) [n:127.0.0.1:40161_ c:testcollection s:shard2  x:testcollection_shard2_replica_p4] o.a.s.c.CoreContainer Creating SolrCore 'testcollection_shard2_replica_p4' using configuration from collection testcollection, trusted=true
   [junit4]   2> 667960 INFO  (qtp1797003792-10190) [n:127.0.0.1:40161_ c:testcollection s:shard2  x:testcollection_shard2_replica_p4] o.a.s.m.r.SolrJmxReporter JMX monitoring for 'solr.core.testcollection.shard2.replica_p4' (registry 'solr.core.testcollection.shard2.replica_p4') enabled at server: com.sun.jmx.mbeanserver.JmxMBeanServer@148acbb
   [junit4]   2> 667960 INFO  (qtp1797003792-10190) [n:127.0.0.1:40161_ c:testcollection s:shard2  x:testcollection_shard2_replica_p4] o.a.s.c.SolrCore [[testcollection_shard2_replica_p4] ] Opening new SolrCore at [/home/jenkins/workspace/Lucene-Solr-master-Linux/solr/build/solr-core/test/J1/temp/solr.cloud.api.collections.TestCollectionAPI_2C3A633764C1BE0F-001/control-001/cores/testcollection_shard2_replica_p4], dataDir=[/home/jenkins/workspace/Lucene-Solr-master-Linux/solr/build/solr-core/test/J1/../../../../../../../../../home/jenkins/workspace/Lucene-Solr-master-Linux/solr/build/solr-core/test/J1/temp/solr.cloud.api.collections.TestCollectionAPI_2C3A633764C1BE0F-001/control-001/cores/testcollection_shard2_replica_p4/data/]
   [junit4]   2> 667964 INFO  (qtp1797003792-10190) [n:127.0.0.1:40161_ c:testcollection s:shard2  x:testcollection_shard2_replica_p4] o.a.s.u.RandomMergePolicy RandomMergePolicy wrapping class org.apache.lucene.index.TieredMergePolicy: [TieredMergePolicy: maxMergeAtOnce=34, maxMergeAtOnceExplicit=42, maxMergedSegmentMB=15.3427734375, floorSegmentMB=1.65234375, forceMergeDeletesPctAllowed=1.8163108102061654, segmentsPerTier=28.0, maxCFSSegmentSizeMB=8.796093022207999E12, noCFSRatio=0.0, deletesPctAllowed=24.730861884372246
   [junit4]   2> 667967 INFO  (qtp1195611840-10274) [n:127.0.0.1:36627_ c:testcollection s:shard2  x:testcollection_shard2_replica_n3] o.a.s.c.CoreContainer Creating SolrCore 'testcollection_shard2_replica_n3' using configuration from collection testcollection, trusted=true
   [junit4]   2> 667968 INFO  (qtp1195611840-10274) [n:127.0.0.1:36627_ c:testcollection s:shard2  x:testcollection_shard2_replica_n3] o.a.s.m.r.SolrJmxReporter JMX monitoring for 'solr.core.testcollection.shard2.replica_n3' (registry 'solr.core.testcollection.shard2.replica_n3') enabled at server: com.sun.jmx.mbeanserver.JmxMBeanServer@148acbb
   [junit4]   2> 667968 INFO  (qtp1195611840-10274) [n:127.0.0.1:36627_ c:testcollection s:shard2  x:testcollection_shard2_replica_n3] o.a.s.c.SolrCore [[testcollection_shard2_replica_n3] ] Opening new SolrCore at [/home/jenkins/workspace/Lucene-Solr-master-Linux/solr/build/solr-core/test/J1/temp/solr.cloud.api.collections.TestCollectionAPI_2C3A633764C1BE0F-001/shard-2-001/cores/testcollection_shard2_replica_n3], dataDir=[/home/jenkins/workspace/Lucene-Solr-master-Linux/solr/build/solr-core/test/J1/temp/solr.cloud.api.collections.TestCollectionAPI_2C3A633764C1BE0F-001/shard-2-001/cores/testcollection_shard2_replica_n3/data/]
   [junit4]   2> 667970 INFO  (qtp1195611840-10274) [n:127.0.0.1:36627_ c:testcollection s:shard2  x:testcollection_shard2_replica_n3] o.a.s.u.RandomMergePolicy RandomMergePolicy wrapping class org.apache.lucene.index.LogByteSizeMergePolicy: [LogByteSizeMergePolicy: minMergeSize=1677721, mergeFactor=16, maxMergeSize=2147483648, maxMergeSizeForForcedMerge=9223372036854775807, calibrateSizeByDeletes=false, maxMergeDocs=2147483647, maxCFSSegmentSizeMB=8.796093022207999E12, noCFSRatio=1.0]
   [junit4]   2> 667973 WARN  (qtp1797003792-10192) [n:127.0.0.1:40161_ c:testcollection s:shard1  x:testcollection_shard1_replica_n1] o.a.s.c.RequestHandlers INVALID paramSet a in requestHandler {type = requestHandler,name = /dump,class = DumpRequestHandler,attributes = {initParams=a, name=/dump, class=DumpRequestHandler},args = {defaults={a=A,b=B}}}
   [junit4]   2> 667987 WARN  (qtp1195611840-10274) [n:127.0.0.1:36627_ c:testcollection s:shard2  x:testcollection_shard2_replica_n3] o.a.s.c.RequestHandlers INVALID paramSet a in requestHandler {type = requestHandler,name = /dump,class = DumpRequestHandler,attributes = {initParams=a, name=/dump, class=DumpRequestHandler},args = {defaults={a=A,b=B}}}
   [junit4]   2> 668103 WARN  (qtp1797003792-10190) [n:127.0.0.1:40161_ c:testcollection s:shard2  x:testcollection_shard2_replica_p4] o.a.s.c.RequestHandlers INVALID paramSet a in requestHandler {type = requestHandler,name = /dump,class = DumpRequestHandler,attributes = {initParams=a, name=/dump, class=DumpRequestHandler},args = {defaults={a=A,b=B}}}
   [junit4]   2> 668136 INFO  (qtp625389845-10326) [n:127.0.0.1:36495_ c:testcollection s:shard1  x:testcollection_shard1_replica_p2] o.a.s.u.CommitTracker Hard AutoCommit: disabled
   [junit4]   2> 668137 INFO  (qtp625389845-10326) [n:127.0.0.1:36495_ c:testcollection s:shard1  x:testcollection_shard1_replica_p2] o.a.s.u.CommitTracker Soft AutoCommit: disabled
   [junit4]   2> 668137 INFO  (qtp625389845-10326) [n:127.0.0.1:36495_ c:testcollection s:shard1  x:testcollection_shard1_replica_p2] o.a.s.u.RandomMergePolicy RandomMergePolicy wrapping class org.apache.lucene.index.LogByteSizeMergePolicy: [LogByteSizeMergePolicy: minMergeSize=1677721, mergeFactor=21, maxMergeSize=2147483648, maxMergeSizeForForcedMerge=9223372036854775807, calibrateSizeByDeletes=true, maxMergeDocs=2147483647, maxCFSSegmentSizeMB=8.796093022207999E12, noCFSRatio=1.0]
   [junit4]   2> 668137 INFO  (qtp625389845-10326) [n:127.0.0.1:36495_ c:testcollection s:shard1  x:testcollection_shard1_replica_p2] o.a.s.s.SolrIndexSearcher Opening [Searcher@305eb5c5[testcollection_shard1_replica_p2] main]
   [junit4]   2> 668138 INFO  (qtp625389845-10326) [n:127.0.0.1:36495_ c:testcollection s:shard1  x:testcollection_shard1_replica_p2] o.a.s.r.ManagedResourceStorage Configured ZooKeeperStorageIO with znodeBase: /configs/conf1
   [junit4]   2> 668138 INFO  (qtp625389845-10326) [n:127.0.0.1:36495_ c:testcollection s:shard1  x:testcollection_shard1_replica_p2] o.a.s.r.ManagedResourceStorage Loaded null at path _rest_managed.json using ZooKeeperStorageIO:path=/configs/conf1
   [junit4]   2> 668139 INFO  (qtp625389845-10326) [n:127.0.0.1:36495_ c:testcollection s:shard1  x:testcollection_shard1_replica_p2] o.a.s.h.ReplicationHandler Commits will be reserved for 10000ms.
   [junit4]   2> 668140 INFO  (qtp625389845-10326) [n:127.0.0.1:36495_ c:testcollection s:shard1  x:testcollection_shard1_replica_p2] o.a.s.c.ZkController testcollection_shard1_replica_p2 starting background replication from leader
   [junit4]   2> 668140 INFO  (qtp625389845-10326) [n:127.0.0.1:36495_ c:testcollection s:shard1  x:testcollection_shard1_replica_p2] o.a.s.c.ReplicateFromLeader Will start replication from leader with poll interval: 00:00:01
   [junit4]   2> 668145 INFO  (qtp1797003792-10192) [n:127.0.0.1:40161_ c:testcollection s:shard1  x:testcollection_shard1_replica_n1] o.a.s.u.UpdateHandler Using UpdateLog implementation: org.apache.solr.update.UpdateLog
   [junit4]   2> 668145 INFO  (qtp1797003792-10192) [n:127.0.0.1:40161_ c:testcollection s:shard1  x:testcollection_shard1_replica_n1] o.a.s.u.UpdateLog Initializing UpdateLog: dataDir= defaultSyncLevel=FLUSH numRecordsToKeep=100 maxNumLogsToKeep=10 numVersionBuckets=65536
   [junit4]   2> 668147 INFO  (qtp1797003792-10192) [n:127.0.0.1:40161_ c:testcollection s:shard1  x:testcollection_shard1_replica_n1] o.a.s.u.CommitTracker Hard AutoCommit: disabled
   [junit4]   2> 668147 INFO  (qtp1797003792-10192) [n:127.0.0.1:40161_ c:testcollection s:shard1  x:testcollection_shard1_replica_n1] o.a.s.u.CommitTracker Soft AutoCommit: disabled
   [junit4]   2> 668148 INFO  (qtp1797003792-10192) [n:127.0.0.1:40161_ c:testcollection s:shard1  x:testcollection_shard1_replica_n1] o.a.s.u.RandomMergePolicy RandomMergePolicy wrapping class org.apache.lucene.index.LogByteSizeMergePolicy: [LogByteSizeMergePolicy: minMergeSize=1677721, mergeFactor=21, maxMergeSize=2147483648, maxMergeSizeForForcedMerge=9223372036854775807, calibrateSizeByDeletes=true, maxMergeDocs=2147483647, maxCFSSegmentSizeMB=8.796093022207999E12, noCFSRatio=1.0]
   [junit4]   2> 668148 INFO  (qtp1797003792-10192) [n:127.0.0.1:40161_ c:testcollection s:shard1  x:testcollection_shard1_replica_n1] o.a.s.s.SolrIndexSearcher Opening [Searcher@21a35a58[testcollection_shard1_replica_n1] main]
   [junit4]   2> 668149 INFO  (qtp1797003792-10190) [n:127.0.0.1:40161_ c:testcollection s:shard2  x:testcollection_shard2_replica_p4] o.a.s.u.CommitTracker Hard AutoCommit: disabled
   [junit4]   2> 668149 INFO  (qtp1797003792-10190) [n:127.0.0.1:40161_ c:testcollection s:shard2  x:testcollection_shard2_replica_p4] o.a.s.u.CommitTracker Soft AutoCommit: disabled
   [junit4]   2> 668149 INFO  (qtp1797003792-10192) [n:127.0.0.1:40161_ c:testcollection s:shard1  x:testcollection_shard1_replica_n1] o.a.s.r.ManagedResourceStorage Configured ZooKeeperStorageIO with znodeBase: /configs/conf1
   [junit4]   2> 668149 INFO  (searcherExecutor-3190-thread-1-processing-n:127.0.0.1:36495_ x:testcollection_shard1_replica_p2 c:testcollection s:shard1) [n:127.0.0.1:36495_ c:testcollection s:shard1  x:testcollection_shard1_replica_p2] o.a.s.c.SolrCore [testcollection_shard1_replica_p2] Registered new searcher Searcher@305eb5c5[testcollection_shard1_replica_p2] main{ExitableDirectoryReader(UninvertingDirectoryReader())}
   [junit4]   2> 668149 INFO  (qtp1797003792-10192) [n:127.0.0.1:40161_ c:testcollection s:shard1  x:testcollection_shard1_replica_n1] o.a.s.r.ManagedResourceStorage Loaded null at path _rest_managed.json using ZooKeeperStorageIO:path=/configs/conf1
   [junit4]   2> 668149 INFO  (qtp1797003792-10192) [n:127.0.0.1:40161_ c:testcollection s:shard1  x:testcollection_shard1_replica_n1] o.a.s.h.ReplicationHandler Commits will be reserved for 10000ms.
   [junit4]   2> 668149 INFO  (qtp1797003792-10192) [n:127.0.0.1:40161_ c:testcollection s:shard1  x:testcollection_shard1_replica_n1] o.a.s.u.UpdateLog Could not find max version in index or recent updates, using new clock 1630184596378222592
   [junit4]   2> 668152 INFO  (qtp625389845-10326) [n:127.0.0.1:36495_ c:testcollection s:shard1  x:testcollection_shard1_replica_p2] o.a.s.h.ReplicationHandler Poll scheduled at an interval of 1000ms
   [junit4]   2> 668152 INFO  (qtp625389845-10326) [n:127.0.0.1:36495_ c:testcollection s:shard1  x:testcollection_shard1_replica_p2] o.a.s.h.ReplicationHandler Commits will be reserved for 10000ms.
   [junit4]   2> 668153 INFO  (qtp1797003792-10190

[...truncated too long message...]

ath:

-clover.setup:

clover:

compile-core:

init:

-clover.disable:

-clover.load:

-clover.classpath:

-clover.setup:

clover:

common.compile-core:
    [javac] Compiling 3 source files to /home/jenkins/workspace/Lucene-Solr-master-Linux/solr/build/solr-core/classes/java

common-solr.compile-core:

compile-core:

compile-test-framework:

-check-git-state:

-git-cleanroot:

-copy-git-state:

git-autoclean:

ivy-availability-check:
[loadresource] Do not set property disallowed.ivy.jars.list as its length is 0.

-ivy-fail-disallowed-ivy-version:

ivy-fail:

ivy-configure:
[ivy:configure] :: loading settings :: file = /home/jenkins/workspace/Lucene-Solr-master-Linux/lucene/top-level-ivy-settings.xml

resolve:

init:

compile-lucene-core:

compile-codecs:

-check-git-state:

-git-cleanroot:

-copy-git-state:

git-autoclean:

ivy-availability-check:
[loadresource] Do not set property disallowed.ivy.jars.list as its length is 0.

-ivy-fail-disallowed-ivy-version:

ivy-fail:

ivy-configure:
[ivy:configure] :: loading settings :: file = /home/jenkins/workspace/Lucene-Solr-master-Linux/lucene/top-level-ivy-settings.xml

resolve:

common.init:

compile-lucene-core:

init:

-clover.disable:

-clover.load:

-clover.classpath:

-clover.setup:

clover:

compile-core:

-clover.disable:

-clover.load:

-clover.classpath:

-clover.setup:

clover:

common.compile-core:

compile-core:

common.compile-test:
    [mkdir] Created dir: /home/jenkins/workspace/Lucene-Solr-master-Linux/solr/build/solr-core/classes/test
    [javac] Compiling 957 source files to /home/jenkins/workspace/Lucene-Solr-master-Linux/solr/build/solr-core/classes/test
    [javac] Note: Some input files use or override a deprecated API.
    [javac] Note: Recompile with -Xlint:deprecation for details.
    [javac] Note: Some input files use unchecked or unsafe operations.
    [javac] Note: Recompile with -Xlint:unchecked for details.
    [javac] Creating empty /home/jenkins/workspace/Lucene-Solr-master-Linux/solr/build/solr-core/classes/test/org/apache/solr/cloud/autoscaling/sim/package-info.class
     [copy] Copying 1 file to /home/jenkins/workspace/Lucene-Solr-master-Linux/solr/build/solr-core/classes/test

common-solr.compile-test:

compile-test:

BUILD SUCCESSFUL
Total time: 1 minute 31 seconds
[repro] ant test-nocompile -Dtests.dups=5 -Dtests.maxfailures=5 -Dtests.class="*.TestCollectionAPI" -Dtests.showOutput=onerror "-Dargs=-XX:-UseCompressedOops -XX:+UseG1GC" -Dtests.seed=2C3A633764C1BE0F -Dtests.multiplier=3 -Dtests.slow=true -Dtests.locale=cs-CZ -Dtests.timezone=Africa/Lusaka -Dtests.asserts=true -Dtests.file.encoding=US-ASCII
Buildfile: /home/jenkins/workspace/Lucene-Solr-master-Linux/solr/core/build.xml

-clover.disable:

ivy-configure:
[ivy:configure] :: Apache Ivy 2.4.0 - 20141213170938 :: http://ant.apache.org/ivy/ ::
[ivy:configure] :: loading settings :: file = /home/jenkins/workspace/Lucene-Solr-master-Linux/lucene/top-level-ivy-settings.xml

install-junit4-taskdef:

ivy-availability-check:
[loadresource] Do not set property disallowed.ivy.jars.list as its length is 0.

-ivy-fail-disallowed-ivy-version:

ivy-fail:

resolve-groovy:
[ivy:cachepath] :: resolving dependencies :: org.codehaus.groovy#groovy-all-caller;working
[ivy:cachepath] 	confs: [default]
[ivy:cachepath] 	found org.codehaus.groovy#groovy-all;2.4.15 in public
[ivy:cachepath] :: resolution report :: resolve 356ms :: artifacts dl 2ms
	---------------------------------------------------------------------
	|                  |            modules            ||   artifacts   |
	|       conf       | number| search|dwnlded|evicted|| number|dwnlded|
	---------------------------------------------------------------------
	|      default     |   1   |   0   |   0   |   0   ||   1   |   0   |
	---------------------------------------------------------------------

-init-totals:

-test:
    [mkdir] Created dir: /home/jenkins/workspace/Lucene-Solr-master-Linux/solr/build/solr-core/test
[junit4:pickseed] Seed property 'tests.seed' already defined: 2C3A633764C1BE0F
    [mkdir] Created dir: /home/jenkins/workspace/Lucene-Solr-master-Linux/solr/build/solr-core/test/temp
   [junit4] <JUnit4> says مرحبا! Master seed: 2C3A633764C1BE0F
   [junit4] Executing 5 suites with 3 JVMs.
   [junit4] 
   [junit4] Started J1 PID(25218@serv1.sd-datasolutions.de).
   [junit4] Started J0 PID(25216@serv1.sd-datasolutions.de).
   [junit4] Started J2 PID(25215@serv1.sd-datasolutions.de).
   [junit4] Suite: org.apache.solr.cloud.api.collections.TestCollectionAPI
   [junit4] OK      38.7s J2 | TestCollectionAPI.test
   [junit4] Completed [1/5] on J2 in 42.05s, 1 test
   [junit4] 
   [junit4] Suite: org.apache.solr.cloud.api.collections.TestCollectionAPI
   [junit4] OK      39.2s J1 | TestCollectionAPI.test
   [junit4] Completed [2/5] on J1 in 42.55s, 1 test
   [junit4] 
   [junit4] Suite: org.apache.solr.cloud.api.collections.TestCollectionAPI
   [junit4] OK      38.7s J0 | TestCollectionAPI.test
   [junit4] Completed [3/5] on J0 in 42.42s, 1 test
   [junit4] 
   [junit4] Suite: org.apache.solr.cloud.api.collections.TestCollectionAPI
   [junit4] OK      24.1s J2 | TestCollectionAPI.test
   [junit4] Completed [4/5] on J2 in 24.66s, 1 test
   [junit4] 
   [junit4] Suite: org.apache.solr.cloud.api.collections.TestCollectionAPI
   [junit4] OK      25.2s J0 | TestCollectionAPI.test
   [junit4] Completed [5/5] on J0 in 25.77s, 1 test
   [junit4] 
   [junit4] JVM J0:     1.63 ..    71.23 =    69.60s
   [junit4] JVM J1:     1.41 ..    45.44 =    44.04s
   [junit4] JVM J2:     1.64 ..    70.04 =    68.40s
   [junit4] Execution time total: 1 minute 11 seconds
   [junit4] Tests summary: 5 suites, 5 tests
   [junit4] Could not remove temporary path: /home/jenkins/workspace/Lucene-Solr-master-Linux/solr/build/solr-core/test/J0 (java.nio.file.DirectoryNotEmptyException: Remaining files: [/home/jenkins/workspace/Lucene-Solr-master-Linux/solr/build/solr-core/test/J0/temp])
   [junit4] Could not remove temporary path: /home/jenkins/workspace/Lucene-Solr-master-Linux/solr/build/solr-core/test/J2 (java.nio.file.DirectoryNotEmptyException: Remaining files: [/home/jenkins/workspace/Lucene-Solr-master-Linux/solr/build/solr-core/test/J2/temp])
   [junit4] Could not remove temporary path: /home/jenkins/workspace/Lucene-Solr-master-Linux/solr/build/solr-core/test/J1 (java.nio.file.DirectoryNotEmptyException: Remaining files: [/home/jenkins/workspace/Lucene-Solr-master-Linux/solr/build/solr-core/test/J1/temp])
     [echo] 5 slowest tests:
[junit4:tophints] 224.31s | org.apache.solr.request.TestIntervalFaceting
[junit4:tophints] 201.23s | org.apache.solr.search.TestRangeQuery
[junit4:tophints] 200.34s | org.apache.solr.cloud.api.collections.ShardSplitTest
[junit4:tophints] 142.33s | org.apache.solr.search.facet.TestJsonFacets
[junit4:tophints] 116.81s | org.apache.solr.update.SoftAutoCommitTest

-check-totals:

test-nocompile:

BUILD SUCCESSFUL
Total time: 1 minute 14 seconds
[repro] Failures:
[repro]   0/5 failed: org.apache.solr.cloud.api.collections.TestCollectionAPI
[repro] Exiting with code 0
+ mv lucene/build lucene/build.repro
+ mv solr/build solr/build.repro
+ mv lucene/build.orig lucene/build
+ mv solr/build.orig solr/build
Archiving artifacts
Setting ANT_1_8_2_HOME=/home/jenkins/tools/hudson.tasks.Ant_AntInstallation/ANT_1.8.2
java.lang.InterruptedException: no matches found within 10000
	at hudson.FilePath$ValidateAntFileMask.hasMatch(FilePath.java:2801)
	at hudson.FilePath$ValidateAntFileMask.invoke(FilePath.java:2680)
	at hudson.FilePath$ValidateAntFileMask.invoke(FilePath.java:2661)
	at hudson.FilePath.act(FilePath.java:1074)
	at hudson.FilePath.act(FilePath.java:1057)
	at hudson.FilePath.validateAntFileMask(FilePath.java:2659)
	at hudson.tasks.ArtifactArchiver.perform(ArtifactArchiver.java:243)
	at hudson.tasks.BuildStepCompatibilityLayer.perform(BuildStepCompatibilityLayer.java:79)
	at hudson.tasks.BuildStepMonitor$1.perform(BuildStepMonitor.java:20)
	at hudson.model.AbstractBuild$AbstractBuildExecution.perform(AbstractBuild.java:744)
	at hudson.model.AbstractBuild$AbstractBuildExecution.performAllBuildSteps(AbstractBuild.java:690)
	at hudson.model.Build$BuildExecution.post2(Build.java:186)
	at hudson.model.AbstractBuild$AbstractBuildExecution.post(AbstractBuild.java:635)
	at hudson.model.Run.execute(Run.java:1841)
	at hudson.model.FreeStyleBuild.run(FreeStyleBuild.java:43)
	at hudson.model.ResourceController.execute(ResourceController.java:97)
	at hudson.model.Executor.run(Executor.java:429)
No artifacts found that match the file pattern "**/*.events,heapdumps/**,**/*_pid*.log". Configuration error?
[WARNINGS] Parsing warnings in console log with parser Java Compiler (javac)
Setting ANT_1_8_2_HOME=/home/jenkins/tools/hudson.tasks.Ant_AntInstallation/ANT_1.8.2
No credentials specified
Setting ANT_1_8_2_HOME=/home/jenkins/tools/hudson.tasks.Ant_AntInstallation/ANT_1.8.2
<Git Blamer> Using GitBlamer to create author and commit information for all warnings.
<Git Blamer> GIT_COMMIT=ef7be67ba12c8f518591b1e6ec7c1d88e0834dc1, workspace=/home/jenkins/workspace/Lucene-Solr-master-Linux
[WARNINGS] Computing warning deltas based on reference build #23881
Recording test results
Setting ANT_1_8_2_HOME=/home/jenkins/tools/hudson.tasks.Ant_AntInstallation/ANT_1.8.2
Build step 'Publish JUnit test result report' changed build result to UNSTABLE
Email was triggered for: Unstable (Test Failures)
Sending email for trigger: Unstable (Test Failures)
Setting ANT_1_8_2_HOME=/home/jenkins/tools/hudson.tasks.Ant_AntInstallation/ANT_1.8.2
Setting ANT_1_8_2_HOME=/home/jenkins/tools/hudson.tasks.Ant_AntInstallation/ANT_1.8.2
Setting ANT_1_8_2_HOME=/home/jenkins/tools/hudson.tasks.Ant_AntInstallation/ANT_1.8.2
Setting ANT_1_8_2_HOME=/home/jenkins/tools/hudson.tasks.Ant_AntInstallation/ANT_1.8.2
Setting ANT_1_8_2_HOME=/home/jenkins/tools/hudson.tasks.Ant_AntInstallation/ANT_1.8.2
Setting ANT_1_8_2_HOME=/home/jenkins/tools/hudson.tasks.Ant_AntInstallation/ANT_1.8.2