You are viewing a plain text version of this content. The canonical link for it is here.
Posted to dev@lucene.apache.org by Apache Jenkins Server <je...@builds.apache.org> on 2015/06/11 04:26:25 UTC
[JENKINS] Lucene-Solr-NightlyTests-5.2 - Build # 14 - Still Failing
Build: https://builds.apache.org/job/Lucene-Solr-NightlyTests-5.2/14/
1 tests failed.
FAILED: org.apache.solr.cloud.CollectionsAPIDistributedZkTest.test
Error Message:
Error from server at http://127.0.0.1:60137/nobc/pn: Error CREATEing SolrCore 'halfcollection_shard1_replica1': Error reading cluster properties Caused by: KeeperErrorCode = Session expired for /clusterprops.json
Stack Trace:
org.apache.solr.client.solrj.impl.HttpSolrClient$RemoteSolrException: Error from server at http://127.0.0.1:60137/nobc/pn: Error CREATEing SolrCore 'halfcollection_shard1_replica1': Error reading cluster properties Caused by: KeeperErrorCode = Session expired for /clusterprops.json
at org.apache.solr.client.solrj.impl.HttpSolrClient.executeMethod(HttpSolrClient.java:560)
at org.apache.solr.client.solrj.impl.HttpSolrClient.request(HttpSolrClient.java:235)
at org.apache.solr.client.solrj.impl.HttpSolrClient.request(HttpSolrClient.java:227)
at org.apache.solr.client.solrj.SolrClient.request(SolrClient.java:1220)
at org.apache.solr.cloud.CollectionsAPIDistributedZkTest.makeRequest(CollectionsAPIDistributedZkTest.java:325)
at org.apache.solr.cloud.CollectionsAPIDistributedZkTest.testErrorHandling(CollectionsAPIDistributedZkTest.java:442)
at org.apache.solr.cloud.CollectionsAPIDistributedZkTest.test(CollectionsAPIDistributedZkTest.java:188)
at sun.reflect.NativeMethodAccessorImpl.invoke0(Native Method)
at sun.reflect.NativeMethodAccessorImpl.invoke(NativeMethodAccessorImpl.java:57)
at sun.reflect.DelegatingMethodAccessorImpl.invoke(DelegatingMethodAccessorImpl.java:43)
at java.lang.reflect.Method.invoke(Method.java:606)
at com.carrotsearch.randomizedtesting.RandomizedRunner.invoke(RandomizedRunner.java:1627)
at com.carrotsearch.randomizedtesting.RandomizedRunner$6.evaluate(RandomizedRunner.java:836)
at com.carrotsearch.randomizedtesting.RandomizedRunner$7.evaluate(RandomizedRunner.java:872)
at com.carrotsearch.randomizedtesting.RandomizedRunner$8.evaluate(RandomizedRunner.java:886)
at org.apache.solr.BaseDistributedSearchTestCase$ShardsRepeatRule$ShardsFixedStatement.callStatement(BaseDistributedSearchTestCase.java:960)
at org.apache.solr.BaseDistributedSearchTestCase$ShardsRepeatRule$ShardsStatement.evaluate(BaseDistributedSearchTestCase.java:935)
at com.carrotsearch.randomizedtesting.rules.SystemPropertiesRestoreRule$1.evaluate(SystemPropertiesRestoreRule.java:57)
at org.apache.lucene.util.TestRuleSetupTeardownChained$1.evaluate(TestRuleSetupTeardownChained.java:50)
at org.apache.lucene.util.AbstractBeforeAfterRule$1.evaluate(AbstractBeforeAfterRule.java:46)
at org.apache.lucene.util.TestRuleThreadAndTestName$1.evaluate(TestRuleThreadAndTestName.java:49)
at org.apache.lucene.util.TestRuleIgnoreAfterMaxFailures$1.evaluate(TestRuleIgnoreAfterMaxFailures.java:65)
at org.apache.lucene.util.TestRuleMarkFailure$1.evaluate(TestRuleMarkFailure.java:48)
at com.carrotsearch.randomizedtesting.rules.StatementAdapter.evaluate(StatementAdapter.java:36)
at com.carrotsearch.randomizedtesting.ThreadLeakControl$StatementRunner.run(ThreadLeakControl.java:365)
at com.carrotsearch.randomizedtesting.ThreadLeakControl.forkTimeoutingTask(ThreadLeakControl.java:798)
at com.carrotsearch.randomizedtesting.ThreadLeakControl$3.evaluate(ThreadLeakControl.java:458)
at com.carrotsearch.randomizedtesting.RandomizedRunner.runSingleTest(RandomizedRunner.java:845)
at com.carrotsearch.randomizedtesting.RandomizedRunner$3.evaluate(RandomizedRunner.java:747)
at com.carrotsearch.randomizedtesting.RandomizedRunner$4.evaluate(RandomizedRunner.java:781)
at com.carrotsearch.randomizedtesting.RandomizedRunner$5.evaluate(RandomizedRunner.java:792)
at com.carrotsearch.randomizedtesting.rules.StatementAdapter.evaluate(StatementAdapter.java:36)
at com.carrotsearch.randomizedtesting.rules.SystemPropertiesRestoreRule$1.evaluate(SystemPropertiesRestoreRule.java:57)
at org.apache.lucene.util.AbstractBeforeAfterRule$1.evaluate(AbstractBeforeAfterRule.java:46)
at com.carrotsearch.randomizedtesting.rules.StatementAdapter.evaluate(StatementAdapter.java:36)
at org.apache.lucene.util.TestRuleStoreClassName$1.evaluate(TestRuleStoreClassName.java:42)
at com.carrotsearch.randomizedtesting.rules.NoShadowingOrOverridesOnMethodsRule$1.evaluate(NoShadowingOrOverridesOnMethodsRule.java:39)
at com.carrotsearch.randomizedtesting.rules.NoShadowingOrOverridesOnMethodsRule$1.evaluate(NoShadowingOrOverridesOnMethodsRule.java:39)
at com.carrotsearch.randomizedtesting.rules.StatementAdapter.evaluate(StatementAdapter.java:36)
at com.carrotsearch.randomizedtesting.rules.StatementAdapter.evaluate(StatementAdapter.java:36)
at com.carrotsearch.randomizedtesting.rules.StatementAdapter.evaluate(StatementAdapter.java:36)
at org.apache.lucene.util.TestRuleAssertionsRequired$1.evaluate(TestRuleAssertionsRequired.java:54)
at org.apache.lucene.util.TestRuleMarkFailure$1.evaluate(TestRuleMarkFailure.java:48)
at org.apache.lucene.util.TestRuleIgnoreAfterMaxFailures$1.evaluate(TestRuleIgnoreAfterMaxFailures.java:65)
at org.apache.lucene.util.TestRuleIgnoreTestSuites$1.evaluate(TestRuleIgnoreTestSuites.java:55)
at com.carrotsearch.randomizedtesting.rules.StatementAdapter.evaluate(StatementAdapter.java:36)
at com.carrotsearch.randomizedtesting.ThreadLeakControl$StatementRunner.run(ThreadLeakControl.java:365)
at java.lang.Thread.run(Thread.java:745)
Build Log:
[...truncated 10778 lines...]
[junit4] Suite: org.apache.solr.cloud.CollectionsAPIDistributedZkTest
[junit4] 2> Creating dataDir: /x1/jenkins/jenkins-slave/workspace/Lucene-Solr-NightlyTests-5.2/solr/build/solr-core/test/J1/temp/solr.cloud.CollectionsAPIDistributedZkTest_436F3A4DF90D4A39-001/init-core-data-001
[junit4] 2> 1019211 T5200 oas.SolrTestCaseJ4.buildSSLConfig Randomized ssl (false) and clientAuth (false)
[junit4] 2> 1019211 T5200 oas.BaseDistributedSearchTestCase.initHostContext Setting hostContext system property: /nobc/pn
[junit4] 2> 1019216 T5200 oasc.ZkTestServer.run STARTING ZK TEST SERVER
[junit4] 2> 1019216 T5201 oasc.ZkTestServer$2$1.setClientPort client port:0.0.0.0/0.0.0.0:0
[junit4] 2> 1019216 T5201 oasc.ZkTestServer$ZKServerMain.runFromConfig Starting server
[junit4] 2> 1019316 T5200 oasc.ZkTestServer.run start zk server on port:43356
[junit4] 2> 1019333 T5200 oasc.AbstractZkTestCase.putConfig put /x1/jenkins/jenkins-slave/workspace/Lucene-Solr-NightlyTests-5.2/solr/core/src/test-files/solr/collection1/conf/solrconfig-tlog.xml to /configs/conf1/solrconfig.xml
[junit4] 2> 1019335 T5200 oasc.AbstractZkTestCase.putConfig put /x1/jenkins/jenkins-slave/workspace/Lucene-Solr-NightlyTests-5.2/solr/core/src/test-files/solr/collection1/conf/schema.xml to /configs/conf1/schema.xml
[junit4] 2> 1019338 T5200 oasc.AbstractZkTestCase.putConfig put /x1/jenkins/jenkins-slave/workspace/Lucene-Solr-NightlyTests-5.2/solr/core/src/test-files/solr/collection1/conf/solrconfig.snippet.randomindexconfig.xml to /configs/conf1/solrconfig.snippet.randomindexconfig.xml
[junit4] 2> 1019339 T5200 oasc.AbstractZkTestCase.putConfig put /x1/jenkins/jenkins-slave/workspace/Lucene-Solr-NightlyTests-5.2/solr/core/src/test-files/solr/collection1/conf/stopwords.txt to /configs/conf1/stopwords.txt
[junit4] 2> 1019341 T5200 oasc.AbstractZkTestCase.putConfig put /x1/jenkins/jenkins-slave/workspace/Lucene-Solr-NightlyTests-5.2/solr/core/src/test-files/solr/collection1/conf/protwords.txt to /configs/conf1/protwords.txt
[junit4] 2> 1019343 T5200 oasc.AbstractZkTestCase.putConfig put /x1/jenkins/jenkins-slave/workspace/Lucene-Solr-NightlyTests-5.2/solr/core/src/test-files/solr/collection1/conf/currency.xml to /configs/conf1/currency.xml
[junit4] 2> 1019350 T5200 oasc.AbstractZkTestCase.putConfig put /x1/jenkins/jenkins-slave/workspace/Lucene-Solr-NightlyTests-5.2/solr/core/src/test-files/solr/collection1/conf/enumsConfig.xml to /configs/conf1/enumsConfig.xml
[junit4] 2> 1019352 T5200 oasc.AbstractZkTestCase.putConfig put /x1/jenkins/jenkins-slave/workspace/Lucene-Solr-NightlyTests-5.2/solr/core/src/test-files/solr/collection1/conf/open-exchange-rates.json to /configs/conf1/open-exchange-rates.json
[junit4] 2> 1019354 T5200 oasc.AbstractZkTestCase.putConfig put /x1/jenkins/jenkins-slave/workspace/Lucene-Solr-NightlyTests-5.2/solr/core/src/test-files/solr/collection1/conf/mapping-ISOLatin1Accent.txt to /configs/conf1/mapping-ISOLatin1Accent.txt
[junit4] 2> 1019355 T5200 oasc.AbstractZkTestCase.putConfig put /x1/jenkins/jenkins-slave/workspace/Lucene-Solr-NightlyTests-5.2/solr/core/src/test-files/solr/collection1/conf/old_synonyms.txt to /configs/conf1/old_synonyms.txt
[junit4] 2> 1019357 T5200 oasc.AbstractZkTestCase.putConfig put /x1/jenkins/jenkins-slave/workspace/Lucene-Solr-NightlyTests-5.2/solr/core/src/test-files/solr/collection1/conf/synonyms.txt to /configs/conf1/synonyms.txt
[junit4] 2> 1019364 T5200 oasc.AbstractZkTestCase.putConfig put /x1/jenkins/jenkins-slave/workspace/Lucene-Solr-NightlyTests-5.2/solr/core/src/test-files/solr/collection1/conf/solrconfig-tlog.xml to /configs/conf2/solrconfig.xml
[junit4] 2> 1019366 T5200 oasc.AbstractZkTestCase.putConfig put /x1/jenkins/jenkins-slave/workspace/Lucene-Solr-NightlyTests-5.2/solr/core/src/test-files/solr/collection1/conf/schema.xml to /configs/conf2/schema.xml
[junit4] 2> 1019368 T5200 oasc.AbstractZkTestCase.putConfig put /x1/jenkins/jenkins-slave/workspace/Lucene-Solr-NightlyTests-5.2/solr/core/src/test-files/solr/collection1/conf/enumsConfig.xml to /configs/conf2/enumsConfig.xml
[junit4] 2> 1019371 T5200 oasc.AbstractZkTestCase.putConfig put /x1/jenkins/jenkins-slave/workspace/Lucene-Solr-NightlyTests-5.2/solr/core/src/test-files/solr/collection1/conf/solrconfig.snippet.randomindexconfig.xml to /configs/conf2/solrconfig.snippet.randomindexconfig.xml
[junit4] 2> 1019372 T5200 oasc.AbstractZkTestCase.putConfig put /x1/jenkins/jenkins-slave/workspace/Lucene-Solr-NightlyTests-5.2/solr/core/src/test-files/solr/collection1/conf/stopwords.txt to /configs/conf2/stopwords.txt
[junit4] 2> 1019374 T5200 oasc.AbstractZkTestCase.putConfig put /x1/jenkins/jenkins-slave/workspace/Lucene-Solr-NightlyTests-5.2/solr/core/src/test-files/solr/collection1/conf/protwords.txt to /configs/conf2/protwords.txt
[junit4] 2> 1019376 T5200 oasc.AbstractZkTestCase.putConfig put /x1/jenkins/jenkins-slave/workspace/Lucene-Solr-NightlyTests-5.2/solr/core/src/test-files/solr/collection1/conf/currency.xml to /configs/conf2/currency.xml
[junit4] 2> 1019377 T5200 oasc.AbstractZkTestCase.putConfig put /x1/jenkins/jenkins-slave/workspace/Lucene-Solr-NightlyTests-5.2/solr/core/src/test-files/solr/collection1/conf/open-exchange-rates.json to /configs/conf2/open-exchange-rates.json
[junit4] 2> 1019379 T5200 oasc.AbstractZkTestCase.putConfig put /x1/jenkins/jenkins-slave/workspace/Lucene-Solr-NightlyTests-5.2/solr/core/src/test-files/solr/collection1/conf/mapping-ISOLatin1Accent.txt to /configs/conf2/mapping-ISOLatin1Accent.txt
[junit4] 2> 1019380 T5200 oasc.AbstractZkTestCase.putConfig put /x1/jenkins/jenkins-slave/workspace/Lucene-Solr-NightlyTests-5.2/solr/core/src/test-files/solr/collection1/conf/old_synonyms.txt to /configs/conf2/old_synonyms.txt
[junit4] 2> 1019382 T5200 oasc.AbstractZkTestCase.putConfig put /x1/jenkins/jenkins-slave/workspace/Lucene-Solr-NightlyTests-5.2/solr/core/src/test-files/solr/collection1/conf/synonyms.txt to /configs/conf2/synonyms.txt
[junit4] 2> 1019384 T5200 oasc.AbstractZkTestCase.putConfig put /x1/jenkins/jenkins-slave/workspace/Lucene-Solr-NightlyTests-5.2/solr/core/src/test-files/solr/collection1/conf/elevate.xml to /configs/conf2/elevate.xml
[junit4] 2> 1019654 T5200 oas.SolrTestCaseJ4.writeCoreProperties Writing core.properties file to /x1/jenkins/jenkins-slave/workspace/Lucene-Solr-NightlyTests-5.2/solr/build/solr-core/test/J1/temp/solr.cloud.CollectionsAPIDistributedZkTest_436F3A4DF90D4A39-001/control-001/cores/collection1
[junit4] 2> 1019656 T5200 oejs.Server.doStart jetty-9.2.10.v20150310
[junit4] 2> 1019658 T5200 oejsh.ContextHandler.doStart Started o.e.j.s.ServletContextHandler@4ba8f27c{/nobc/pn,null,AVAILABLE}
[junit4] 2> 1019658 T5200 oejs.AbstractConnector.doStart Started ServerConnector@7e981e57{HTTP/1.1}{127.0.0.1:34468}
[junit4] 2> 1019659 T5200 oejs.Server.doStart Started @1021266ms
[junit4] 2> 1019659 T5200 oascse.JettySolrRunner$1.lifeCycleStarted Jetty properties: {hostPort=34468, coreRootDirectory=/x1/jenkins/jenkins-slave/workspace/Lucene-Solr-NightlyTests-5.2/solr/build/solr-core/test/J1/../../../../../../../../../../x1/jenkins/jenkins-slave/workspace/Lucene-Solr-NightlyTests-5.2/solr/build/solr-core/test/J1/temp/solr.cloud.CollectionsAPIDistributedZkTest_436F3A4DF90D4A39-001/control-001/cores, hostContext=/nobc/pn}
[junit4] 2> 1019659 T5200 oass.SolrDispatchFilter.init SolrDispatchFilter.init()sun.misc.Launcher$AppClassLoader@72b5615d
[junit4] 2> 1019659 T5200 oasc.SolrResourceLoader.<init> new SolrResourceLoader for directory: '/x1/jenkins/jenkins-slave/workspace/Lucene-Solr-NightlyTests-5.2/solr/build/solr-core/test/J1/../../../../../../../../../../x1/jenkins/jenkins-slave/workspace/Lucene-Solr-NightlyTests-5.2/solr/build/solr-core/test/J1/temp/solr.cloud.CollectionsAPIDistributedZkTest_436F3A4DF90D4A39-001/control-001/'
[junit4] 2> 1019673 T5200 oasc.SolrXmlConfig.fromFile Loading container configuration from /x1/jenkins/jenkins-slave/workspace/Lucene-Solr-NightlyTests-5.2/solr/build/solr-core/test/J1/../../../../../../../../../../x1/jenkins/jenkins-slave/workspace/Lucene-Solr-NightlyTests-5.2/solr/build/solr-core/test/J1/temp/solr.cloud.CollectionsAPIDistributedZkTest_436F3A4DF90D4A39-001/control-001/solr.xml
[junit4] 2> 1019686 T5200 oasc.CorePropertiesLocator.<init> Config-defined core root directory: /x1/jenkins/jenkins-slave/workspace/Lucene-Solr-NightlyTests-5.2/solr/build/solr-core/test/J1/../../../../../../../../../../x1/jenkins/jenkins-slave/workspace/Lucene-Solr-NightlyTests-5.2/solr/build/solr-core/test/J1/temp/solr.cloud.CollectionsAPIDistributedZkTest_436F3A4DF90D4A39-001/control-001/cores
[junit4] 2> 1019686 T5200 oasc.CoreContainer.<init> New CoreContainer 443947465
[junit4] 2> 1019686 T5200 oasc.CoreContainer.load Loading cores into CoreContainer [instanceDir=/x1/jenkins/jenkins-slave/workspace/Lucene-Solr-NightlyTests-5.2/solr/build/solr-core/test/J1/../../../../../../../../../../x1/jenkins/jenkins-slave/workspace/Lucene-Solr-NightlyTests-5.2/solr/build/solr-core/test/J1/temp/solr.cloud.CollectionsAPIDistributedZkTest_436F3A4DF90D4A39-001/control-001/]
[junit4] 2> 1019686 T5200 oasc.CoreContainer.load loading shared library: /x1/jenkins/jenkins-slave/workspace/Lucene-Solr-NightlyTests-5.2/solr/build/solr-core/test/J1/../../../../../../../../../../x1/jenkins/jenkins-slave/workspace/Lucene-Solr-NightlyTests-5.2/solr/build/solr-core/test/J1/temp/solr.cloud.CollectionsAPIDistributedZkTest_436F3A4DF90D4A39-001/control-001/lib
[junit4] 2> 1019687 T5200 oasc.SolrResourceLoader.addToClassLoader WARN Can't find (or read) directory to add to classloader: lib (resolved as: /x1/jenkins/jenkins-slave/workspace/Lucene-Solr-NightlyTests-5.2/solr/build/solr-core/test/J1/../../../../../../../../../../x1/jenkins/jenkins-slave/workspace/Lucene-Solr-NightlyTests-5.2/solr/build/solr-core/test/J1/temp/solr.cloud.CollectionsAPIDistributedZkTest_436F3A4DF90D4A39-001/control-001/lib).
[junit4] 2> 1019694 T5200 oashc.HttpShardHandlerFactory.init created with socketTimeout : 90000,urlScheme : ,connTimeout : 15000,maxConnectionsPerHost : 20,maxConnections : 10000,corePoolSize : 0,maximumPoolSize : 2147483647,maxThreadIdleTime : 5,sizeOfQueue : -1,fairnessPolicy : false,useRetries : false,
[junit4] 2> 1019695 T5200 oasu.UpdateShardHandler.<init> Creating UpdateShardHandler HTTP client with params: socketTimeout=340000&connTimeout=45000&retry=true
[junit4] 2> 1019695 T5200 oasl.LogWatcher.createWatcher SLF4J impl is org.slf4j.impl.Log4jLoggerFactory
[junit4] 2> 1019696 T5200 oasl.LogWatcher.newRegisteredLogWatcher Registering Log Listener [Log4j (org.slf4j.impl.Log4jLoggerFactory)]
[junit4] 2> 1019696 T5200 oasc.CoreContainer.load Node Name: 127.0.0.1
[junit4] 2> 1019696 T5200 oasc.ZkContainer.initZooKeeper Zookeeper client=127.0.0.1:43356/solr
[junit4] 2> 1019696 T5200 oasc.ZkController.checkChrootPath zkHost includes chroot
[junit4] 2> 1019713 T5200 n:127.0.0.1:34468_nobc%2Fpn oasc.ZkController.createEphemeralLiveNode Register node as live in ZooKeeper:/live_nodes/127.0.0.1:34468_nobc%2Fpn
[junit4] 2> 1019716 T5200 n:127.0.0.1:34468_nobc%2Fpn oasc.Overseer.close Overseer (id=null) closing
[junit4] 2> 1019717 T5200 n:127.0.0.1:34468_nobc%2Fpn oasc.OverseerElectionContext.runLeaderProcess I am going to be the leader 127.0.0.1:34468_nobc%2Fpn
[junit4] 2> 1019719 T5200 n:127.0.0.1:34468_nobc%2Fpn oasc.Overseer.start Overseer (id=93977739270291461-127.0.0.1:34468_nobc%2Fpn-n_0000000000) starting
[junit4] 2> 1019725 T5200 n:127.0.0.1:34468_nobc%2Fpn oasc.OverseerAutoReplicaFailoverThread.<init> Starting OverseerAutoReplicaFailoverThread autoReplicaFailoverWorkLoopDelay=10000 autoReplicaFailoverWaitAfterExpiration=10000 autoReplicaFailoverBadNodeExpiration=60000
[junit4] 2> 1019726 T5236 n:127.0.0.1:34468_nobc%2Fpn oasc.OverseerCollectionProcessor.run Process current queue of collection creations
[junit4] 2> 1019732 T5235 n:127.0.0.1:34468_nobc%2Fpn oasc.Overseer$ClusterStateUpdater.run Starting to work on the main queue
[junit4] 2> 1019734 T5200 n:127.0.0.1:34468_nobc%2Fpn oasc.CoreContainer.initializeAuthenticationPlugin No authentication plugin used.
[junit4] 2> 1019735 T5200 n:127.0.0.1:34468_nobc%2Fpn oasc.CoreContainer.intializeAuthorizationPlugin Security conf doesn't exist. Skipping setup for authorization module.
[junit4] 2> 1019736 T5200 n:127.0.0.1:34468_nobc%2Fpn oasc.CorePropertiesLocator.discover Looking for core definitions underneath /x1/jenkins/jenkins-slave/workspace/Lucene-Solr-NightlyTests-5.2/solr/build/solr-core/test/J1/../../../../../../../../../../x1/jenkins/jenkins-slave/workspace/Lucene-Solr-NightlyTests-5.2/solr/build/solr-core/test/J1/temp/solr.cloud.CollectionsAPIDistributedZkTest_436F3A4DF90D4A39-001/control-001/cores
[junit4] 2> 1019737 T5200 n:127.0.0.1:34468_nobc%2Fpn oasc.CoreDescriptor.<init> CORE DESCRIPTOR: {config=solrconfig.xml, dataDir=data/, shard=, instanceDir=/x1/jenkins/jenkins-slave/workspace/Lucene-Solr-NightlyTests-5.2/solr/build/solr-core/test/J1/../../../../../../../../../../x1/jenkins/jenkins-slave/workspace/Lucene-Solr-NightlyTests-5.2/solr/build/solr-core/test/J1/temp/solr.cloud.CollectionsAPIDistributedZkTest_436F3A4DF90D4A39-001/control-001/cores/collection1, name=collection1, loadOnStartup=true, transient=false, absoluteInstDir=/x1/jenkins/jenkins-slave/workspace/Lucene-Solr-NightlyTests-5.2/solr/build/solr-core/test/J1/../../../../../../../../../../x1/jenkins/jenkins-slave/workspace/Lucene-Solr-NightlyTests-5.2/solr/build/solr-core/test/J1/temp/solr.cloud.CollectionsAPIDistributedZkTest_436F3A4DF90D4A39-001/control-001/cores/collection1/, coreNodeName=, schema=schema.xml, collection=control_collection}
[junit4] 2> 1019737 T5200 n:127.0.0.1:34468_nobc%2Fpn oasc.CorePropertiesLocator.discoverUnder Found core collection1 in /x1/jenkins/jenkins-slave/workspace/Lucene-Solr-NightlyTests-5.2/solr/build/solr-core/test/J1/../../../../../../../../../../x1/jenkins/jenkins-slave/workspace/Lucene-Solr-NightlyTests-5.2/solr/build/solr-core/test/J1/temp/solr.cloud.CollectionsAPIDistributedZkTest_436F3A4DF90D4A39-001/control-001/cores/collection1/
[junit4] 2> 1019737 T5200 n:127.0.0.1:34468_nobc%2Fpn oasc.CorePropertiesLocator.discover Found 1 core definitions
[junit4] 2> 1019738 T5238 n:127.0.0.1:34468_nobc%2Fpn c:control_collection x:collection1 oasc.ZkController.publish publishing core=collection1 state=down collection=control_collection
[junit4] 2> 1019738 T5238 n:127.0.0.1:34468_nobc%2Fpn c:control_collection x:collection1 oasc.ZkController.publish numShards not found on descriptor - reading it from system property
[junit4] 2> 1019739 T5238 n:127.0.0.1:34468_nobc%2Fpn oasc.ZkController.waitForCoreNodeName look for our core node name
[junit4] 2> 1019739 T5234 n:127.0.0.1:34468_nobc%2Fpn oasc.DistributedQueue$LatchWatcher.process NodeChildrenChanged fired on path /overseer/queue state SyncConnected
[junit4] 2> 1019740 T5235 n:127.0.0.1:34468_nobc%2Fpn oasc.Overseer$ClusterStateUpdater.run processMessage: queueSize: 1, message = {
[junit4] 2> "operation":"state",
[junit4] 2> "node_name":"127.0.0.1:34468_nobc%2Fpn",
[junit4] 2> "roles":null,
[junit4] 2> "core":"collection1",
[junit4] 2> "shard":null,
[junit4] 2> "state":"down",
[junit4] 2> "numShards":"1",
[junit4] 2> "collection":"control_collection",
[junit4] 2> "base_url":"http://127.0.0.1:34468/nobc/pn"} current state version: 0
[junit4] 2> 1019740 T5235 n:127.0.0.1:34468_nobc%2Fpn oasco.ReplicaMutator.updateState Update state numShards=1 message={
[junit4] 2> "operation":"state",
[junit4] 2> "node_name":"127.0.0.1:34468_nobc%2Fpn",
[junit4] 2> "roles":null,
[junit4] 2> "core":"collection1",
[junit4] 2> "shard":null,
[junit4] 2> "state":"down",
[junit4] 2> "numShards":"1",
[junit4] 2> "collection":"control_collection",
[junit4] 2> "base_url":"http://127.0.0.1:34468/nobc/pn"}
[junit4] 2> 1019741 T5235 n:127.0.0.1:34468_nobc%2Fpn oasco.ClusterStateMutator.createCollection building a new cName: control_collection
[junit4] 2> 1019741 T5235 n:127.0.0.1:34468_nobc%2Fpn oasco.ReplicaMutator.updateState Assigning new node to shard shard=shard1
[junit4] 2> 1020739 T5238 n:127.0.0.1:34468_nobc%2Fpn oasc.ZkController.waitForShardId waiting to find shard id in clusterstate for collection1
[junit4] 2> 1020740 T5238 n:127.0.0.1:34468_nobc%2Fpn oasc.ZkController.createCollectionZkNode Check for collection zkNode:control_collection
[junit4] 2> 1020740 T5238 n:127.0.0.1:34468_nobc%2Fpn oasc.ZkController.createCollectionZkNode Collection zkNode exists
[junit4] 2> 1020741 T5238 n:127.0.0.1:34468_nobc%2Fpn oasc.SolrResourceLoader.<init> new SolrResourceLoader for directory: '/x1/jenkins/jenkins-slave/workspace/Lucene-Solr-NightlyTests-5.2/solr/build/solr-core/test/J1/../../../../../../../../../../x1/jenkins/jenkins-slave/workspace/Lucene-Solr-NightlyTests-5.2/solr/build/solr-core/test/J1/temp/solr.cloud.CollectionsAPIDistributedZkTest_436F3A4DF90D4A39-001/control-001/cores/collection1/'
[junit4] 2> 1020755 T5238 n:127.0.0.1:34468_nobc%2Fpn oasc.Config.<init> loaded config solrconfig.xml with version 0
[junit4] 2> 1020761 T5238 n:127.0.0.1:34468_nobc%2Fpn oasc.SolrConfig.refreshRequestParams current version of requestparams : -1
[junit4] 2> 1020773 T5238 n:127.0.0.1:34468_nobc%2Fpn oasc.SolrConfig.<init> Using Lucene MatchVersion: 5.2.1
[junit4] 2> 1020799 T5238 n:127.0.0.1:34468_nobc%2Fpn oasc.SolrConfig.<init> Loaded SolrConfig: solrconfig.xml
[junit4] 2> 1020800 T5238 n:127.0.0.1:34468_nobc%2Fpn oass.IndexSchema.readSchema Reading Solr Schema from /configs/conf1/schema.xml
[junit4] 2> 1020806 T5238 n:127.0.0.1:34468_nobc%2Fpn oass.IndexSchema.readSchema [collection1] Schema name=test
[junit4] 2> 1021031 T5238 n:127.0.0.1:34468_nobc%2Fpn oass.OpenExchangeRatesOrgProvider.init Initialized with rates=open-exchange-rates.json, refreshInterval=1440.
[junit4] 2> 1021038 T5238 n:127.0.0.1:34468_nobc%2Fpn oass.IndexSchema.readSchema default search field in schema is text
[junit4] 2> 1021040 T5238 n:127.0.0.1:34468_nobc%2Fpn oass.IndexSchema.readSchema unique key field: id
[junit4] 2> 1021048 T5238 n:127.0.0.1:34468_nobc%2Fpn oass.FileExchangeRateProvider.reload Reloading exchange rates from file currency.xml
[junit4] 2> 1021051 T5238 n:127.0.0.1:34468_nobc%2Fpn oass.FileExchangeRateProvider.reload Reloading exchange rates from file currency.xml
[junit4] 2> 1021053 T5238 n:127.0.0.1:34468_nobc%2Fpn oass.OpenExchangeRatesOrgProvider.reload Reloading exchange rates from open-exchange-rates.json
[junit4] 2> 1021054 T5238 n:127.0.0.1:34468_nobc%2Fpn oass.OpenExchangeRatesOrgProvider$OpenExchangeRates.<init> WARN Unknown key IMPORTANT NOTE
[junit4] 2> 1021054 T5238 n:127.0.0.1:34468_nobc%2Fpn oass.OpenExchangeRatesOrgProvider$OpenExchangeRates.<init> WARN Expected key, got STRING
[junit4] 2> 1021054 T5238 n:127.0.0.1:34468_nobc%2Fpn oass.OpenExchangeRatesOrgProvider.reload Reloading exchange rates from open-exchange-rates.json
[junit4] 2> 1021055 T5238 n:127.0.0.1:34468_nobc%2Fpn oass.OpenExchangeRatesOrgProvider$OpenExchangeRates.<init> WARN Unknown key IMPORTANT NOTE
[junit4] 2> 1021055 T5238 n:127.0.0.1:34468_nobc%2Fpn oass.OpenExchangeRatesOrgProvider$OpenExchangeRates.<init> WARN Expected key, got STRING
[junit4] 2> 1021055 T5238 n:127.0.0.1:34468_nobc%2Fpn oasc.CoreContainer.create Creating SolrCore 'collection1' using configuration from collection control_collection
[junit4] 2> 1021055 T5238 n:127.0.0.1:34468_nobc%2Fpn x:collection1 oasc.SolrCore.initDirectoryFactory org.apache.solr.core.MockDirectoryFactory
[junit4] 2> 1021056 T5238 n:127.0.0.1:34468_nobc%2Fpn x:collection1 oasc.SolrCore.<init> [[collection1] ] Opening new SolrCore at [/x1/jenkins/jenkins-slave/workspace/Lucene-Solr-NightlyTests-5.2/solr/build/solr-core/test/J1/../../../../../../../../../../x1/jenkins/jenkins-slave/workspace/Lucene-Solr-NightlyTests-5.2/solr/build/solr-core/test/J1/temp/solr.cloud.CollectionsAPIDistributedZkTest_436F3A4DF90D4A39-001/control-001/cores/collection1/], dataDir=[null]
[junit4] 2> 1021056 T5238 n:127.0.0.1:34468_nobc%2Fpn x:collection1 oasc.JmxMonitoredMap.<init> JMX monitoring is enabled. Adding Solr mbeans to JMX Server: com.sun.jmx.mbeanserver.JmxMBeanServer@fe2cdb4
[junit4] 2> 1021056 T5238 n:127.0.0.1:34468_nobc%2Fpn x:collection1 oasc.CachingDirectoryFactory.get return new directory for /x1/jenkins/jenkins-slave/workspace/Lucene-Solr-NightlyTests-5.2/solr/build/solr-core/test/J1/../../../../../../../../../../x1/jenkins/jenkins-slave/workspace/Lucene-Solr-NightlyTests-5.2/solr/build/solr-core/test/J1/temp/solr.cloud.CollectionsAPIDistributedZkTest_436F3A4DF90D4A39-001/control-001/cores/collection1/data
[junit4] 2> 1021057 T5238 n:127.0.0.1:34468_nobc%2Fpn x:collection1 oasc.SolrCore.getNewIndexDir New index directory detected: old=null new=/x1/jenkins/jenkins-slave/workspace/Lucene-Solr-NightlyTests-5.2/solr/build/solr-core/test/J1/../../../../../../../../../../x1/jenkins/jenkins-slave/workspace/Lucene-Solr-NightlyTests-5.2/solr/build/solr-core/test/J1/temp/solr.cloud.CollectionsAPIDistributedZkTest_436F3A4DF90D4A39-001/control-001/cores/collection1/data/index/
[junit4] 2> 1021057 T5238 n:127.0.0.1:34468_nobc%2Fpn x:collection1 oasc.SolrCore.initIndex WARN [collection1] Solr index directory '/x1/jenkins/jenkins-slave/workspace/Lucene-Solr-NightlyTests-5.2/solr/build/solr-core/test/J1/../../../../../../../../../../x1/jenkins/jenkins-slave/workspace/Lucene-Solr-NightlyTests-5.2/solr/build/solr-core/test/J1/temp/solr.cloud.CollectionsAPIDistributedZkTest_436F3A4DF90D4A39-001/control-001/cores/collection1/data/index' doesn't exist. Creating new index...
[junit4] 2> 1021058 T5238 n:127.0.0.1:34468_nobc%2Fpn x:collection1 oasc.CachingDirectoryFactory.get return new directory for /x1/jenkins/jenkins-slave/workspace/Lucene-Solr-NightlyTests-5.2/solr/build/solr-core/test/J1/../../../../../../../../../../x1/jenkins/jenkins-slave/workspace/Lucene-Solr-NightlyTests-5.2/solr/build/solr-core/test/J1/temp/solr.cloud.CollectionsAPIDistributedZkTest_436F3A4DF90D4A39-001/control-001/cores/collection1/data/index
[junit4] 2> 1021058 T5238 n:127.0.0.1:34468_nobc%2Fpn x:collection1 oasu.RandomMergePolicy.<init> RandomMergePolicy wrapping class org.apache.lucene.index.LogByteSizeMergePolicy: [LogByteSizeMergePolicy: minMergeSize=1677721, mergeFactor=18, maxMergeSize=2147483648, maxMergeSizeForForcedMerge=9223372036854775807, calibrateSizeByDeletes=true, maxMergeDocs=2147483647, maxCFSSegmentSizeMB=8.796093022207999E12, noCFSRatio=1.0]
[junit4] 2> 1021061 T5238 n:127.0.0.1:34468_nobc%2Fpn x:collection1 oasc.SolrDeletionPolicy.onCommit SolrDeletionPolicy.onCommit: commits: num=1
[junit4] 2> commit{dir=MockDirectoryWrapper(SimpleFSDirectory@/x1/jenkins/jenkins-slave/workspace/Lucene-Solr-NightlyTests-5.2/solr/build/solr-core/test/J1/temp/solr.cloud.CollectionsAPIDistributedZkTest_436F3A4DF90D4A39-001/index-SimpleFSDirectory-001 lockFactory=org.apache.lucene.store.NativeFSLockFactory@302b3e2e),segFN=segments_1,generation=1}
[junit4] 2> 1021061 T5238 n:127.0.0.1:34468_nobc%2Fpn x:collection1 oasc.SolrDeletionPolicy.updateCommits newest commit generation = 1
[junit4] 2> 1021065 T5238 n:127.0.0.1:34468_nobc%2Fpn x:collection1 oasup.UpdateRequestProcessorChain.init creating updateRequestProcessorChain "nodistrib"
[junit4] 2> 1021065 T5238 n:127.0.0.1:34468_nobc%2Fpn x:collection1 oasup.UpdateRequestProcessorChain.init creating updateRequestProcessorChain "dedupe"
[junit4] 2> 1021066 T5238 n:127.0.0.1:34468_nobc%2Fpn x:collection1 oasup.UpdateRequestProcessorChain.init inserting DistributedUpdateProcessorFactory into updateRequestProcessorChain "dedupe"
[junit4] 2> 1021066 T5238 n:127.0.0.1:34468_nobc%2Fpn x:collection1 oasup.UpdateRequestProcessorChain.init creating updateRequestProcessorChain "stored_sig"
[junit4] 2> 1021066 T5238 n:127.0.0.1:34468_nobc%2Fpn x:collection1 oasup.UpdateRequestProcessorChain.init inserting DistributedUpdateProcessorFactory into updateRequestProcessorChain "stored_sig"
[junit4] 2> 1021066 T5238 n:127.0.0.1:34468_nobc%2Fpn x:collection1 oasup.UpdateRequestProcessorChain.init creating updateRequestProcessorChain "distrib-dup-test-chain-explicit"
[junit4] 2> 1021066 T5238 n:127.0.0.1:34468_nobc%2Fpn x:collection1 oasup.UpdateRequestProcessorChain.init creating updateRequestProcessorChain "distrib-dup-test-chain-implicit"
[junit4] 2> 1021067 T5238 n:127.0.0.1:34468_nobc%2Fpn x:collection1 oasup.UpdateRequestProcessorChain.init inserting DistributedUpdateProcessorFactory into updateRequestProcessorChain "distrib-dup-test-chain-implicit"
[junit4] 2> 1021067 T5238 n:127.0.0.1:34468_nobc%2Fpn x:collection1 oasc.SolrCore.loadUpdateProcessorChains no updateRequestProcessorChain defined as default, creating implicit default
[junit4] 2> 1021069 T5238 n:127.0.0.1:34468_nobc%2Fpn x:collection1 oashl.XMLLoader.init xsltCacheLifetimeSeconds=60
[junit4] 2> 1021071 T5238 n:127.0.0.1:34468_nobc%2Fpn x:collection1 oashl.XMLLoader.init xsltCacheLifetimeSeconds=60
[junit4] 2> 1021072 T5238 n:127.0.0.1:34468_nobc%2Fpn x:collection1 oashl.XMLLoader.init xsltCacheLifetimeSeconds=60
[junit4] 2> 1021073 T5238 n:127.0.0.1:34468_nobc%2Fpn x:collection1 oashl.XMLLoader.init xsltCacheLifetimeSeconds=60
[junit4] 2> 1021077 T5238 n:127.0.0.1:34468_nobc%2Fpn x:collection1 oasc.RequestHandlers.initHandlersFromConfig Registered paths: /admin/luke,/schema,/admin/ping,/admin/plugins,/update/json,/admin/properties,/update,/replication,/admin/file,/config,/update/csv,/admin/mbeans,/admin/segments,standard,/admin/logging,/update/json/docs,/admin/system,/get,/admin/threads
[junit4] 2> 1021078 T5238 n:127.0.0.1:34468_nobc%2Fpn x:collection1 oasc.SolrCore.initStatsCache Using default statsCache cache: org.apache.solr.search.stats.LocalStatsCache
[junit4] 2> 1021078 T5238 n:127.0.0.1:34468_nobc%2Fpn x:collection1 oasu.UpdateHandler.<init> Using UpdateLog implementation: org.apache.solr.update.UpdateLog
[junit4] 2> 1021079 T5238 n:127.0.0.1:34468_nobc%2Fpn x:collection1 oasu.UpdateLog.init Initializing UpdateLog: dataDir= defaultSyncLevel=FLUSH numRecordsToKeep=100 maxNumLogsToKeep=10 numVersionBuckets=65536
[junit4] 2> 1021079 T5238 n:127.0.0.1:34468_nobc%2Fpn x:collection1 oasu.CommitTracker.<init> Hard AutoCommit: disabled
[junit4] 2> 1021080 T5238 n:127.0.0.1:34468_nobc%2Fpn x:collection1 oasu.CommitTracker.<init> Soft AutoCommit: disabled
[junit4] 2> 1021080 T5238 n:127.0.0.1:34468_nobc%2Fpn x:collection1 oasu.RandomMergePolicy.<init> RandomMergePolicy wrapping class org.apache.lucene.index.TieredMergePolicy: [TieredMergePolicy: maxMergeAtOnce=39, maxMergeAtOnceExplicit=46, maxMergedSegmentMB=85.091796875, floorSegmentMB=0.9384765625, forceMergeDeletesPctAllowed=23.308774821982688, segmentsPerTier=13.0, maxCFSSegmentSizeMB=8.796093022207999E12, noCFSRatio=0.8488163824093705
[junit4] 2> 1021081 T5238 n:127.0.0.1:34468_nobc%2Fpn x:collection1 oasc.SolrDeletionPolicy.onInit SolrDeletionPolicy.onInit: commits: num=1
[junit4] 2> commit{dir=MockDirectoryWrapper(SimpleFSDirectory@/x1/jenkins/jenkins-slave/workspace/Lucene-Solr-NightlyTests-5.2/solr/build/solr-core/test/J1/temp/solr.cloud.CollectionsAPIDistributedZkTest_436F3A4DF90D4A39-001/index-SimpleFSDirectory-001 lockFactory=org.apache.lucene.store.NativeFSLockFactory@302b3e2e),segFN=segments_1,generation=1}
[junit4] 2> 1021081 T5238 n:127.0.0.1:34468_nobc%2Fpn x:collection1 oasc.SolrDeletionPolicy.updateCommits newest commit generation = 1
[junit4] 2> 1021082 T5238 n:127.0.0.1:34468_nobc%2Fpn x:collection1 oass.SolrIndexSearcher.<init> Opening Searcher@6c007057[collection1] main
[junit4] 2> 1021083 T5238 n:127.0.0.1:34468_nobc%2Fpn x:collection1 oasr.ManagedResourceStorage.newStorageIO Setting up ZooKeeper-based storage for the RestManager with znodeBase: /configs/conf1
[junit4] 2> 1021083 T5238 n:127.0.0.1:34468_nobc%2Fpn x:collection1 oasr.ManagedResourceStorage$ZooKeeperStorageIO.configure Configured ZooKeeperStorageIO with znodeBase: /configs/conf1
[junit4] 2> 1021083 T5238 n:127.0.0.1:34468_nobc%2Fpn x:collection1 oasr.RestManager.init Initializing RestManager with initArgs: {}
[junit4] 2> 1021083 T5238 n:127.0.0.1:34468_nobc%2Fpn x:collection1 oasr.ManagedResourceStorage.load Reading _rest_managed.json using ZooKeeperStorageIO:path=/configs/conf1
[junit4] 2> 1021084 T5238 n:127.0.0.1:34468_nobc%2Fpn x:collection1 oasr.ManagedResourceStorage$ZooKeeperStorageIO.openInputStream No data found for znode /configs/conf1/_rest_managed.json
[junit4] 2> 1021084 T5238 n:127.0.0.1:34468_nobc%2Fpn x:collection1 oasr.ManagedResourceStorage.load Loaded null at path _rest_managed.json using ZooKeeperStorageIO:path=/configs/conf1
[junit4] 2> 1021084 T5238 n:127.0.0.1:34468_nobc%2Fpn x:collection1 oasr.RestManager.init Initializing 0 registered ManagedResources
[junit4] 2> 1021084 T5238 n:127.0.0.1:34468_nobc%2Fpn x:collection1 oash.ReplicationHandler.inform Commits will be reserved for 10000
[junit4] 2> 1021085 T5239 n:127.0.0.1:34468_nobc%2Fpn x:collection1 oasc.SolrCore.registerSearcher [collection1] Registered new searcher Searcher@6c007057[collection1] main{ExitableDirectoryReader(UninvertingDirectoryReader())}
[junit4] 2> 1021085 T5238 n:127.0.0.1:34468_nobc%2Fpn x:collection1 oasu.UpdateLog.seedBucketsWithHighestVersion Looking up max value of version field to seed version buckets
[junit4] 2> 1021085 T5238 n:127.0.0.1:34468_nobc%2Fpn x:collection1 oasu.VersionInfo.getMaxVersionFromIndex Refreshing highest value of _version_ for 65536 version buckets from index
[junit4] 2> 1021085 T5238 n:127.0.0.1:34468_nobc%2Fpn x:collection1 oasu.VersionInfo.getMaxVersionFromIndex No terms found for _version_, cannot seed version bucket highest value from index
[junit4] 2> 1021085 T5238 n:127.0.0.1:34468_nobc%2Fpn x:collection1 oasu.UpdateLog.seedBucketsWithHighestVersion Could not find max version in index or recent updates, using new clock 1503643830275014656
[junit4] 2> 1021087 T5238 n:127.0.0.1:34468_nobc%2Fpn x:collection1 oasu.UpdateLog.seedBucketsWithHighestVersion Took 2 ms to seed version buckets with highest version 1503643830275014656
[junit4] 2> 1021088 T5238 n:127.0.0.1:34468_nobc%2Fpn x:collection1 oasc.ZkController.getConfDirListeners watch zkdir /configs/conf1
[junit4] 2> 1021088 T5238 n:127.0.0.1:34468_nobc%2Fpn x:collection1 oasc.CoreContainer.registerCore registering core: collection1
[junit4] 2> 1021090 T5242 n:127.0.0.1:34468_nobc%2Fpn c:control_collection s:shard1 x:collection1 oasc.ZkController.register Register replica - core:collection1 address:http://127.0.0.1:34468/nobc/pn collection:control_collection shard:shard1
[junit4] 2> 1021090 T5200 n:127.0.0.1:34468_nobc%2Fpn oass.SolrDispatchFilter.init user.dir=/x1/jenkins/jenkins-slave/workspace/Lucene-Solr-NightlyTests-5.2/solr/build/solr-core/test/J1
[junit4] 2> 1021090 T5200 n:127.0.0.1:34468_nobc%2Fpn oass.SolrDispatchFilter.init SolrDispatchFilter.init() done
[junit4] 2> 1021096 T5200 oasc.ChaosMonkey.monkeyLog monkey: init - expire sessions:false cause connection loss:false
[junit4] 2> 1021097 T5242 n:127.0.0.1:34468_nobc%2Fpn c:control_collection s:shard1 x:collection1 oasc.ShardLeaderElectionContext.runLeaderProcess Running the leader process for shard shard1
[junit4] 2> 1021098 T5234 n:127.0.0.1:34468_nobc%2Fpn oasc.DistributedQueue$LatchWatcher.process NodeChildrenChanged fired on path /overseer/queue state SyncConnected
[junit4] 2> 1021099 T5242 n:127.0.0.1:34468_nobc%2Fpn c:control_collection s:shard1 x:collection1 oasc.ShardLeaderElectionContext.waitForReplicasToComeUp Enough replicas found to continue.
[junit4] 2> 1021099 T5242 n:127.0.0.1:34468_nobc%2Fpn c:control_collection s:shard1 x:collection1 oasc.ShardLeaderElectionContext.runLeaderProcess I may be the new leader - try and sync
[junit4] 2> 1021099 T5235 n:127.0.0.1:34468_nobc%2Fpn oasc.Overseer$ClusterStateUpdater.run processMessage: queueSize: 1, message = {
[junit4] 2> "operation":"leader",
[junit4] 2> "shard":"shard1",
[junit4] 2> "collection":"control_collection"} current state version: 1
[junit4] 2> ASYNC NEW_CORE C996 name=collection1 org.apache.solr.core.SolrCore@1ec2b59b url=http://127.0.0.1:34468/nobc/pn/collection1 node=127.0.0.1:34468_nobc%2Fpn C996_STATE=coll:control_collection core:collection1 props:{node_name=127.0.0.1:34468_nobc%2Fpn, core=collection1, state=down, base_url=http://127.0.0.1:34468/nobc/pn}
[junit4] 2> 1021099 T5242 n:127.0.0.1:34468_nobc%2Fpn c:control_collection s:shard1 x:collection1 C996 oasc.SyncStrategy.sync Sync replicas to http://127.0.0.1:34468/nobc/pn/collection1/
[junit4] 2> 1021100 T5242 n:127.0.0.1:34468_nobc%2Fpn c:control_collection s:shard1 x:collection1 C996 oasc.SyncStrategy.syncReplicas Sync Success - now sync replicas to me
[junit4] 2> 1021100 T5242 n:127.0.0.1:34468_nobc%2Fpn c:control_collection s:shard1 x:collection1 C996 oasc.SyncStrategy.syncToMe http://127.0.0.1:34468/nobc/pn/collection1/ has no replicas
[junit4] 2> 1021100 T5242 n:127.0.0.1:34468_nobc%2Fpn c:control_collection s:shard1 x:collection1 oasc.ShardLeaderElectionContext.runLeaderProcess I am the new leader: http://127.0.0.1:34468/nobc/pn/collection1/ shard1
[junit4] 2> 1021103 T5234 n:127.0.0.1:34468_nobc%2Fpn oasc.DistributedQueue$LatchWatcher.process NodeChildrenChanged fired on path /overseer/queue state SyncConnected
[junit4] 2> 1021104 T5235 n:127.0.0.1:34468_nobc%2Fpn oasc.Overseer$ClusterStateUpdater.run processMessage: queueSize: 1, message = {
[junit4] 2> "operation":"leader",
[junit4] 2> "shard":"shard1",
[junit4] 2> "collection":"control_collection",
[junit4] 2> "base_url":"http://127.0.0.1:34468/nobc/pn",
[junit4] 2> "core":"collection1",
[junit4] 2> "state":"active"} current state version: 1
[junit4] 2> 1021255 T5242 n:127.0.0.1:34468_nobc%2Fpn c:control_collection s:shard1 x:collection1 oasc.ZkController.register We are http://127.0.0.1:34468/nobc/pn/collection1/ and leader is http://127.0.0.1:34468/nobc/pn/collection1/
[junit4] 2> 1021255 T5242 n:127.0.0.1:34468_nobc%2Fpn c:control_collection s:shard1 x:collection1 oasc.ZkController.register No LogReplay needed for core=collection1 baseURL=http://127.0.0.1:34468/nobc/pn
[junit4] 2> 1021255 T5242 n:127.0.0.1:34468_nobc%2Fpn c:control_collection s:shard1 x:collection1 oasc.ZkController.checkRecovery I am the leader, no recovery necessary
[junit4] 2> 1021256 T5242 n:127.0.0.1:34468_nobc%2Fpn c:control_collection s:shard1 x:collection1 oasc.ZkController.publish publishing core=collection1 state=active collection=control_collection
[junit4] 2> 1021256 T5242 n:127.0.0.1:34468_nobc%2Fpn c:control_collection s:shard1 x:collection1 oasc.ZkController.publish numShards not found on descriptor - reading it from system property
[junit4] 2> 1021257 T5234 n:127.0.0.1:34468_nobc%2Fpn oasc.DistributedQueue$LatchWatcher.process NodeChildrenChanged fired on path /overseer/queue state SyncConnected
[junit4] 2> 1021259 T5235 n:127.0.0.1:34468_nobc%2Fpn oasc.Overseer$ClusterStateUpdater.run processMessage: queueSize: 1, message = {
[junit4] 2> "operation":"state",
[junit4] 2> "node_name":"127.0.0.1:34468_nobc%2Fpn",
[junit4] 2> "roles":null,
[junit4] 2> "core":"collection1",
[junit4] 2> "core_node_name":"core_node1",
[junit4] 2> "shard":"shard1",
[junit4] 2> "state":"active",
[junit4] 2> "numShards":"2",
[junit4] 2> "collection":"control_collection",
[junit4] 2> "base_url":"http://127.0.0.1:34468/nobc/pn"} current state version: 2
[junit4] 2> 1021259 T5235 n:127.0.0.1:34468_nobc%2Fpn oasco.ReplicaMutator.updateState Update state numShards=2 message={
[junit4] 2> "operation":"state",
[junit4] 2> "node_name":"127.0.0.1:34468_nobc%2Fpn",
[junit4] 2> "roles":null,
[junit4] 2> "core":"collection1",
[junit4] 2> "core_node_name":"core_node1",
[junit4] 2> "shard":"shard1",
[junit4] 2> "state":"active",
[junit4] 2> "numShards":"2",
[junit4] 2> "collection":"control_collection",
[junit4] 2> "base_url":"http://127.0.0.1:34468/nobc/pn"}
[junit4] 2> 1021412 T5200 oas.SolrTestCaseJ4.writeCoreProperties Writing core.properties file to /x1/jenkins/jenkins-slave/workspace/Lucene-Solr-NightlyTests-5.2/solr/build/solr-core/test/J1/temp/solr.cloud.CollectionsAPIDistributedZkTest_436F3A4DF90D4A39-001/shard-1-001/cores/collection1
[junit4] 2> 1021413 T5200 oasc.AbstractFullDistribZkTestBase.createJettys create jetty 1 in directory /x1/jenkins/jenkins-slave/workspace/Lucene-Solr-NightlyTests-5.2/solr/build/solr-core/test/J1/temp/solr.cloud.CollectionsAPIDistributedZkTest_436F3A4DF90D4A39-001/shard-1-001
[junit4] 2> 1021425 T5200 oejs.Server.doStart jetty-9.2.10.v20150310
[junit4] 2> 1021496 T5200 oejsh.ContextHandler.doStart Started o.e.j.s.ServletContextHandler@64fb3c37{/nobc/pn,null,AVAILABLE}
[junit4] 2> 1021496 T5200 oejs.AbstractConnector.doStart Started ServerConnector@4f6a8fd6{HTTP/1.1}{127.0.0.1:60137}
[junit4] 2> 1021497 T5200 oejs.Server.doStart Started @1023104ms
[junit4] 2> 1021497 T5200 oascse.JettySolrRunner$1.lifeCycleStarted Jetty properties: {hostContext=/nobc/pn, coreRootDirectory=/x1/jenkins/jenkins-slave/workspace/Lucene-Solr-NightlyTests-5.2/solr/build/solr-core/test/J1/temp/solr.cloud.CollectionsAPIDistributedZkTest_436F3A4DF90D4A39-001/shard-1-001/cores, solrconfig=solrconfig.xml, hostPort=60137}
[junit4] 2> 1021498 T5200 oass.SolrDispatchFilter.init SolrDispatchFilter.init()sun.misc.Launcher$AppClassLoader@72b5615d
[junit4] 2> 1021498 T5200 oasc.SolrResourceLoader.<init> new SolrResourceLoader for directory: '/x1/jenkins/jenkins-slave/workspace/Lucene-Solr-NightlyTests-5.2/solr/build/solr-core/test/J1/temp/solr.cloud.CollectionsAPIDistributedZkTest_436F3A4DF90D4A39-001/shard-1-001/'
[junit4] 2> 1021512 T5200 oasc.SolrXmlConfig.fromFile Loading container configuration from /x1/jenkins/jenkins-slave/workspace/Lucene-Solr-NightlyTests-5.2/solr/build/solr-core/test/J1/temp/solr.cloud.CollectionsAPIDistributedZkTest_436F3A4DF90D4A39-001/shard-1-001/solr.xml
[junit4] 2> 1021524 T5200 oasc.CorePropertiesLocator.<init> Config-defined core root directory: /x1/jenkins/jenkins-slave/workspace/Lucene-Solr-NightlyTests-5.2/solr/build/solr-core/test/J1/temp/solr.cloud.CollectionsAPIDistributedZkTest_436F3A4DF90D4A39-001/shard-1-001/cores
[junit4] 2> 1021525 T5200 oasc.CoreContainer.<init> New CoreContainer 550665346
[junit4] 2> 1021525 T5200 oasc.CoreContainer.load Loading cores into CoreContainer [instanceDir=/x1/jenkins/jenkins-slave/workspace/Lucene-Solr-NightlyTests-5.2/solr/build/solr-core/test/J1/temp/solr.cloud.CollectionsAPIDistributedZkTest_436F3A4DF90D4A39-001/shard-1-001/]
[junit4] 2> 1021525 T5200 oasc.CoreContainer.load loading shared library: /x1/jenkins/jenkins-slave/workspace/Lucene-Solr-NightlyTests-5.2/solr/build/solr-core/test/J1/temp/solr.cloud.CollectionsAPIDistributedZkTest_436F3A4DF90D4A39-001/shard-1-001/lib
[junit4] 2> 1021526 T5200 oasc.SolrResourceLoader.addToClassLoader WARN Can't find (or read) directory to add to classloader: lib (resolved as: /x1/jenkins/jenkins-slave/workspace/Lucene-Solr-NightlyTests-5.2/solr/build/solr-core/test/J1/temp/solr.cloud.CollectionsAPIDistributedZkTest_436F3A4DF90D4A39-001/shard-1-001/lib).
[junit4] 2> 1021533 T5200 oashc.HttpShardHandlerFactory.init created with socketTimeout : 90000,urlScheme : ,connTimeout : 15000,maxConnectionsPerHost : 20,maxConnections : 10000,corePoolSize : 0,maximumPoolSize : 2147483647,maxThreadIdleTime : 5,sizeOfQueue : -1,fairnessPolicy : false,useRetries : false,
[junit4] 2> 1021534 T5200 oasu.UpdateShardHandler.<init> Creating UpdateShardHandler HTTP client with params: socketTimeout=340000&connTimeout=45000&retry=true
[junit4] 2> 1021535 T5200 oasl.LogWatcher.createWatcher SLF4J impl is org.slf4j.impl.Log4jLoggerFactory
[junit4] 2> 1021535 T5200 oasl.LogWatcher.newRegisteredLogWatcher Registering Log Listener [Log4j (org.slf4j.impl.Log4jLoggerFactory)]
[junit4] 2> 1021535 T5200 oasc.CoreContainer.load Node Name: 127.0.0.1
[junit4] 2> 1021536 T5200 oasc.ZkContainer.initZooKeeper Zookeeper client=127.0.0.1:43356/solr
[junit4] 2> 1021536 T5200 oasc.ZkController.checkChrootPath zkHost includes chroot
[junit4] 2> 1022548 T5200 n:127.0.0.1:60137_nobc%2Fpn oasc.ZkController.createEphemeralLiveNode Register node as live in ZooKeeper:/live_nodes/127.0.0.1:60137_nobc%2Fpn
[junit4] 2> 1022552 T5200 n:127.0.0.1:60137_nobc%2Fpn oasc.Overseer.close Overseer (id=null) closing
[junit4] 2> 1022554 T5200 n:127.0.0.1:60137_nobc%2Fpn oasc.CoreContainer.initializeAuthenticationPlugin No authentication plugin used.
[junit4] 2> 1022554 T5200 n:127.0.0.1:60137_nobc%2Fpn oasc.CoreContainer.intializeAuthorizationPlugin Security conf doesn't exist. Skipping setup for authorization module.
[junit4] 2> 1022555 T5200 n:127.0.0.1:60137_nobc%2Fpn oasc.CorePropertiesLocator.discover Looking for core definitions underneath /x1/jenkins/jenkins-slave/workspace/Lucene-Solr-NightlyTests-5.2/solr/build/solr-core/test/J1/temp/solr.cloud.CollectionsAPIDistributedZkTest_436F3A4DF90D4A39-001/shard-1-001/cores
[junit4] 2> 1022556 T5200 n:127.0.0.1:60137_nobc%2Fpn oasc.CoreDescriptor.<init> CORE DESCRIPTOR: {shard=, config=solrconfig.xml, dataDir=data/, coreNodeName=, transient=false, instanceDir=/x1/jenkins/jenkins-slave/workspace/Lucene-Solr-NightlyTests-5.2/solr/build/solr-core/test/J1/temp/solr.cloud.CollectionsAPIDistributedZkTest_436F3A4DF90D4A39-001/shard-1-001/cores/collection1, name=collection1, schema=schema.xml, collection=collection1, loadOnStartup=true, absoluteInstDir=/x1/jenkins/jenkins-slave/workspace/Lucene-Solr-NightlyTests-5.2/solr/build/solr-core/test/J1/temp/solr.cloud.CollectionsAPIDistributedZkTest_436F3A4DF90D4A39-001/shard-1-001/cores/collection1/}
[junit4] 2> 1022556 T5200 n:127.0.0.1:60137_nobc%2Fpn oasc.CorePropertiesLocator.discoverUnder Found core collection1 in /x1/jenkins/jenkins-slave/workspace/Lucene-Solr-NightlyTests-5.2/solr/build/solr-core/test/J1/temp/solr.cloud.CollectionsAPIDistributedZkTest_436F3A4DF90D4A39-001/shard-1-001/cores/collection1/
[junit4] 2> 1022556 T5200 n:127.0.0.1:60137_nobc%2Fpn oasc.CorePropertiesLocator.discover Found 1 core definitions
[junit4] 2> 1022557 T5263 n:127.0.0.1:60137_nobc%2Fpn c:collection1 x:collection1 oasc.ZkController.publish publishing core=collection1 state=down collection=collection1
[junit4] 2> 1022558 T5263 n:127.0.0.1:60137_nobc%2Fpn c:collection1 x:collection1 oasc.ZkController.publish numShards not found on descriptor - reading it from system property
[junit4] 2> 1022559 T5234 n:127.0.0.1:34468_nobc%2Fpn oasc.DistributedQueue$LatchWatcher.process NodeChildrenChanged fired on path /overseer/queue state SyncConnected
[junit4] 2> 1022559 T5263 n:127.0.0.1:60137_nobc%2Fpn oasc.ZkController.waitForCoreNodeName look for our core node name
[junit4] 2> 1022560 T5235 n:127.0.0.1:34468_nobc%2Fpn oasc.Overseer$ClusterStateUpdater.run processMessage: queueSize: 1, message = {
[junit4] 2> "operation":"state",
[junit4] 2> "node_name":"127.0.0.1:60137_nobc%2Fpn",
[junit4] 2> "roles":null,
[junit4] 2> "core":"collection1",
[junit4] 2> "shard":null,
[junit4] 2> "state":"down",
[junit4] 2> "numShards":"2",
[junit4] 2> "collection":"collection1",
[junit4] 2> "base_url":"http://127.0.0.1:60137/nobc/pn"} current state version: 3
[junit4] 2> 1022560 T5235 n:127.0.0.1:34468_nobc%2Fpn oasco.ReplicaMutator.updateState Update state numShards=2 message={
[junit4] 2> "operation":"state",
[junit4] 2> "node_name":"127.0.0.1:60137_nobc%2Fpn",
[junit4] 2> "roles":null,
[junit4] 2> "core":"collection1",
[junit4] 2> "shard":null,
[junit4] 2> "state":"down",
[junit4] 2> "numShards":"2",
[junit4] 2> "collection":"collection1",
[junit4] 2> "base_url":"http://127.0.0.1:60137/nobc/pn"}
[junit4] 2> 1022561 T5235 n:127.0.0.1:34468_nobc%2Fpn oasco.ClusterStateMutator.createCollection building a new cName: collection1
[junit4] 2> 1022561 T5235 n:127.0.0.1:34468_nobc%2Fpn oasco.ReplicaMutator.updateState Assigning new node to shard shard=shard2
[junit4] 2> 1023560 T5263 n:127.0.0.1:60137_nobc%2Fpn oasc.ZkController.waitForShardId waiting to find shard id in clusterstate for collection1
[junit4] 2> 1023560 T5263 n:127.0.0.1:60137_nobc%2Fpn oasc.ZkController.createCollectionZkNode Check for collection zkNode:collection1
[junit4] 2> 1023561 T5263 n:127.0.0.1:60137_nobc%2Fpn oasc.ZkController.createCollectionZkNode Collection zkNode exists
[junit4] 2> 1023561 T5263 n:127.0.0.1:60137_nobc%2Fpn oasc.SolrResourceLoader.<init> new SolrResourceLoader for directory: '/x1/jenkins/jenkins-slave/workspace/Lucene-Solr-NightlyTests-5.2/solr/build/solr-core/test/J1/temp/solr.cloud.CollectionsAPIDistributedZkTest_436F3A4DF90D4A39-001/shard-1-001/cores/collection1/'
[junit4] 2> 1023575 T5263 n:127.0.0.1:60137_nobc%2Fpn oasc.Config.<init> loaded config solrconfig.xml with version 0
[junit4] 2> 1023580 T5263 n:127.0.0.1:60137_nobc%2Fpn oasc.SolrConfig.refreshRequestParams current version of requestparams : -1
[junit4] 2> 1023592 T5263 n:127.0.0.1:60137_nobc%2Fpn oasc.SolrConfig.<init> Using Lucene MatchVersion: 5.2.1
[junit4] 2> 1023630 T5263 n:127.0.0.1:60137_nobc%2Fpn oasc.SolrConfig.<init> Loaded SolrConfig: solrconfig.xml
[junit4] 2> 1023631 T5263 n:127.0.0.1:60137_nobc%2Fpn oass.IndexSchema.readSchema Reading Solr Schema from /configs/conf1/schema.xml
[junit4] 2> 1023636 T5263 n:127.0.0.1:60137_nobc%2Fpn oass.IndexSchema.readSchema [collection1] Schema name=test
[junit4] 2> 1023856 T5263 n:127.0.0.1:60137_nobc%2Fpn oass.OpenExchangeRatesOrgProvider.init Initialized with rates=open-exchange-rates.json, refreshInterval=1440.
[junit4] 2> 1023863 T5263 n:127.0.0.1:60137_nobc%2Fpn oass.IndexSchema.readSchema default search field in schema is text
[junit4] 2> 1023865 T5263 n:127.0.0.1:60137_nobc%2Fpn oass.IndexSchema.readSchema unique key field: id
[junit4] 2> 1023873 T5263 n:127.0.0.1:60137_nobc%2Fpn oass.FileExchangeRateProvider.reload Reloading exchange rates from file currency.xml
[junit4] 2> 1023877 T5263 n:127.0.0.1:60137_nobc%2Fpn oass.FileExchangeRateProvider.reload Reloading exchange rates from file currency.xml
[junit4] 2> 1023879 T5263 n:127.0.0.1:60137_nobc%2Fpn oass.OpenExchangeRatesOrgProvider.reload Reloading exchange rates from open-exchange-rates.json
[junit4] 2> 1023880 T5263 n:127.0.0.1:60137_nobc%2Fpn oass.OpenExchangeRatesOrgProvider$OpenExchangeRates.<init> WARN Unknown key IMPORTANT NOTE
[junit4] 2> 1023880 T5263 n:127.0.0.1:60137_nobc%2Fpn oass.OpenExchangeRatesOrgProvider$OpenExchangeRates.<init> WARN Expected key, got STRING
[junit4] 2> 1023880 T5263 n:127.0.0.1:60137_nobc%2Fpn oass.OpenExchangeRatesOrgProvider.reload Reloading exchange rates from open-exchange-rates.json
[junit4] 2> 1023881 T5263 n:127.0.0.1:60137_nobc%2Fpn oass.OpenExchangeRatesOrgProvider$OpenExchangeRates.<init> WARN Unknown key IMPORTANT NOTE
[junit4] 2> 1023881 T5263 n:127.0.0.1:60137_nobc%2Fpn oass.OpenExchangeRatesOrgProvider$OpenExchangeRates.<init> WARN Expected key, got STRING
[junit4] 2> 1023881 T5263 n:127.0.0.1:60137_nobc%2Fpn oasc.CoreContainer.create Creating SolrCore 'collection1' using configuration from collection collection1
[junit4] 2> 1023882 T5263 n:127.0.0.1:60137_nobc%2Fpn x:collection1 oasc.SolrCore.initDirectoryFactory org.apache.solr.core.MockDirectoryFactory
[junit4] 2> 1023882 T5263 n:127.0.0.1:60137_nobc%2Fpn x:collection1 oasc.SolrCore.<init> [[collection1] ] Opening new SolrCore at [/x1/jenkins/jenkins-slave/workspace/Lucene-Solr-NightlyTests-5.2/solr/build/solr-core/test/J1/temp/solr.cloud.CollectionsAPIDistributedZkTest_436F3A4DF90D4A39-001/shard-1-001/cores/collection1/], dataDir=[null]
[junit4] 2> 1023882 T5263 n:127.0.0.1:60137_nobc%2Fpn x:collection1 oasc.JmxMonitoredMap.<init> JMX monitoring is enabled. Adding Solr mbeans to JMX Server: com.sun.jmx.mbeanserver.JmxMBeanServer@fe2cdb4
[junit4] 2> 1023883 T5263 n:127.0.0.1:60137_nobc%2Fpn x:collection1 oasc.CachingDirectoryFactory.get return new directory for /x1/jenkins/jenkins-slave/workspace/Lucene-Solr-NightlyTests-5.2/solr/build/solr-core/test/J1/temp/solr.cloud.CollectionsAPIDistributedZkTest_436F3A4DF90D4A39-001/shard-1-001/cores/collection1/data
[junit4] 2> 1023883 T5263 n:127.0.0.1:60137_nobc%2Fpn x:collection1 oasc.SolrCore.getNewIndexDir New index directory detected: old=null new=/x1/jenkins/jenkins-slave/workspace/Lucene-Solr-NightlyTests-5.2/solr/build/solr-core/test/J1/temp/solr.cloud.CollectionsAPIDistributedZkTest_436F3A4DF90D4A39-001/shard-1-001/cores/collection1/data/index/
[junit4] 2> 1023883 T5263 n:127.0.0.1:60137_nobc%2Fpn x:collection1 oasc.SolrCore.initIndex WARN [collection1] Solr index directory '/x1/jenkins/jenkins-slave/workspace/Lucene-Solr-NightlyTests-5.2/solr/build/solr-core/test/J1/temp/solr.cloud.CollectionsAPIDistributedZkTest_436F3A4DF90D4A39-001/shard-1-001/cores/collection1/data/index' doesn't exist. Creating new index...
[junit4] 2> 1023884 T5263 n:127.0.0.1:60137_nobc%2Fpn x:collection1 oasc.CachingDirectoryFactory.get return new directory for /x1/jenkins/jenkins-slave/workspace/Lucene-Solr-NightlyTests-5.2/solr/build/solr-core/test/J1/temp/solr.cloud.CollectionsAPIDistributedZkTest_436F3A4DF90D4A39-001/shard-1-001/cores/collection1/data/index
[junit4] 2> 1023884 T5263 n:127.0.0.1:60137_nobc%2Fpn x:collection1 oasu.RandomMergePolicy.<init> RandomMergePolicy wrapping class org.apache.lucene.index.LogByteSizeMergePolicy: [LogByteSizeMergePolicy: minMergeSize=1677721, mergeFactor=18, maxMergeSize=2147483648, maxMergeSizeForForcedMerge=9223372036854775807, calibrateSizeByDeletes=true, maxMergeDocs=2147483647, maxCFSSegmentSizeMB=8.796093022207999E12, noCFSRatio=1.0]
[junit4] 2> 1023887 T5263 n:127.0.0.1:60137_nobc%2Fpn x:collection1 oasc.SolrDeletionPolicy.onCommit SolrDeletionPolicy.onCommit: commits: num=1
[junit4] 2> commit{dir=MockDirectoryWrapper(SimpleFSDirectory@/x1/jenkins/jenkins-slave/workspace/Lucene-Solr-NightlyTests-5.2/solr/build/solr-core/test/J1/temp/solr.cloud.CollectionsAPIDistributedZkTest_436F3A4DF90D4A39-001/index-SimpleFSDirectory-002 lockFactory=org.apache.lucene.store.NativeFSLockFactory@302b3e2e),segFN=segments_1,generation=1}
[junit4] 2> 1023887 T5263 n:127.0.0.1:60137_nobc%2Fpn x:collection1 oasc.SolrDeletionPolicy.updateCommits newest commit generation = 1
[junit4] 2> 1023892 T5263 n:127.0.0.1:60137_nobc%2Fpn x:collection1 oasup.UpdateRequestProcessorChain.init creating updateRequestProcessorChain "nodistrib"
[junit4] 2> 1023892 T5263 n:127.0.0.1:60137_nobc%2Fpn x:collection1 oasup.UpdateRequestProcessorChain.init creating updateRequestProcessorChain "dedupe"
[junit4] 2> 1023893 T5263 n:127.0.0.1:60137_nobc%2Fpn x:collection1 oasup.UpdateRequestProcessorChain.init inserting DistributedUpdateProcessorFactory into updateRequestProcessorChain "dedupe"
[junit4] 2> 1023893 T5263 n:127.0.0.1:60137_nobc%2Fpn x:collection1 oasup.UpdateRequestProcessorChain.init creating updateRequestProcessorChain "stored_sig"
[junit4] 2> 1023893 T5263 n:127.0.0.1:60137_nobc%2Fpn x:collection1 oasup.UpdateRequestProcessorChain.init inserting DistributedUpdateProcessorFactory into updateRequestProcessorChain "stored_sig"
[junit4] 2> 1023893 T5263 n:127.0.0.1:60137_nobc%2Fpn x:collection1 oasup.UpdateRequestProcessorChain.init creating updateRequestProcessorChain "distrib-dup-test-chain-explicit"
[junit4] 2> 1023893 T5263 n:127.0.0.1:60137_nobc%2Fpn x:collection1 oasup.UpdateRequestProcessorChain.init creating updateRequestProcessorChain "distrib-dup-test-chain-implicit"
[junit4] 2> 1023894 T5263 n:127.0.0.1:60137_nobc%2Fpn x:collection1 oasup.UpdateRequestProcessorChain.init inserting DistributedUpdateProcessorFactory into updateRequestProcessorChain "distrib-dup-test-chain-implicit"
[junit4] 2> 1023894 T5263 n:127.0.0.1:60137_nobc%2Fpn x:collection1 oasc.SolrCore.loadUpdateProcessorChains no updateRequestProcessorChain defined as default, creating implicit default
[junit4] 2> 1023897 T5263 n:127.0.0.1:60137_nobc%2Fpn x:collection1 oashl.XMLLoader.init xsltCacheLifetimeSeconds=60
[junit4] 2> 1023898 T5263 n:127.0.0.1:60137_nobc%2Fpn x:collection1 oashl.XMLLoader.init xsltCacheLifetimeSeconds=60
[junit4] 2> 1023899 T5263 n:127.0.0.1:60137_nobc%2Fpn x:collection1 oashl.XMLLoader.init xsltCacheLifetimeSeconds=60
[junit4] 2> 1023901 T5263 n:127.0.0.1:60137_nobc%2Fpn x:collection1 oashl.XMLLoader.init xsltCacheLifetimeSeconds=60
[junit4] 2> 1023906 T5263 n:127.0.0.1:60137_nobc%2Fpn x:collection1 oasc.RequestHandlers.initHandlersFromConfig Registered paths: /admin/luke,/schema,/admin/ping,/admin/plugins,/update/json,/admin/properties,/update,/replication,/admin/file,/config,/update/csv,/admin/mbeans,/admin/segments,standard,/admin/logging,/update/json/docs,/admin/system,/get,/admin/threads
[junit4] 2> 1023907 T5263 n:127.0.0.1:60137_nobc%2Fpn x:collection1 oasc.SolrCore.initStatsCache Using default statsCache cache: org.apache.solr.search.stats.LocalStatsCache
[junit4] 2> 1023908 T5263 n:127.0.0.1:60137_nobc%2Fpn x:collection1 oasu.UpdateHandler.<init> Using UpdateLog implementation: org.apache.solr.update.UpdateLog
[junit4] 2> 1023908 T5263 n:127.0.0.1:60137_nobc%2Fpn x:collection1 oasu.UpdateLog.init Initializing UpdateLog: dataDir= defaultSyncLevel=FLUSH numRecordsToKeep=100 maxNumLogsToKeep=10 numVersionBuckets=65536
[junit4] 2> 1023909 T5263 n:127.0.0.1:60137_nobc%2Fpn x:collection1 oasu.CommitTracker.<init> Hard AutoCommit: disabled
[junit4] 2> 1023909 T5263 n:127.0.0.1:60137_nobc%2Fpn x:collection1 oasu.CommitTracker.<init> Soft AutoCommit: disabled
[junit4] 2> 1023910 T5263 n:127.0.0.1:60137_nobc%2Fpn x:collection1 oasu.RandomMergePolicy.<init> RandomMergePolicy wrapping class org.apache.lucene.index.TieredMergePolicy: [TieredMergePolicy: maxMergeAtOnce=39, maxMergeAtOnceExplicit=46, maxMergedSegmentMB=85.091796875, floorSegmentMB=0.9384765625, forceMergeDeletesPctAllowed=23.308774821982688, segmentsPerTier=13.0, maxCFSSegmentSizeMB=8.796093022207999E12, noCFSRatio=0.8488163824093705
[junit4] 2> 1023911 T5263 n:127.0.0.1:60137_nobc%2Fpn x:collection1 oasc.SolrDeletionPolicy.onInit SolrDeletionPolicy.onInit: commits: num=1
[junit4] 2> commit{dir=MockDirectoryWrapper(SimpleFSDirectory@/x1/jenkins/jenkins-slave/workspace/Lucene-Solr-NightlyTests-5.2/solr/build/solr-core/test/J1/temp/solr.cloud.CollectionsAPIDistributedZkTest_436F3A4DF90D4A39-001/index-SimpleFSDirectory-002 lockFactory=org.apache.lucene.store.NativeFSLockFactory@302b3e2e),segFN=segments_1,generation=1}
[junit4] 2> 1023912 T5263 n:127.0.0.1:60137_nobc%2Fpn x:collection1 oasc.SolrDeletionPolicy.updateCommits newest commit generation = 1
[junit4] 2> 1023912 T5263 n:127.0.0.1:60137_nobc%2Fpn x:collection1 oass.SolrIndexSearcher.<init> Opening Searcher@92ccea6[collection1] main
[junit4] 2> 1023913 T5263 n:127.0.0.1:60137_nobc%2Fpn x:collection1 oasr.ManagedResourceStorage.newStorageIO Setting up ZooKeeper-based storage for the RestManager with znodeBase: /configs/conf1
[junit4] 2> 1023913 T5263 n:127.0.0.1:60137_nobc%2Fpn x:collection1 oasr.ManagedResourceStorage$ZooKeeperStorageIO.configure Configured ZooKeeperStorageIO with znodeBase: /configs/conf1
[junit4] 2> 1023913 T5263 n:127.0.0.1:60137_nobc%2Fpn x:collection1 oasr.RestManager.init Initializing RestManager with initArgs: {}
[junit4] 2> 1023914 T5263 n:127.0.0.1:60137_nobc%2Fpn x:collection1 oasr.ManagedResourceStorage.load Reading _rest_managed.json using ZooKeeperStorageIO:path=/configs/conf1
[junit4] 2> 1023914 T5263 n:127.0.0.1:60137_nobc%2Fpn x:collection1 oasr.ManagedResourceStorage$ZooKeeperStorageIO.openInputStream No data found for znode /configs/conf1/_rest_managed.json
[junit4] 2> 1023914 T5263 n:127.0.0.1:60137_nobc%2Fpn x:collection1 oasr.ManagedResourceStorage.load Loaded null at path _rest_managed.json using ZooKeeperStorageIO:path=/configs/conf1
[junit4] 2> 1023914 T5263 n:127.0.0.1:60137_nobc%2Fpn x:collection1 oasr.RestManager.init Initializing 0 registered ManagedResources
[junit4] 2> 1023914 T5263 n:127.0.0.1:60137_nobc%2Fpn x:collection1 oash.ReplicationHandler.inform Commits will be reserved for 10000
[junit4] 2> 1023915 T5263 n:127.0.0.1:60137_nobc%2Fpn x:collection1 oasu.UpdateLog.seedBucketsWithHighestVersion Looking up max value of version field to seed version buckets
[junit4] 2> 1023915 T5263 n:127.0.0.1:60137_nobc%2Fpn x:collection1 oasu.VersionInfo.getMaxVersionFromIndex Refreshing highest value of _version_ for 65536 version buckets from index
[junit4] 2> 1023915 T5263 n:127.0.0.1:60137_nobc%2Fpn x:collection1 oasu.VersionInfo.getMaxVersionFromIndex No terms found for _version_, cannot seed version bucket highest value from index
[junit4] 2> 1023915 T5263 n:127.0.0.1:60137_nobc%2Fpn x:collection1 oasu.UpdateLog.seedBucketsWithHighestVersion Could not find max version in index or recent updates, using new clock 1503643833242484736
[junit4] 2> 1023916 T5264 n:127.0.0.1:60137_nobc%2Fpn x:collection1 oasc.SolrCore.registerSearcher [collection1] Registered new searcher Searcher@92ccea6[collection1] main{ExitableDirectoryReader(UninvertingDirectoryReader())}
[junit4] 2> 1023917 T5263 n:127.0.0.1:60137_nobc%2Fpn x:collection1 oasu.UpdateLog.seedBucketsWithHighestVersion Took 2 ms to seed version buckets with highest version 1503643833242484736
[junit4] 2> 1023917 T5263 n:127.0.0.1:60137_nobc%2Fpn x:collection1 oasc.ZkController.getConfDirListeners watch zkdir /configs/conf1
[junit4] 2> 1023918 T5263 n:127.0.0.1:60137_nobc%2Fpn x:collection1 oasc.CoreContainer.registerCore registering core: collection1
[junit4] 2> 1023919 T5267 n:127.0.0.1:60137_nobc%2Fpn c:collection1 s:shard2 x:collection1 oasc.ZkController.register Register replica - core:collection1 address:http://127.0.0.1:60137/nobc/pn collection:collection1 shard:shard2
[junit4] 2> 1023919 T5200 n:127.0.0.1:60137_nobc%2Fpn oass.SolrDispatchFilter.init user.dir=/x1/jenkins/jenkins-slave/workspace/Lucene-Solr-NightlyTests-5.2/solr/build/solr-core/test/J1
[junit4] 2> 1023919 T5200 n:127.0.0.1:60137_nobc%2Fpn oass.SolrDispatchFilter.init SolrDispatchFilter.init() done
[junit4] 2> 1023929 T5267 n:127.0.0.1:60137_nobc%2Fpn c:collection1 s:shard2 x:collection1 oasc.ShardLeaderElectionContext.runLeaderProcess Running the leader process for shard shard2
[junit4] 2> 1023930 T5234 n:127.0.0.1:34468_nobc%2Fpn oasc.DistributedQueue$LatchWatcher.process NodeChildrenChanged fired on path /overseer/queue state SyncConnected
[junit4] 2> 1023930 T5267 n:127.0.0.1:60137_nobc%2Fpn c:collection1 s:shard2 x:collection1 oasc.ShardLeaderElectionContext.waitForReplicasToComeUp Enough replicas found to continue.
[junit4] 2> 1023931 T5235 n:127.0.0.1:34468_nobc%2Fpn oasc.Overseer$ClusterStateUpdater.run processMessage: queueSize: 1, message = {
[junit4] 2> "operation":"leader",
[junit4] 2> "shard":"shard2",
[junit4] 2> "collection":"collection1"} current state version: 4
[junit4] 2> 1023931 T5267 n:127.0.0.1:60137_nobc%2Fpn c:collection1 s:shard2 x:collection1 oasc.ShardLeaderElectionContext.runLeaderProcess I may be the new leader - try and sync
[junit4] 2> ASYNC NEW_CORE C997 name=collection1 org.apache.solr.core.SolrCore@5a00e47b url=http://127.0.0.1:60137/nobc/pn/collection1 node=127.0.0.1:60137_nobc%2Fpn C997_STATE=coll:collection1 core:collection1 props:{node_name=127.0.0.1:60137_nobc%2Fpn, core=collection1, state=down, base_url=http://127.0.0.1:60137/nobc/pn}
[junit4] 2> 1023931 T5267 n:127.0.0.1:60137_nobc%2Fpn c:collection1 s:shard2 x:collection1 C997 oasc.SyncStrategy.sync Sync replicas to http://127.0.0.1:60137/nobc/pn/collection1/
[junit4] 2> 1023932 T5267 n:127.0.0.1:60137_nobc%2Fpn c:collection1 s:shard2 x:collection1 C997 oasc.SyncStrategy.syncReplicas Sync Success - now sync replicas to me
[junit4] 2> 1023932 T5267 n:127.0.0.1:60137_nobc%2Fpn c:collection1 s:shard2 x:collection1 C997 oasc.SyncStrategy.syncToMe http://127.0.0.1:60137/nobc/pn/collection1/ has no replicas
[junit4] 2> 1023933 T5267 n:127.0.0.1:60137_nobc%2Fpn c:collection1 s:shard2 x:collection1 oasc.ShardLeaderElectionContext.runLeaderProcess I am the new leader: http://127.0.0.1:60137/nobc/pn/collection1/ shard2
[junit4] 2> 1023936 T5234 n:127.0.0.1:34468_nobc%2Fpn oasc.DistributedQueue$LatchWatcher.process NodeChildrenChanged fired on path /overseer/queue state SyncConnected
[junit4] 2> 1023936 T5235 n:127.0.0.1:34468_nobc%2Fpn oasc.Overseer$ClusterStateUpdater.run processMessage: queueSize: 1, message = {
[junit4] 2> "operation":"leader",
[junit4] 2> "shard":"shard2",
[junit4] 2> "collection":"collection1",
[junit4] 2> "base_url":"http://127.0.0.1:60137/nobc/pn",
[junit4] 2> "core":"collection1",
[junit4] 2> "state":"active"} current state version: 4
[junit4] 2> 1024087 T5267 n:127.0.0.1:60137_nobc%2Fpn c:collection1 s:shard2 x:collection1 oasc.ZkController.register We are http://127.0.0.1:60137/nobc/pn/collection1/ and leader is http://127.0.0.1:60137/nobc/pn/collection1/
[junit4] 2> 1024087 T5267 n:127.0.0.1:60137_nobc%2Fpn c:collection1 s:shard2 x:collection1 oasc.ZkController.register No LogReplay needed for core=collection1 baseURL=http://127.0.0.1:60137/nobc/pn
[junit4] 2> 1024087 T5267 n:127.0.0.1:60137_nobc%2Fpn c:collection1 s:shard2 x:collection1 oasc.ZkController.checkRecovery I am the leader, no recovery necessary
[junit4] 2> 1024088 T5267 n:127.0.0.1:60137_nobc%2Fpn c:collection1 s:shard2 x:collection1 oasc.ZkController.publish publishing core=collection1 state=active collection=collection1
[junit4] 2> 1024088 T5267 n:127.0.0.1:60137_nobc%2Fpn c:collection1 s:shard2 x:collection1 oasc.ZkController.publish numShards not found on descriptor - reading it from system property
[junit4] 2> 1024089 T5234 n:127.0.0.1:34468_nobc%2Fpn oasc.DistributedQueue$LatchWatcher.process NodeChildrenChanged fired on path /overseer/queue state SyncConnected
[junit4] 2> 1024090 T5235 n:127.0.0.1:34468_nobc%2Fpn oasc.Overseer$ClusterStateUpdater.run processMessage: queueSize: 1, message = {
[junit4] 2> "operation":"state",
[junit4] 2> "node_name":"127.0.0.1:60137_nobc%2Fpn",
[junit4] 2> "roles":null,
[junit4] 2> "core":"collection1",
[junit4] 2> "core_node_name":"core_node1",
[junit4] 2> "shard":"shard2",
[junit4] 2> "state":"active",
[junit4] 2> "numShards":"2",
[junit4] 2> "collection":"collection1",
[junit4] 2> "base_url":"http://127.0.0.1:60137/nobc/pn"} current state version: 5
[junit4] 2> 1024090 T5235 n:127.0.0.1:34468_nobc%2Fpn oasco.ReplicaMutator.updateState Update state numShards=2 message={
[junit4] 2> "operation":"state",
[junit4] 2> "node_name":"127.0.0.1:60137_nobc%2Fpn",
[junit4] 2> "roles":null,
[junit4] 2> "core":"collection1",
[junit4] 2> "core_node_name":"core_node1",
[junit4] 2> "shard":"shard2",
[junit4] 2> "state":"active",
[junit4] 2> "numShards":"2",
[junit4] 2> "collection":"collection1",
[junit4] 2> "base_url":"http://127.0.0.1:60137/nobc/pn"}
[junit4] 2> 1024214 T5200 oas.SolrTestCaseJ4.writeCoreProperties Writing core.properties file to /x1/jenkins/jenkins-slave/workspace/Lucene-Solr-NightlyTests-5.2/solr/build/solr-core/test/J1/temp/solr.cloud.CollectionsAPIDistributedZkTest_436F3A4DF90D4A39-001/shard-2-001/cores/collection1
[junit4] 2> 1024215 T5200 oasc.AbstractFullDistribZkTestBase.createJettys create jetty 2 in directory /x1/jenkins/jenkins-slave/workspace/Lucene-Solr-NightlyTests-5.2/solr/build/solr-core/test/J1/temp/solr.cloud.CollectionsAPIDistributedZkTest_436F3A4DF90D4A39-001/shard-2-001
[junit4] 2> 1024216 T5200 oejs.Server.doStart jetty-9.2.10.v20150310
[junit4] 2> 1024218 T5200 oejsh.ContextHandler.doStart Started o.e.j.s.ServletContextHandler@271b2ae{/nobc/pn,null,AVAILABLE}
[junit4] 2> 1024219 T5200 oejs.AbstractConnector.doStart Started ServerConnector@4d4aef5a{HTTP/1.1}{127.0.0.1:52852}
[junit4] 2> 1024219 T5200 oejs.Server.doStart Started @1025826ms
[junit4] 2> 1024219 T5200 oascse.JettySolrRunner$1.lifeCycleStarted Jetty properties: {hostContext=/nobc/pn, hostPort=52852, solrconfig=solrconfig.xml, coreRootDirectory=/x1/jenkins/jenkins-slave/workspace/Lucene-Solr-NightlyTests-5.2/solr/build/solr-core/test/J1/../../../../../../../../../../x1/jenkins/jenkins-slave/workspace/Lucene-Solr-NightlyTests-5.2/solr/build/solr-core/test/J1/temp/solr.cloud.CollectionsAPIDistributedZkTest_436F3A4DF90D4A39-001/shard-2-001/cores}
[junit4] 2> 1024220 T5200 oass.SolrDispatchFilter.init SolrDispatchFilter.init()sun.misc.Launcher$AppClassLoader@72b5615d
[junit4] 2> 1024220 T5200 oasc.SolrResourceLoader.<init> new SolrResourceLoader for directory: '/x1/jenkins/jenkins-slave/workspace/Lucene-Solr-NightlyTests-5.2/solr/build/solr-core/test/J1/../../../../../../../../../../x1/jenkins/jenkins-slave/workspace/Lucene-Solr-NightlyTests-5.2/solr/build/solr-core/test/J1/temp/solr.cloud.CollectionsAPIDistributedZkTest_436F3A4DF90D4A39-001/shard-2-001/'
[junit4] 2> 1024234 T5200 oasc.SolrXmlConfig.fromFile Loading container configuration from /x1/jenkins/jenkins-slave/workspace/Lucene-Solr-NightlyTests-5.2/solr/build/solr-core/test/J1/../../../../../../../../../../x1/jenkins/jenkins-slave/workspace/Lucene-Solr-NightlyTests-5.2/solr/build/solr-core/test/J1/temp/solr.cloud.CollectionsAPIDistributedZkTest_436F3A4DF90D4A39-001/shard-2-001/solr.xml
[junit4] 2> 1024247 T5200 oasc.CorePropertiesLocator.<init> Config-defined core root directory: /x1/jenkins/jenkins-slave/workspace/Lucene-Solr-NightlyTests-5.2/solr/build/solr-core/test/J1/../../../../../../../../../../x1/jenkins/jenkins-slave/workspace/Lucene-Solr-NightlyTests-5.2/solr/build/solr-core/test/J1/temp/solr.cloud.CollectionsAPIDistributedZkTest_436F3A4DF90D4A39-001/shard-2-001/cores
[junit4] 2> 1024247 T5200 oasc.CoreContainer.<init> New CoreContainer 1075860511
[junit4] 2> 1024247 T5200 oasc.CoreContainer.load Loading cores into CoreContainer [instanceDir=/x1/jenkins/jenkins-slave/workspace/Lucene-Solr-NightlyTests-5.2/solr/build/solr-core/test/J1/../../../../../../../../../../x1/jenkins/jenkins-slave/workspace/Lucene-Solr-NightlyTests-5.2/solr/build/solr-core/test/J1/temp/solr.cloud.CollectionsAPIDistributedZkTest_436F3A4DF90D4A39-001/shard-2-001/]
[junit4] 2> 1024247 T5200 oasc.CoreContainer.load loading shared library: /x1/jenkins/jenkins-slave/workspace/Lucene-Solr-NightlyTests-5.2/solr/build/solr-core/test/J1/../../../../../../../../../../x1/jenkins/jenkins-slave/workspace/Lucene-Solr-NightlyTests-5.2/solr/build/solr-core/test/J1/temp/solr.cloud.CollectionsAPIDistributedZkTest_436F3A4DF90D4A39-001/shard-2-001/lib
[junit4] 2> 1024248 T5200 oasc.SolrResourceLoader.addToClassLoader WARN Can't find (or read) directory to add to classloader: lib (resolved as: /x1/jenkins/jenkins-slave/workspace/Lucene-Solr-NightlyTests-5.2/solr/build/solr-core/test/J1/../../../../../../../../../../x1/jenkins/jenkins-slave/workspace/Lucene-Solr-NightlyTests-5.2/solr/build/solr-core/test/J1/temp/solr.cloud.CollectionsAPIDistributedZkTest_436F3A4DF90D4A39-001/shard-2-001/lib).
[junit4] 2> 1024256 T5200 oashc.HttpShardHandlerFactory.init created with socketTimeout : 90000,urlScheme : ,connTimeout : 15000,maxConnectionsPerHost : 20,maxConnections : 10000,corePoolSize : 0,maximumPoolSize : 2147483647,maxThreadIdleTime : 5,sizeOfQueue : -1,fairnessPolicy : false,useRetries : false,
[junit4] 2> 1024257 T5200 oasu.UpdateShardHandler.<init> Creating UpdateShardHandler HTTP client with params: socketTimeout=340000&connTimeout=45000&retry=true
[junit4] 2> 1024258 T5200 oasl.LogWatcher.createWatcher SLF4J impl is org.slf4j.impl.Log4jLoggerFactory
[junit4] 2> 1024258 T5200 oasl.LogWatcher.newRegisteredLogWatcher Registering Log Listener [Log4j (org.slf4j.impl.Log4jLoggerFactory)]
[junit4] 2> 1024258 T5200 oasc.CoreContainer.load Node Name: 127.0.0.1
[junit4] 2> 1024258 T5200 oasc.ZkContainer.initZooKeeper Zookeeper client=127.0.0.1:43356/solr
[junit4] 2> 1024259 T5200 oasc.ZkController.checkChrootPath zkHost includes chroot
[junit4] 2> 1025272 T5200 n:127.0.0.1:52852_nobc%2Fpn oasc.ZkController.createEphemeralLiveNode Register node as live in ZooKeeper:/live_nodes/127.0.0.1:52852_nobc%2Fpn
[junit4] 2> 1025276 T5200 n:127.0.0.1:52852_nobc%2Fpn oasc.Overseer.close Overseer (id=null) closing
[junit4] 2> 1025277 T5200 n:127.0.0.1:52852_nobc%2Fpn oasc.CoreContainer.initializeAuthenticationPlugin No authentication plugin used.
[junit4] 2> 1025277 T5200 n:127.0.0.1:52852_nobc%2Fpn oasc.CoreContainer.intializeAuthorizationPlugin Security conf doesn't exist. Skipping setup for authorization module.
[junit4] 2> 1025278 T5200 n:127.0.0.1:52852_nobc%2Fpn oasc.CorePropertiesLocator.discover Looking for core definitions underneath /x1/jenkins/jenkins-slave/workspace/Lucene-Solr-NightlyTests-5.2/solr/build/solr-core/test/J1/../../../../../../../../../../x1/jenkins/jenkins-slave/workspace/Lucene-Solr-NightlyTests-5.2/solr/build/solr-core/test/J1/temp/solr.cloud.CollectionsAPIDistributedZkTest_436F3A4DF90D4A39-001/shard-2-001/cores
[junit4] 2> 1025279 T5200 n:127.0.0.1:52852_nobc%2Fpn oasc.CoreDescriptor.<init> CORE DESCRIPTOR: {collection=collection1, coreNodeName=, name=collection1, loadOnStartup=true, shard=, instanceDir=/x1/jenkins/jenkins-slave/workspace/Lucene-Solr-NightlyTests-5.2/solr/build/solr-core/test/J1/../../../../../../../../../../x1/jenkins/jenkins-slave/workspace/Lucene-Solr-NightlyTests-5.2/solr/build/solr-core/test/J1/temp/solr.cloud.CollectionsAPIDistributedZkTest_436F3A4DF90D4A39-001/shard-2-001/cores/collection1, transient=false, schema=schema.xml, absoluteInstDir=/x1/jenkins/jenkins-slave/workspace/Lucene-Solr-NightlyTests-5.2/solr/build/solr-core/test/J1/../../../../../../../../../../x1/jenkins/jenkins-slave/workspace/Lucene-Solr-NightlyTests-5.2/solr/build/solr-core/test/J1/temp/solr.cloud.CollectionsAPIDistributedZkTest_436F3A4DF90D4A39-001/shard-2-001/cores/collection1/, config=solrconfig.xml, dataDir=data/}
[junit4] 2> 1025280 T5200 n:127.0.0.1:52852_nobc%2Fpn oasc.CorePropertiesLocator.discoverUnder Found core collection1 in /x1/jenkins/jenkins-slave/workspace/Lucene-Solr-NightlyTests-5.2/solr/build/solr-core/test/J1/../../../../../../../../../../x1/jenkins/jenkins-slave/workspace/Lucene-Solr-NightlyTests-5.2/solr/build/solr-core/test/J1/temp/solr.cloud.CollectionsAPIDistributedZkTest_436F3A4DF90D4A39-001/shard-2-001/cores/collection1/
[junit4] 2> 1025280 T5200 n:127.0.0.1:52852_nobc%2Fpn oasc.CorePropertiesLocator.discover Found 1 core definitions
[junit4] 2> 1025281 T5285 n:127.0.0.1:52852_nobc%2Fpn c:collection1 x:collection1 oasc.ZkController.publish publishing core=collection1 state=down collection=collection1
[junit4] 2> 1025281 T5285 n:127.0.0.1:52852_nobc%2Fpn c:collection1 x:collection1 oasc.ZkController.publish numShards not found on descriptor - reading it from system property
[junit4] 2> 1025282 T5234 n:127.0.0.1:34468_nobc%2Fpn oasc.DistributedQueue$LatchWatcher.process NodeChildrenChanged fired on path /overseer/queue state SyncConnected
[junit4] 2> 1025282 T5285 n:127.0.0.1:52852_nobc%2Fpn oasc.ZkController.waitForCoreNodeName look for our core node name
[junit4] 2> 1025283 T5235 n:127.0.0.1:34468_nobc%2Fpn oasc.Overseer$ClusterStateUpdater.run processMessage: queueSize: 1, message = {
[junit4] 2> "operation":"state",
[junit4] 2> "node_name":"127.0.0.1:52852_nobc%2Fpn",
[junit4] 2> "roles":null,
[junit4] 2> "core":"collection1",
[junit4] 2> "shard":null,
[junit4] 2> "state":"down",
[junit4] 2> "numShards":"2",
[junit4] 2> "collection":"collection1",
[junit4] 2> "base_url":"http://127.0.0.1:52852/nobc/pn"} current state version: 6
[junit4] 2> 1025283 T5235 n:127.0.0.1:34468_nobc%2Fpn oasco.ReplicaMutator.updateState Update state numShards=2 message={
[junit4] 2> "operation":"state",
[junit4] 2> "node_name":"127.0.0.1:52852_nobc%2Fpn",
[junit4] 2> "roles":null,
[junit4] 2> "core":"collection1",
[junit4] 2> "shard":null,
[junit4] 2> "state":"down",
[junit4] 2> "numShards":"2",
[junit4] 2> "collection":"collection1",
[junit4] 2> "base_url":"http://127.0.0.1:52852/nobc/pn"}
[junit4] 2> 1025284 T5235 n:127.0.0.1:34468_nobc%2Fpn oasco.ReplicaMutator.updateState Collection already exists with numShards=2
[junit4] 2> 1025284 T5235 n:127.0.0.1:34468_nobc%2Fpn oasco.ReplicaMutator.updateState Assigning new node to shard shard=shard1
[junit4] 2> 1026283 T5285 n:127.0.0.1:52852_nobc%2Fpn oasc.ZkController.waitForShardId waiting to find shard id in clusterstate for collection1
[junit4] 2> 1026283 T5285 n:127.0.0.1:52852_nobc%2Fpn oasc.ZkController.createCollectionZkNode Check for collection zkNode:collection1
[junit4] 2> 1026284 T5285 n:127.0.0.1:52852_nobc%2Fpn oasc.ZkController.createCollectionZkNode Collection zkNode exists
[junit4] 2> 1026284 T5285 n:127.0.0.1:52852_nobc%2Fpn oasc.SolrResourceLoader.<init> new SolrResourceLoader for directory: '/x1/jenkins/jenkins-slave/workspace/Lucene-Solr-NightlyTests-5.2/solr/build/solr-core/test/J1/../../../../../../../../../../x1/jenkins/jenkins-slave/workspace/Lucene-Solr-NightlyTests-5.2/solr/build/solr-core/test/J1/temp/solr.cloud.CollectionsAPIDistributedZkTest_436F3A4DF90D4A39-001/shard-2-001/cores/collection1/'
[junit4] 2> 1026298 T5285 n:127.0.0.1:52852_nobc%2Fpn oasc.Config.<init> loaded config solrconfig.xml with version 0
[junit4] 2> 1026303 T5285 n:127.0.0.1:52852_nobc%2Fpn oasc.SolrConfig.refreshRequestParams current version of requestparams : -1
[junit4] 2> 1026315 T5285 n:127.0.0.1:52852_nobc%2Fpn oasc.SolrConfig.<init> Using Lucene MatchVersion: 5.2.1
[junit4] 2> 1026341 T5285 n:127.0.0.1:52852_nobc%2Fpn oasc.SolrConfig.<init> Loaded SolrConfig: solrconfig.xml
[junit4] 2> 1026342 T5285 n:127.0.0.1:52852_nobc%2Fpn oass.IndexSchema.readSchema Reading Solr Schema from /configs/conf1/schema.xml
[junit4] 2> 1026348 T5285 n:127.0.0.1:52852_nobc%2Fpn oass.IndexSchema.readSchema [collection1] Schema name=test
[junit4] 2> 1026564 T5285 n:127.0.0.1:52852_nobc%2Fpn oass.OpenExchangeRatesOrgProvider.init Initialized with rates=open-exchange-rates.json, refreshInterval=1440.
[junit4] 2> 1026573 T5285 n:127.0.0.1:52852_nobc%2Fpn oass.IndexSchema.readSchema default search field in schema is text
[junit4] 2> 1026574 T5285 n:127.0.0.1:52852_nobc%2Fpn oass.IndexSchema.readSchema unique key field: id
[junit4] 2> 1026583 T5285 n:127.0.0.1:52852_nobc%2Fpn oass.FileExchangeRateProvider.reload Reloading exchange rates from file currency.xml
[junit4] 2> 1026589 T5285 n:127.0.0.1:52852_nobc%2Fpn oass.FileExchangeRateProvider.reload Reloading exchange rates from file currency.xml
[junit4] 2> 1026591 T5285 n:127.0.0.1:52852_nobc%2Fpn oass.OpenExchangeRatesOrgProvider.reload Reloading exchange rates from open-exchange-rates.json
[junit4] 2> 1026592 T5285 n:127.0.0.1:52852_nobc%2Fpn oass.OpenExchangeRatesOrgProvider$OpenExchangeRates.<init> WARN Unknown key IMPORTANT NOTE
[junit4] 2> 1026592 T5285 n:127.0.0.1:52852_nobc%2Fpn oass.OpenExchangeRatesOrgProvider$OpenExchangeRates.<init> WARN Expected key, got STRING
[junit4] 2> 1026593 T5285 n:127.0.0.1:52852_nobc%2Fpn oass.OpenExchangeRatesOrgProvider.reload Reloading exchange rates from open-exchange-rates.json
[junit4] 2> 1026593 T5285 n:127.0.0.1:52852_nobc%2Fpn oass.OpenExchangeRatesOrgProvider$OpenExchangeRates.<init> WARN Unknown key IMPORTANT NOTE
[junit4] 2> 1026593 T5285 n:127.0.0.1:52852_nobc%2Fpn oass.OpenExchangeRatesOrgProvider$OpenExchangeRates.<init> WARN Expected key, got STRING
[junit4] 2> 1026594 T5285 n:127.0.0.1:52852_nobc%2Fpn oasc.CoreContainer.create Creating SolrCore 'collection1' using configuration from collection collection1
[junit4] 2> 1026594 T5285 n:127.0.0.1:52852_nobc%2Fpn x:collection1 oasc.SolrCore.initDirectoryFactory org.apache.solr.core.MockDirectoryFactory
[junit4] 2> 1026594 T5285 n:127.0.0.1:52852_nobc%2Fpn x:collection1 oasc.SolrCore.<init> [[collection1] ] Opening new SolrCore at [/x1/jenkins/jenkins-slave/workspace/Lucene-Solr-NightlyTests-5.2/solr/build/solr-core/test/J1/../../../../../../../../../../x1/jenkins/jenkins-slave/workspace/Lucene-Solr-NightlyTests-5.2/solr/build/solr-core/test/J1/temp/solr.cloud.CollectionsAPIDistributedZkTest_436F3A4DF90D4A39-001/shard-2-001/cores/collection1/], dataDir=[null]
[junit4] 2> 1026594 T5285 n:127.0.0.1:52852_nobc%2Fpn x:collection1 oasc.JmxMonitoredMap.<init> JMX monitoring is enabled. Adding Solr mbeans to JMX Server: com.sun.jmx.mbeanserver.JmxMBeanServer@fe2cdb4
[junit4] 2> 1026595 T5285 n:127.0.0.1:52852_nobc%2Fpn x:collection1 oasc.CachingDirectoryFactory.get return new directory for /x1/jenkins/jenkins-slave/workspace/Lucene-Solr-NightlyTests-5.2/solr/build/solr-core/test/J1/../../../../../../../../../../x1/jenkins/jenkins-slave/workspace/Lucene-Solr-NightlyTests-5.2/solr/build/solr-core/test/J1/temp/solr.cloud.CollectionsAPIDistributedZkTest_436F3A4DF90D4A39-001/shard-2-001/cores/collection1/data
[junit4] 2> 1026595 T5285 n:127.0.0.1:52852_nobc%2Fpn x:collection1 oasc.SolrCore.getNewIndexDir New index directory detected: old=null new=/x1/jenkins/jenkins-slave/workspace/Lucene-Solr-NightlyTests-5.2/solr/build/solr-core/test/J1/../../../../../../../../../../x1/jenkins/jenkins-slave/workspace/Lucene-Solr-NightlyTests-5.2/solr/build/solr-core/test/J1/temp/solr.cloud.CollectionsAPIDistributedZkTest_436F3A4DF90D4A39-001/shard-2-001/cores/collection1/data/index/
[junit4] 2> 1026595 T5285 n:127.0.0.1:52852_nobc%2Fpn x:collection1 oasc.SolrCore.initIndex WARN [collection1] Solr index directory '/x1/jenkins/jenkins-slave/workspace/Lucene-Solr-NightlyTests-5.2/solr/build/solr-core/test/J1/../../../../../../../../../../x1/jenkins/jenkins-slave/workspace/Lucene-Solr-NightlyTests-5.2/solr/build/solr-core/test/J1/temp/solr.cloud.CollectionsAPIDistributedZkTest_436F3A4DF90D4A39-001/shard-2-001/cores/collection1/data/index' doesn't exist. Creating new index...
[junit4] 2> 1026596 T5285 n:127.0.0.1:52852_nobc%2Fpn x:collection1 oasc.CachingDirectoryFactory.get return new directory for /x1/jenkins/jenkins-slave/workspace/Lucene-Solr-NightlyTests-5.2/solr/build/solr-core/test/J1/../../../../../../../../../../x1/jenkins/jenkins-slave/workspace/Lucene-Solr-NightlyTests-5.2/solr/build/solr-core/test/J1/temp/solr.cloud.CollectionsAPIDistributedZkTest_436F3A4DF90D4A39-001/shard-2-001/cores/collection1/data/index
[junit4] 2> 1026596 T5285 n:127.0.0.1:52852_nobc%2Fpn x:collection1 oasu.RandomMergePolicy.<init> RandomMergePolicy wrapping class org.apache.lucene.index.LogByteSizeMergePolicy: [LogByteSizeMergePolicy: minMergeSize=1677721, mergeFactor=18, maxMergeSize=2147483648, maxMergeSizeForForcedMerge=9223372036854775807, calibrateSizeByDeletes=true, maxMergeDocs=2147483647, maxCFSSegmentSizeMB=8.796093022207999E12, noCFSRatio=1.0]
[junit4] 2> 1026600 T5285 n:127.0.0.1:52852_nobc%2Fpn x:collection1 oasc.SolrDeletionPolicy.onCommit SolrDeletionPolicy.onCommit: commits: num=1
[junit4] 2> commit{dir=MockDirectoryWrapper(SimpleFSDirectory@/x1/jenkins/jenkins-slave/workspace/Lucene-Solr-NightlyTests-5.2/solr/build/solr-core/test/J1/temp/solr.cloud.CollectionsAPIDistributedZkTest_436F3A4DF90D4A39-001/index-SimpleFSDirectory-003 lockFactory=org.apache.lucene.store.NativeFSLockFactory@302b3e2e),segFN=segments_1,generation=1}
[junit4] 2> 1026600 T5285 n:127.0.0.1:52852_nobc%2Fpn x:collection1 oasc.SolrDeletionPolicy.updateCommits newest commit generation = 1
[junit4] 2> 1026605 T5285 n:127.0.0.1:52852_nobc%2Fpn x:collection1 oasup.UpdateRequestProcessorChain.init creating updateRequestProcessorChain "nodistrib"
[junit4] 2> 1026606 T5285 n:127.0.0.1:52852_nobc%2Fpn x:collection1 oasup.UpdateRequestProcessorChain.init creating updateRequestProcessorChain "dedupe"
[junit4] 2> 1026606 T5285 n:127.0.0.1:52852_nobc%2Fpn x:collection1 oasup.UpdateRequestProcessorChain.init inserting DistributedUpdateProcessorFactory into updateRequestProcessorChain "dedupe"
[junit4] 2> 1026606 T5285 n:127.0.0.1:52852_nobc%2Fpn x:collection1 oasup.UpdateRequestProcessorChain.init creating updateRequestProcessorChain "stored_sig"
[junit4] 2> 1026606 T5285 n:127.0.0.1:52852_nobc%2Fpn x:collection1 oasup.UpdateRequestProcessorChain.init inserting DistributedUpdateProcessorFactory into updateRequestProcessorChain "stored_sig"
[junit4] 2> 1026606 T5285 n:127.0.0.1:52852_nobc%2Fpn x:collection1 oasup.UpdateRequestProcessorChain.init creating updateRequestProcessorChain "distrib-dup-test-chain-explicit"
[junit4] 2> 1026607 T5285 n:127.0.0.1:52852_nobc%2Fpn x:collection1 oasup.UpdateRequestProcessorChain.init creating updateRequestProcessorChain "distrib-dup-test-chain-implicit"
[junit4] 2> 1026607 T5285 n:127.0.0.1:52852_nobc%2Fpn x:collection1 oasup.UpdateRequestProcessorChain.init inserting DistributedUpdateProcessorFactory into updateRequestProcessorChain "distrib-dup-test-chain-implicit"
[junit4] 2> 1026607 T5285 n:127.0.0.1:52852_nobc%2Fpn x:collection1 oasc.SolrCore.loadUpdateProcessorChains no updateRequestProcessorChain defined as default, creating implicit default
[junit4] 2> 1026610 T5285 n:127.0.0.1:52852_nobc%2Fpn x:collection1 oashl.XMLLoader.init xsltCacheLifetimeSeconds=60
[junit4] 2> 1026611 T5285 n:127.0.0.1:52852_nobc%2Fpn x:collection1 oashl.XMLLoader.init xsltCacheLifetimeSeconds=60
[junit4] 2> 1026613 T5285 n:127.0.0.1:52852_nobc%2Fpn x:collection1 oashl.XMLLoader.init xsltCacheLifetimeSeconds=60
[junit4] 2> 1026614 T5285 n:127.0.0.1:52852_nobc%2Fpn x:collection1 oashl.XMLLoader.init xsltCacheLifetimeSeconds=60
[junit4] 2> 1026626 T5285 n:127.0.0.1:52852_nobc%2Fpn x:collection1 oasc.RequestHandlers.initHandlersFromConfig Registered paths: /admin/luke,/schema,/admin/ping,/admin/plugins,/update/json,/admin/properties,/update,/replication,/admin/file,/config,/update/csv,/admin/mbeans,/admin/segments,standard,/admin/logging,/update/json/docs,/admin/system,/get,/admin/threads
[junit4] 2> 1026628 T5285 n:127.0.0.1:52852_nobc%2Fpn x:collection1 oasc.SolrCore.initStatsCache Using default statsCache cache: org.apache.solr.search.stats.LocalStatsCache
[junit4] 2> 1026641 T5285 n:127.0.0.1:52852_nobc%2Fpn x:collection1 oasu.UpdateHandler.<init> Using UpdateLog implementation: org.apache.solr.update.UpdateLog
[junit4] 2> 1026642 T5285 n:127.0.0.1:52852_nobc%2Fpn x:collection1 oasu.UpdateLog.init Initializing UpdateLog: dataDir= defaultSyncLevel=FLUSH nu
[...truncated too long message...]
utedZkTest$1CollectionThread.run(CollectionsAPIDistributedZkTest.java:887)
[junit4] > Caused by: org.apache.solr.client.solrj.SolrServerException: No live SolrServers available to handle this request:[http://127.0.0.1:55426/nobc/pn, http://127.0.0.1:41294/nobc/pn, http://127.0.0.1:52852/nobc/pn, http://127.0.0.1:34468/nobc/pn, http://127.0.0.1:60137/nobc/pn]
[junit4] > at org.apache.solr.client.solrj.impl.LBHttpSolrClient.request(LBHttpSolrClient.java:355)
[junit4] > at org.apache.solr.client.solrj.impl.CloudSolrClient.sendRequest(CloudSolrClient.java:1086)
[junit4] > at org.apache.solr.client.solrj.impl.CloudSolrClient.requestWithRetryOnStaleState(CloudSolrClient.java:856)
[junit4] > at org.apache.solr.client.solrj.impl.CloudSolrClient.request(CloudSolrClient.java:799)
[junit4] > at org.apache.solr.client.solrj.SolrClient.request(SolrClient.java:1220)
[junit4] > at org.apache.solr.cloud.AbstractFullDistribZkTestBase.createCollection(AbstractFullDistribZkTestBase.java:1621)
[junit4] > at org.apache.solr.cloud.AbstractFullDistribZkTestBase.createCollection(AbstractFullDistribZkTestBase.java:1642)
[junit4] > at org.apache.solr.cloud.CollectionsAPIDistributedZkTest$1CollectionThread.run(CollectionsAPIDistributedZkTest.java:877)
[junit4] > Caused by: org.apache.solr.client.solrj.SolrServerException: Timeout occured while waiting response from server at: http://127.0.0.1:52852/nobc/pn
[junit4] > at org.apache.solr.client.solrj.impl.HttpSolrClient.executeMethod(HttpSolrClient.java:570)
[junit4] > at org.apache.solr.client.solrj.impl.HttpSolrClient.request(HttpSolrClient.java:235)
[junit4] > at org.apache.solr.client.solrj.impl.HttpSolrClient.request(HttpSolrClient.java:227)
[junit4] > at org.apache.solr.client.solrj.impl.LBHttpSolrClient.doRequest(LBHttpSolrClient.java:376)
[junit4] > at org.apache.solr.client.solrj.impl.LBHttpSolrClient.request(LBHttpSolrClient.java:328)
[junit4] > ... 7 more
[junit4] > Caused by: java.net.SocketTimeoutException: Read timed out
[junit4] > at java.net.SocketInputStream.socketRead0(Native Method)
[junit4] > at java.net.SocketInputStream.read(SocketInputStream.java:152)
[junit4] > at java.net.SocketInputStream.read(SocketInputStream.java:122)
[junit4] > at org.apache.http.impl.io.AbstractSessionInputBuffer.fillBuffer(AbstractSessionInputBuffer.java:160)
[junit4] > at org.apache.http.impl.io.SocketInputBuffer.fillBuffer(SocketInputBuffer.java:84)
[junit4] > at org.apache.http.impl.io.AbstractSessionInputBuffer.readLine(AbstractSessionInputBuffer.java:273)
[junit4] > at org.apache.http.impl.conn.DefaultHttpResponseParser.parseHead(DefaultHttpResponseParser.java:140)
[junit4] > at org.apache.http.impl.conn.DefaultHttpResponseParser.parseHead(DefaultHttpResponseParser.java:57)
[junit4] > at org.apache.http.impl.io.AbstractMessageParser.parse(AbstractMessageParser.java:261)
[junit4] > at org.apache.http.impl.AbstractHttpClientConnection.receiveResponseHeader(AbstractHttpClientConnection.java:283)
[junit4] > at org.apache.http.impl.conn.DefaultClientConnection.receiveResponseHeader(DefaultClientConnection.java:251)
[junit4] > at org.apache.http.impl.conn.ManagedClientConnectionImpl.receiveResponseHeader(ManagedClientConnectionImpl.java:197)
[junit4] > at org.apache.http.protocol.HttpRequestExecutor.doReceiveResponse(HttpRequestExecutor.java:272)
[junit4] > at org.apache.http.protocol.HttpRequestExecutor.execute(HttpRequestExecutor.java:124)
[junit4] > at org.apache.http.impl.client.DefaultRequestDirector.tryExecute(DefaultRequestDirector.java:685)
[junit4] > at org.apache.http.impl.client.DefaultRequestDirector.execute(DefaultRequestDirector.java:487)
[junit4] > at org.apache.http.impl.client.AbstractHttpClient.doExecute(AbstractHttpClient.java:882)
[junit4] > at org.apache.http.impl.client.CloseableHttpClient.execute(CloseableHttpClient.java:82)
[junit4] > at org.apache.http.impl.client.CloseableHttpClient.execute(CloseableHttpClient.java:107)
[junit4] > at org.apache.http.impl.client.CloseableHttpClient.execute(CloseableHttpClient.java:55)
[junit4] > at org.apache.solr.client.solrj.impl.HttpSolrClient.executeMethod(HttpSolrClient.java:466)
[junit4] > ... 11 more
[junit4] 2> 1996782 T5200 c:collection1 s:shard1 x:collection1 oas.SolrTestCaseJ4.deleteCore ###deleteCore
[junit4] 2> NOTE: leaving temporary files on disk at: /x1/jenkins/jenkins-slave/workspace/Lucene-Solr-NightlyTests-5.2/solr/build/solr-core/test/J1/temp/solr.cloud.CollectionsAPIDistributedZkTest_436F3A4DF90D4A39-001
[junit4] 2> 977576 T5199 ccr.ThreadLeakControl.checkThreadLeaks WARNING Will linger awaiting termination of 1 leaked thread(s).
[junit4] 2> NOTE: test params are: codec=Asserting(Lucene50): {timestamp=TestBloomFilteredLucenePostings(BloomFilteringPostingsFormat(Lucene50(blocksize=128))), _version_=TestBloomFilteredLucenePostings(BloomFilteringPostingsFormat(Lucene50(blocksize=128))), id=PostingsFormat(name=MockRandom), a_t=TestBloomFilteredLucenePostings(BloomFilteringPostingsFormat(Lucene50(blocksize=128))), range_facet_l=TestBloomFilteredLucenePostings(BloomFilteringPostingsFormat(Lucene50(blocksize=128))), text=FST50, other_tl1=TestBloomFilteredLucenePostings(BloomFilteringPostingsFormat(Lucene50(blocksize=128))), intDefault=TestBloomFilteredLucenePostings(BloomFilteringPostingsFormat(Lucene50(blocksize=128))), a_i1=TestBloomFilteredLucenePostings(BloomFilteringPostingsFormat(Lucene50(blocksize=128))), range_facet_l_dv=PostingsFormat(name=MockRandom), range_facet_i_dv=TestBloomFilteredLucenePostings(BloomFilteringPostingsFormat(Lucene50(blocksize=128))), multiDefault=PostingsFormat(name=Asserting)}, docValues:{timestamp=DocValuesFormat(name=Asserting), range_facet_i_dv=DocValuesFormat(name=Asserting), range_facet_l_dv=DocValuesFormat(name=Memory)}, sim=RandomSimilarityProvider(queryNorm=false,coord=crazy): {}, locale=nl, timezone=America/North_Dakota/Beulah
[junit4] 2> NOTE: Linux 3.13.0-52-generic amd64/Oracle Corporation 1.7.0_72 (64-bit)/cpus=4,threads=1,free=52456984,total=522715136
[junit4] 2> NOTE: All tests run in this JVM: [TestComponentsName, TestCoreContainer, MultiThreadedOCPTest, SimpleMLTQParserTest, TestDynamicFieldCollectionResource, DocumentAnalysisRequestHandlerTest, TestSearchPerf, ShowFileRequestHandlerTest, TestFieldTypeCollectionResource, SpellPossibilityIteratorTest, TestDynamicLoading, TestElisionMultitermQuery, CacheHeaderTest, TestSolrQueryParserResource, UpdateParamsTest, TestValueSourceCache, NoCacheHeaderTest, TestUniqueKeyFieldResource, TestCharFilters, TestIntervalFaceting, CursorMarkTest, HdfsLockFactoryTest, TestStressVersions, TestHashQParserPlugin, SuggesterTSTTest, TestAtomicUpdateErrorCases, SolrCloudExampleTest, TestCollationFieldDocValues, TestMiniSolrCloudClusterSSL, EchoParamsTest, TestPivotHelperCode, TestHashPartitioner, TestPHPSerializedResponseWriter, TestShardHandlerFactory, TestOmitPositions, DocumentBuilderTest, JSONWriterTest, TestAnalyzedSuggestions, AsyncMigrateRouteKeyTest, DistributedMLTComponentTest, ZkCLITest, StressHdfsTest, TestNRTOpen, WordBreakSolrSpellCheckerTest, TestSolr4Spatial2, ConvertedLegacyTest, TestManagedResource, SolrTestCaseJ4Test, TestStandardQParsers, TestSchemaVersionResource, TestLMDirichletSimilarityFactory, AlternateDirectoryTest, PreAnalyzedFieldTest, DistanceFunctionTest, TriLevelCompositeIdRoutingTest, TestRequestStatusCollectionAPI, RAMDirectoryFactoryTest, ResourceLoaderTest, ExitableDirectoryReaderTest, DistribDocExpirationUpdateProcessorTest, DistributedFacetPivotLargeTest, TestBlobHandler, HdfsRecoveryZkTest, TestJettySolrRunner, ActionThrottleTest, TestLMJelinekMercerSimilarityFactory, DateRangeFieldTest, SolrPluginUtilsTest, TestLRUCache, SpatialFilterTest, StatelessScriptUpdateProcessorFactoryTest, LukeRequestHandlerTest, ChaosMonkeySafeLeaderTest, TestCloudInspectUtil, TestFuzzyAnalyzedSuggestions, TestRemoveLastDynamicCopyField, ResponseHeaderTest, TestClassNameShortening, TestWriterPerf, TestSchemaResource, CollectionsAPIAsyncDistributedZkTest, CollectionsAPIDistributedZkTest]
[junit4] Completed [259/498] on J1 in 978.10s, 1 test, 1 error <<< FAILURES!
[...truncated 764 lines...]
BUILD FAILED
/x1/jenkins/jenkins-slave/workspace/Lucene-Solr-NightlyTests-5.2/build.xml:543: The following error occurred while executing this line:
/x1/jenkins/jenkins-slave/workspace/Lucene-Solr-NightlyTests-5.2/build.xml:484: The following error occurred while executing this line:
/x1/jenkins/jenkins-slave/workspace/Lucene-Solr-NightlyTests-5.2/build.xml:61: The following error occurred while executing this line:
/x1/jenkins/jenkins-slave/workspace/Lucene-Solr-NightlyTests-5.2/extra-targets.xml:39: The following error occurred while executing this line:
/x1/jenkins/jenkins-slave/workspace/Lucene-Solr-NightlyTests-5.2/solr/build.xml:229: The following error occurred while executing this line:
/x1/jenkins/jenkins-slave/workspace/Lucene-Solr-NightlyTests-5.2/solr/common-build.xml:511: The following error occurred while executing this line:
/x1/jenkins/jenkins-slave/workspace/Lucene-Solr-NightlyTests-5.2/lucene/common-build.xml:1436: The following error occurred while executing this line:
/x1/jenkins/jenkins-slave/workspace/Lucene-Solr-NightlyTests-5.2/lucene/common-build.xml:991: There were test failures: 498 suites, 1976 tests, 1 error, 52 ignored (10 assumptions)
Total time: 172 minutes 32 seconds
Build step 'Invoke Ant' marked build as failure
Archiving artifacts
Sending artifact delta relative to Lucene-Solr-NightlyTests-5.2 #3
Archived 4 artifacts
Archive block size is 32768
Received 0 blocks and 899930449 bytes
Compression is 0.0%
Took 2 min 34 sec
Recording test results
Email was triggered for: Failure
Sending email for trigger: Failure