You are viewing a plain text version of this content. The canonical link for it is here.
Posted to dev@lucene.apache.org by Apache Jenkins Server <je...@builds.apache.org> on 2019/06/06 23:16:26 UTC
[JENKINS] Lucene-Solr-BadApples-Tests-master - Build # 378 - Still
Failing
Build: https://builds.apache.org/job/Lucene-Solr-BadApples-Tests-master/378/
All tests passed
Build Log:
[...truncated 64157 lines...]
-ecj-javadoc-lint-tests:
[mkdir] Created dir: /tmp/ecj1005466702
[ecj-lint] Compiling 48 source files to /tmp/ecj1005466702
[ecj-lint] invalid Class-Path header in manifest of jar file: /x1/jenkins/.ivy2/cache/org.restlet.jee/org.restlet/jars/org.restlet-2.3.0.jar
[ecj-lint] invalid Class-Path header in manifest of jar file: /x1/jenkins/.ivy2/cache/org.restlet.jee/org.restlet.ext.servlet/jars/org.restlet.ext.servlet-2.3.0.jar
[ecj-lint] ----------
[ecj-lint] 1. ERROR in /x1/jenkins/jenkins-slave/workspace/Lucene-Solr-BadApples-Tests-master/solr/contrib/dataimporthandler/src/test/org/apache/solr/handler/dataimport/MockInitialContextFactory.java (at line 23)
[ecj-lint] import javax.naming.NamingException;
[ecj-lint] ^^^^^^^^^^^^^^^^^^^^^^^^^^^^
[ecj-lint] The type javax.naming.NamingException is not accessible
[ecj-lint] ----------
[ecj-lint] 2. ERROR in /x1/jenkins/jenkins-slave/workspace/Lucene-Solr-BadApples-Tests-master/solr/contrib/dataimporthandler/src/test/org/apache/solr/handler/dataimport/MockInitialContextFactory.java (at line 28)
[ecj-lint] public class MockInitialContextFactory implements InitialContextFactory {
[ecj-lint] ^^^^^^^^^^^^^^^^^^^^^^^^^
[ecj-lint] The type MockInitialContextFactory must implement the inherited abstract method InitialContextFactory.getInitialContext(Hashtable<?,?>)
[ecj-lint] ----------
[ecj-lint] 3. ERROR in /x1/jenkins/jenkins-slave/workspace/Lucene-Solr-BadApples-Tests-master/solr/contrib/dataimporthandler/src/test/org/apache/solr/handler/dataimport/MockInitialContextFactory.java (at line 30)
[ecj-lint] private final javax.naming.Context context;
[ecj-lint] ^^^^^^^^^^^^^^^^^^^^
[ecj-lint] The type javax.naming.Context is not accessible
[ecj-lint] ----------
[ecj-lint] 4. ERROR in /x1/jenkins/jenkins-slave/workspace/Lucene-Solr-BadApples-Tests-master/solr/contrib/dataimporthandler/src/test/org/apache/solr/handler/dataimport/MockInitialContextFactory.java (at line 33)
[ecj-lint] context = mock(javax.naming.Context.class);
[ecj-lint] ^^^^^^^
[ecj-lint] context cannot be resolved to a variable
[ecj-lint] ----------
[ecj-lint] 5. ERROR in /x1/jenkins/jenkins-slave/workspace/Lucene-Solr-BadApples-Tests-master/solr/contrib/dataimporthandler/src/test/org/apache/solr/handler/dataimport/MockInitialContextFactory.java (at line 33)
[ecj-lint] context = mock(javax.naming.Context.class);
[ecj-lint] ^^^^^^^^^^^^^^^^^^^^
[ecj-lint] The type javax.naming.Context is not accessible
[ecj-lint] ----------
[ecj-lint] 6. ERROR in /x1/jenkins/jenkins-slave/workspace/Lucene-Solr-BadApples-Tests-master/solr/contrib/dataimporthandler/src/test/org/apache/solr/handler/dataimport/MockInitialContextFactory.java (at line 36)
[ecj-lint] when(context.lookup(anyString())).thenAnswer(invocation -> objects.get(invocation.getArgument(0)));
[ecj-lint] ^^^^^^^
[ecj-lint] context cannot be resolved
[ecj-lint] ----------
[ecj-lint] 7. ERROR in /x1/jenkins/jenkins-slave/workspace/Lucene-Solr-BadApples-Tests-master/solr/contrib/dataimporthandler/src/test/org/apache/solr/handler/dataimport/MockInitialContextFactory.java (at line 38)
[ecj-lint] } catch (NamingException e) {
[ecj-lint] ^^^^^^^^^^^^^^^
[ecj-lint] NamingException cannot be resolved to a type
[ecj-lint] ----------
[ecj-lint] 8. ERROR in /x1/jenkins/jenkins-slave/workspace/Lucene-Solr-BadApples-Tests-master/solr/contrib/dataimporthandler/src/test/org/apache/solr/handler/dataimport/MockInitialContextFactory.java (at line 45)
[ecj-lint] public javax.naming.Context getInitialContext(Hashtable env) {
[ecj-lint] ^^^^^^^^^^^^^^^^^^^^
[ecj-lint] The type javax.naming.Context is not accessible
[ecj-lint] ----------
[ecj-lint] 9. ERROR in /x1/jenkins/jenkins-slave/workspace/Lucene-Solr-BadApples-Tests-master/solr/contrib/dataimporthandler/src/test/org/apache/solr/handler/dataimport/MockInitialContextFactory.java (at line 46)
[ecj-lint] return context;
[ecj-lint] ^^^^^^^
[ecj-lint] context cannot be resolved to a variable
[ecj-lint] ----------
[ecj-lint] 9 problems (9 errors)
BUILD FAILED
/x1/jenkins/jenkins-slave/workspace/Lucene-Solr-BadApples-Tests-master/build.xml:643: The following error occurred while executing this line:
/x1/jenkins/jenkins-slave/workspace/Lucene-Solr-BadApples-Tests-master/build.xml:101: The following error occurred while executing this line:
/x1/jenkins/jenkins-slave/workspace/Lucene-Solr-BadApples-Tests-master/solr/build.xml:651: The following error occurred while executing this line:
/x1/jenkins/jenkins-slave/workspace/Lucene-Solr-BadApples-Tests-master/solr/common-build.xml:479: The following error occurred while executing this line:
/x1/jenkins/jenkins-slave/workspace/Lucene-Solr-BadApples-Tests-master/lucene/common-build.xml:2015: The following error occurred while executing this line:
/x1/jenkins/jenkins-slave/workspace/Lucene-Solr-BadApples-Tests-master/lucene/common-build.xml:2048: Compile failed; see the compiler error output for details.
Total time: 124 minutes 47 seconds
Build step 'Invoke Ant' marked build as failure
Archiving artifacts
Recording test results
Email was triggered for: Failure - Any
Sending email for trigger: Failure - Any
[JENKINS] Lucene-Solr-BadApples-Tests-master - Build # 379 -
Unstable
Posted by Apache Jenkins Server <je...@builds.apache.org>.
Build: https://builds.apache.org/job/Lucene-Solr-BadApples-Tests-master/379/
1 tests failed.
FAILED: org.apache.solr.cloud.TestCloudConsistency.testOutOfSyncReplicasCannotBecomeLeader
Error Message:
Doc with id=4 not found in http://127.0.0.1:45957/solr/outOfSyncReplicasCannotBecomeLeader-false due to: Path not found: /id; rsp={doc=null}
Stack Trace:
java.lang.AssertionError: Doc with id=4 not found in http://127.0.0.1:45957/solr/outOfSyncReplicasCannotBecomeLeader-false due to: Path not found: /id; rsp={doc=null}
at __randomizedtesting.SeedInfo.seed([35970B71AC514204:4B7C2B616F364D3E]:0)
at org.junit.Assert.fail(Assert.java:88)
at org.junit.Assert.assertTrue(Assert.java:41)
at org.apache.solr.cloud.TestCloudConsistency.assertDocExists(TestCloudConsistency.java:283)
at org.apache.solr.cloud.TestCloudConsistency.assertDocsExistInAllReplicas(TestCloudConsistency.java:267)
at org.apache.solr.cloud.TestCloudConsistency.testOutOfSyncReplicasCannotBecomeLeader(TestCloudConsistency.java:138)
at org.apache.solr.cloud.TestCloudConsistency.testOutOfSyncReplicasCannotBecomeLeader(TestCloudConsistency.java:97)
at java.base/jdk.internal.reflect.NativeMethodAccessorImpl.invoke0(Native Method)
at java.base/jdk.internal.reflect.NativeMethodAccessorImpl.invoke(NativeMethodAccessorImpl.java:62)
at java.base/jdk.internal.reflect.DelegatingMethodAccessorImpl.invoke(DelegatingMethodAccessorImpl.java:43)
at java.base/java.lang.reflect.Method.invoke(Method.java:566)
at com.carrotsearch.randomizedtesting.RandomizedRunner.invoke(RandomizedRunner.java:1750)
at com.carrotsearch.randomizedtesting.RandomizedRunner$8.evaluate(RandomizedRunner.java:938)
at com.carrotsearch.randomizedtesting.RandomizedRunner$9.evaluate(RandomizedRunner.java:974)
at com.carrotsearch.randomizedtesting.RandomizedRunner$10.evaluate(RandomizedRunner.java:988)
at com.carrotsearch.randomizedtesting.rules.SystemPropertiesRestoreRule$1.evaluate(SystemPropertiesRestoreRule.java:57)
at org.apache.lucene.util.TestRuleSetupTeardownChained$1.evaluate(TestRuleSetupTeardownChained.java:49)
at org.apache.lucene.util.AbstractBeforeAfterRule$1.evaluate(AbstractBeforeAfterRule.java:45)
at org.apache.lucene.util.TestRuleThreadAndTestName$1.evaluate(TestRuleThreadAndTestName.java:48)
at org.apache.lucene.util.TestRuleIgnoreAfterMaxFailures$1.evaluate(TestRuleIgnoreAfterMaxFailures.java:64)
at org.apache.lucene.util.TestRuleMarkFailure$1.evaluate(TestRuleMarkFailure.java:47)
at com.carrotsearch.randomizedtesting.rules.StatementAdapter.evaluate(StatementAdapter.java:36)
at com.carrotsearch.randomizedtesting.ThreadLeakControl$StatementRunner.run(ThreadLeakControl.java:368)
at com.carrotsearch.randomizedtesting.ThreadLeakControl.forkTimeoutingTask(ThreadLeakControl.java:817)
at com.carrotsearch.randomizedtesting.ThreadLeakControl$3.evaluate(ThreadLeakControl.java:468)
at com.carrotsearch.randomizedtesting.RandomizedRunner.runSingleTest(RandomizedRunner.java:947)
at com.carrotsearch.randomizedtesting.RandomizedRunner$5.evaluate(RandomizedRunner.java:832)
at com.carrotsearch.randomizedtesting.RandomizedRunner$6.evaluate(RandomizedRunner.java:883)
at com.carrotsearch.randomizedtesting.RandomizedRunner$7.evaluate(RandomizedRunner.java:894)
at com.carrotsearch.randomizedtesting.rules.StatementAdapter.evaluate(StatementAdapter.java:36)
at com.carrotsearch.randomizedtesting.rules.SystemPropertiesRestoreRule$1.evaluate(SystemPropertiesRestoreRule.java:57)
at org.apache.lucene.util.AbstractBeforeAfterRule$1.evaluate(AbstractBeforeAfterRule.java:45)
at com.carrotsearch.randomizedtesting.rules.StatementAdapter.evaluate(StatementAdapter.java:36)
at org.apache.lucene.util.TestRuleStoreClassName$1.evaluate(TestRuleStoreClassName.java:41)
at com.carrotsearch.randomizedtesting.rules.NoShadowingOrOverridesOnMethodsRule$1.evaluate(NoShadowingOrOverridesOnMethodsRule.java:40)
at com.carrotsearch.randomizedtesting.rules.NoShadowingOrOverridesOnMethodsRule$1.evaluate(NoShadowingOrOverridesOnMethodsRule.java:40)
at com.carrotsearch.randomizedtesting.rules.StatementAdapter.evaluate(StatementAdapter.java:36)
at com.carrotsearch.randomizedtesting.rules.StatementAdapter.evaluate(StatementAdapter.java:36)
at org.apache.lucene.util.TestRuleAssertionsRequired$1.evaluate(TestRuleAssertionsRequired.java:53)
at org.apache.lucene.util.TestRuleMarkFailure$1.evaluate(TestRuleMarkFailure.java:47)
at org.apache.lucene.util.TestRuleIgnoreAfterMaxFailures$1.evaluate(TestRuleIgnoreAfterMaxFailures.java:64)
at org.apache.lucene.util.TestRuleIgnoreTestSuites$1.evaluate(TestRuleIgnoreTestSuites.java:54)
at com.carrotsearch.randomizedtesting.rules.StatementAdapter.evaluate(StatementAdapter.java:36)
at com.carrotsearch.randomizedtesting.ThreadLeakControl$StatementRunner.run(ThreadLeakControl.java:368)
at java.base/java.lang.Thread.run(Thread.java:834)
Build Log:
[...truncated 14156 lines...]
[junit4] Suite: org.apache.solr.cloud.TestCloudConsistency
[junit4] 2> Creating dataDir: /x1/jenkins/jenkins-slave/workspace/Lucene-Solr-BadApples-Tests-master/solr/build/solr-core/test/J0/temp/solr.cloud.TestCloudConsistency_35970B71AC514204-001/init-core-data-001
[junit4] 2> 2015297 INFO (TEST-TestCloudConsistency.testOutOfSyncReplicasCannotBecomeLeader-seed#[35970B71AC514204]) [ ] o.a.s.c.MiniSolrCloudCluster Starting cluster of 4 servers in /x1/jenkins/jenkins-slave/workspace/Lucene-Solr-BadApples-Tests-master/solr/build/solr-core/test/J0/temp/solr.cloud.TestCloudConsistency_35970B71AC514204-001/tempDir-001
[junit4] 2> 2015298 INFO (TEST-TestCloudConsistency.testOutOfSyncReplicasCannotBecomeLeader-seed#[35970B71AC514204]) [ ] o.a.s.c.ZkTestServer STARTING ZK TEST SERVER
[junit4] 2> 2015298 INFO (ZkTestServer Run Thread) [ ] o.a.s.c.ZkTestServer client port:0.0.0.0/0.0.0.0:0
[junit4] 2> 2015298 INFO (ZkTestServer Run Thread) [ ] o.a.s.c.ZkTestServer Starting server
[junit4] 2> 2015398 INFO (TEST-TestCloudConsistency.testOutOfSyncReplicasCannotBecomeLeader-seed#[35970B71AC514204]) [ ] o.a.s.c.ZkTestServer start zk server on port:40439
[junit4] 2> 2015398 INFO (TEST-TestCloudConsistency.testOutOfSyncReplicasCannotBecomeLeader-seed#[35970B71AC514204]) [ ] o.a.s.c.ZkTestServer parse host and port list: 127.0.0.1:40439
[junit4] 2> 2015398 INFO (TEST-TestCloudConsistency.testOutOfSyncReplicasCannotBecomeLeader-seed#[35970B71AC514204]) [ ] o.a.s.c.ZkTestServer connecting to 127.0.0.1 40439
[junit4] 2> 2015400 INFO (TEST-TestCloudConsistency.testOutOfSyncReplicasCannotBecomeLeader-seed#[35970B71AC514204]) [ ] o.a.s.c.c.ConnectionManager Waiting for client to connect to ZooKeeper
[junit4] 2> 2015403 INFO (zkConnectionManagerCallback-14352-thread-1) [ ] o.a.s.c.c.ConnectionManager zkClient has connected
[junit4] 2> 2015403 INFO (TEST-TestCloudConsistency.testOutOfSyncReplicasCannotBecomeLeader-seed#[35970B71AC514204]) [ ] o.a.s.c.c.ConnectionManager Client is connected to ZooKeeper
[junit4] 2> 2015410 INFO (TEST-TestCloudConsistency.testOutOfSyncReplicasCannotBecomeLeader-seed#[35970B71AC514204]) [ ] o.a.s.c.c.ConnectionManager Waiting for client to connect to ZooKeeper
[junit4] 2> 2015411 INFO (zkConnectionManagerCallback-14354-thread-1) [ ] o.a.s.c.c.ConnectionManager zkClient has connected
[junit4] 2> 2015411 INFO (TEST-TestCloudConsistency.testOutOfSyncReplicasCannotBecomeLeader-seed#[35970B71AC514204]) [ ] o.a.s.c.c.ConnectionManager Client is connected to ZooKeeper
[junit4] 2> 2015412 INFO (TEST-TestCloudConsistency.testOutOfSyncReplicasCannotBecomeLeader-seed#[35970B71AC514204]) [ ] o.a.s.c.c.ConnectionManager Waiting for client to connect to ZooKeeper
[junit4] 2> 2015413 INFO (zkConnectionManagerCallback-14356-thread-1) [ ] o.a.s.c.c.ConnectionManager zkClient has connected
[junit4] 2> 2015413 INFO (TEST-TestCloudConsistency.testOutOfSyncReplicasCannotBecomeLeader-seed#[35970B71AC514204]) [ ] o.a.s.c.c.ConnectionManager Client is connected to ZooKeeper
[junit4] 2> 2015516 WARN (jetty-launcher-14357-thread-1) [ ] o.e.j.s.AbstractConnector Ignoring deprecated socket close linger time
[junit4] 2> 2015517 INFO (jetty-launcher-14357-thread-1) [ ] o.a.s.c.s.e.JettySolrRunner Start Jetty (original configured port=0)
[junit4] 2> 2015517 INFO (jetty-launcher-14357-thread-1) [ ] o.a.s.c.s.e.JettySolrRunner Trying to start Jetty on port 0 try number 1 ...
[junit4] 2> 2015517 INFO (jetty-launcher-14357-thread-1) [ ] o.e.j.s.Server jetty-9.4.14.v20181114; built: 2018-11-14T21:20:31.478Z; git: c4550056e785fb5665914545889f21dc136ad9e6; jvm 11.0.1+13-LTS
[junit4] 2> 2015518 WARN (jetty-launcher-14357-thread-2) [ ] o.e.j.s.AbstractConnector Ignoring deprecated socket close linger time
[junit4] 2> 2015518 INFO (jetty-launcher-14357-thread-2) [ ] o.a.s.c.s.e.JettySolrRunner Start Jetty (original configured port=0)
[junit4] 2> 2015518 INFO (jetty-launcher-14357-thread-2) [ ] o.a.s.c.s.e.JettySolrRunner Trying to start Jetty on port 0 try number 1 ...
[junit4] 2> 2015518 INFO (jetty-launcher-14357-thread-2) [ ] o.e.j.s.Server jetty-9.4.14.v20181114; built: 2018-11-14T21:20:31.478Z; git: c4550056e785fb5665914545889f21dc136ad9e6; jvm 11.0.1+13-LTS
[junit4] 2> 2015518 WARN (jetty-launcher-14357-thread-3) [ ] o.e.j.s.AbstractConnector Ignoring deprecated socket close linger time
[junit4] 2> 2015518 INFO (jetty-launcher-14357-thread-3) [ ] o.a.s.c.s.e.JettySolrRunner Start Jetty (original configured port=0)
[junit4] 2> 2015518 INFO (jetty-launcher-14357-thread-3) [ ] o.a.s.c.s.e.JettySolrRunner Trying to start Jetty on port 0 try number 1 ...
[junit4] 2> 2015519 INFO (jetty-launcher-14357-thread-3) [ ] o.e.j.s.Server jetty-9.4.14.v20181114; built: 2018-11-14T21:20:31.478Z; git: c4550056e785fb5665914545889f21dc136ad9e6; jvm 11.0.1+13-LTS
[junit4] 2> 2015519 WARN (jetty-launcher-14357-thread-4) [ ] o.e.j.s.AbstractConnector Ignoring deprecated socket close linger time
[junit4] 2> 2015519 INFO (jetty-launcher-14357-thread-4) [ ] o.a.s.c.s.e.JettySolrRunner Start Jetty (original configured port=0)
[junit4] 2> 2015519 INFO (jetty-launcher-14357-thread-4) [ ] o.a.s.c.s.e.JettySolrRunner Trying to start Jetty on port 0 try number 1 ...
[junit4] 2> 2015519 INFO (jetty-launcher-14357-thread-4) [ ] o.e.j.s.Server jetty-9.4.14.v20181114; built: 2018-11-14T21:20:31.478Z; git: c4550056e785fb5665914545889f21dc136ad9e6; jvm 11.0.1+13-LTS
[junit4] 2> 2015520 INFO (jetty-launcher-14357-thread-1) [ ] o.e.j.s.session DefaultSessionIdManager workerName=node0
[junit4] 2> 2015520 INFO (jetty-launcher-14357-thread-1) [ ] o.e.j.s.session No SessionScavenger set, using defaults
[junit4] 2> 2015520 INFO (jetty-launcher-14357-thread-1) [ ] o.e.j.s.session node0 Scavenging every 660000ms
[junit4] 2> 2015520 INFO (jetty-launcher-14357-thread-1) [ ] o.e.j.s.h.ContextHandler Started o.e.j.s.ServletContextHandler@699e7246{/solr,null,AVAILABLE}
[junit4] 2> 2015521 INFO (jetty-launcher-14357-thread-1) [ ] o.e.j.s.AbstractConnector Started ServerConnector@713a27a4{HTTP/1.1,[http/1.1, h2c]}{127.0.0.1:45970}
[junit4] 2> 2015521 INFO (jetty-launcher-14357-thread-1) [ ] o.e.j.s.Server Started @2015572ms
[junit4] 2> 2015521 INFO (jetty-launcher-14357-thread-4) [ ] o.e.j.s.session DefaultSessionIdManager workerName=node0
[junit4] 2> 2015521 INFO (jetty-launcher-14357-thread-4) [ ] o.e.j.s.session No SessionScavenger set, using defaults
[junit4] 2> 2015521 INFO (jetty-launcher-14357-thread-4) [ ] o.e.j.s.session node0 Scavenging every 600000ms
[junit4] 2> 2015521 INFO (jetty-launcher-14357-thread-1) [ ] o.a.s.c.s.e.JettySolrRunner Jetty properties: {hostContext=/solr, hostPort=45970}
[junit4] 2> 2015522 INFO (jetty-launcher-14357-thread-4) [ ] o.e.j.s.h.ContextHandler Started o.e.j.s.ServletContextHandler@ecc167d{/solr,null,AVAILABLE}
[junit4] 2> 2015522 ERROR (jetty-launcher-14357-thread-1) [ ] o.a.s.u.StartupLoggingUtils Missing Java Option solr.log.dir. Logging may be missing or incomplete.
[junit4] 2> 2015522 INFO (jetty-launcher-14357-thread-1) [ ] o.a.s.s.SolrDispatchFilter Using logger factory org.apache.logging.slf4j.Log4jLoggerFactory
[junit4] 2> 2015522 INFO (jetty-launcher-14357-thread-1) [ ] o.a.s.s.SolrDispatchFilter ___ _ Welcome to Apache Solr? version 9.0.0
[junit4] 2> 2015522 INFO (jetty-launcher-14357-thread-1) [ ] o.a.s.s.SolrDispatchFilter / __| ___| |_ _ Starting in cloud mode on port null
[junit4] 2> 2015522 INFO (jetty-launcher-14357-thread-1) [ ] o.a.s.s.SolrDispatchFilter \__ \/ _ \ | '_| Install dir: null
[junit4] 2> 2015522 INFO (jetty-launcher-14357-thread-4) [ ] o.e.j.s.AbstractConnector Started ServerConnector@155a0bcb{HTTP/1.1,[http/1.1, h2c]}{127.0.0.1:44322}
[junit4] 2> 2015522 INFO (jetty-launcher-14357-thread-1) [ ] o.a.s.s.SolrDispatchFilter |___/\___/_|_| Start time: 2019-06-08T05:15:40.554590Z
[junit4] 2> 2015522 INFO (jetty-launcher-14357-thread-4) [ ] o.e.j.s.Server Started @2015573ms
[junit4] 2> 2015522 INFO (jetty-launcher-14357-thread-4) [ ] o.a.s.c.s.e.JettySolrRunner Jetty properties: {hostContext=/solr, hostPort=44322}
[junit4] 2> 2015523 ERROR (jetty-launcher-14357-thread-4) [ ] o.a.s.u.StartupLoggingUtils Missing Java Option solr.log.dir. Logging may be missing or incomplete.
[junit4] 2> 2015523 INFO (jetty-launcher-14357-thread-4) [ ] o.a.s.s.SolrDispatchFilter Using logger factory org.apache.logging.slf4j.Log4jLoggerFactory
[junit4] 2> 2015523 INFO (jetty-launcher-14357-thread-4) [ ] o.a.s.s.SolrDispatchFilter ___ _ Welcome to Apache Solr? version 9.0.0
[junit4] 2> 2015523 INFO (jetty-launcher-14357-thread-4) [ ] o.a.s.s.SolrDispatchFilter / __| ___| |_ _ Starting in cloud mode on port null
[junit4] 2> 2015523 INFO (jetty-launcher-14357-thread-4) [ ] o.a.s.s.SolrDispatchFilter \__ \/ _ \ | '_| Install dir: null
[junit4] 2> 2015523 INFO (jetty-launcher-14357-thread-4) [ ] o.a.s.s.SolrDispatchFilter |___/\___/_|_| Start time: 2019-06-08T05:15:40.555343Z
[junit4] 2> 2015523 INFO (jetty-launcher-14357-thread-2) [ ] o.e.j.s.session DefaultSessionIdManager workerName=node0
[junit4] 2> 2015523 INFO (jetty-launcher-14357-thread-2) [ ] o.e.j.s.session No SessionScavenger set, using defaults
[junit4] 2> 2015523 INFO (jetty-launcher-14357-thread-2) [ ] o.e.j.s.session node0 Scavenging every 600000ms
[junit4] 2> 2015524 INFO (jetty-launcher-14357-thread-2) [ ] o.e.j.s.h.ContextHandler Started o.e.j.s.ServletContextHandler@76849869{/solr,null,AVAILABLE}
[junit4] 2> 2015524 INFO (jetty-launcher-14357-thread-3) [ ] o.e.j.s.session DefaultSessionIdManager workerName=node0
[junit4] 2> 2015524 INFO (jetty-launcher-14357-thread-3) [ ] o.e.j.s.session No SessionScavenger set, using defaults
[junit4] 2> 2015524 INFO (jetty-launcher-14357-thread-3) [ ] o.e.j.s.session node0 Scavenging every 660000ms
[junit4] 2> 2015524 INFO (jetty-launcher-14357-thread-2) [ ] o.e.j.s.AbstractConnector Started ServerConnector@36e55c95{HTTP/1.1,[http/1.1, h2c]}{127.0.0.1:43871}
[junit4] 2> 2015524 INFO (jetty-launcher-14357-thread-2) [ ] o.e.j.s.Server Started @2015575ms
[junit4] 2> 2015524 INFO (jetty-launcher-14357-thread-2) [ ] o.a.s.c.s.e.JettySolrRunner Jetty properties: {hostContext=/solr, hostPort=43871}
[junit4] 2> 2015524 INFO (jetty-launcher-14357-thread-3) [ ] o.e.j.s.h.ContextHandler Started o.e.j.s.ServletContextHandler@65419b2e{/solr,null,AVAILABLE}
[junit4] 2> 2015524 ERROR (jetty-launcher-14357-thread-2) [ ] o.a.s.u.StartupLoggingUtils Missing Java Option solr.log.dir. Logging may be missing or incomplete.
[junit4] 2> 2015524 INFO (jetty-launcher-14357-thread-2) [ ] o.a.s.s.SolrDispatchFilter Using logger factory org.apache.logging.slf4j.Log4jLoggerFactory
[junit4] 2> 2015525 INFO (jetty-launcher-14357-thread-3) [ ] o.e.j.s.AbstractConnector Started ServerConnector@4d71d2d8{HTTP/1.1,[http/1.1, h2c]}{127.0.0.1:34731}
[junit4] 2> 2015525 INFO (jetty-launcher-14357-thread-3) [ ] o.e.j.s.Server Started @2015575ms
[junit4] 2> 2015525 INFO (jetty-launcher-14357-thread-2) [ ] o.a.s.s.SolrDispatchFilter ___ _ Welcome to Apache Solr? version 9.0.0
[junit4] 2> 2015525 INFO (jetty-launcher-14357-thread-3) [ ] o.a.s.c.s.e.JettySolrRunner Jetty properties: {hostContext=/solr, hostPort=34731}
[junit4] 2> 2015525 INFO (jetty-launcher-14357-thread-2) [ ] o.a.s.s.SolrDispatchFilter / __| ___| |_ _ Starting in cloud mode on port null
[junit4] 2> 2015525 INFO (jetty-launcher-14357-thread-2) [ ] o.a.s.s.SolrDispatchFilter \__ \/ _ \ | '_| Install dir: null
[junit4] 2> 2015525 INFO (jetty-launcher-14357-thread-2) [ ] o.a.s.s.SolrDispatchFilter |___/\___/_|_| Start time: 2019-06-08T05:15:40.557188Z
[junit4] 2> 2015525 ERROR (jetty-launcher-14357-thread-3) [ ] o.a.s.u.StartupLoggingUtils Missing Java Option solr.log.dir. Logging may be missing or incomplete.
[junit4] 2> 2015525 INFO (jetty-launcher-14357-thread-3) [ ] o.a.s.s.SolrDispatchFilter Using logger factory org.apache.logging.slf4j.Log4jLoggerFactory
[junit4] 2> 2015525 INFO (jetty-launcher-14357-thread-3) [ ] o.a.s.s.SolrDispatchFilter ___ _ Welcome to Apache Solr? version 9.0.0
[junit4] 2> 2015525 INFO (jetty-launcher-14357-thread-3) [ ] o.a.s.s.SolrDispatchFilter / __| ___| |_ _ Starting in cloud mode on port null
[junit4] 2> 2015525 INFO (jetty-launcher-14357-thread-3) [ ] o.a.s.s.SolrDispatchFilter \__ \/ _ \ | '_| Install dir: null
[junit4] 2> 2015525 INFO (jetty-launcher-14357-thread-3) [ ] o.a.s.s.SolrDispatchFilter |___/\___/_|_| Start time: 2019-06-08T05:15:40.557557Z
[junit4] 2> 2015526 INFO (jetty-launcher-14357-thread-4) [ ] o.a.s.c.c.ConnectionManager Waiting for client to connect to ZooKeeper
[junit4] 2> 2015527 INFO (jetty-launcher-14357-thread-1) [ ] o.a.s.c.c.ConnectionManager Waiting for client to connect to ZooKeeper
[junit4] 2> 2015527 INFO (jetty-launcher-14357-thread-3) [ ] o.a.s.c.c.ConnectionManager Waiting for client to connect to ZooKeeper
[junit4] 2> 2015527 INFO (jetty-launcher-14357-thread-2) [ ] o.a.s.c.c.ConnectionManager Waiting for client to connect to ZooKeeper
[junit4] 2> 2015528 INFO (zkConnectionManagerCallback-14361-thread-1) [ ] o.a.s.c.c.ConnectionManager zkClient has connected
[junit4] 2> 2015528 INFO (jetty-launcher-14357-thread-4) [ ] o.a.s.c.c.ConnectionManager Client is connected to ZooKeeper
[junit4] 2> 2015528 INFO (zkConnectionManagerCallback-14359-thread-1) [ ] o.a.s.c.c.ConnectionManager zkClient has connected
[junit4] 2> 2015529 INFO (jetty-launcher-14357-thread-1) [ ] o.a.s.c.c.ConnectionManager Client is connected to ZooKeeper
[junit4] 2> 2015529 INFO (zkConnectionManagerCallback-14363-thread-1) [ ] o.a.s.c.c.ConnectionManager zkClient has connected
[junit4] 2> 2015529 INFO (jetty-launcher-14357-thread-2) [ ] o.a.s.c.c.ConnectionManager Client is connected to ZooKeeper
[junit4] 2> 2015529 INFO (jetty-launcher-14357-thread-4) [ ] o.a.s.s.SolrDispatchFilter solr.xml found in ZooKeeper. Loading...
[junit4] 2> 2015529 INFO (zkConnectionManagerCallback-14365-thread-1) [ ] o.a.s.c.c.ConnectionManager zkClient has connected
[junit4] 2> 2015529 INFO (jetty-launcher-14357-thread-3) [ ] o.a.s.c.c.ConnectionManager Client is connected to ZooKeeper
[junit4] 2> 2015529 INFO (jetty-launcher-14357-thread-1) [ ] o.a.s.s.SolrDispatchFilter solr.xml found in ZooKeeper. Loading...
[junit4] 2> 2015529 INFO (jetty-launcher-14357-thread-2) [ ] o.a.s.s.SolrDispatchFilter solr.xml found in ZooKeeper. Loading...
[junit4] 2> 2015530 INFO (jetty-launcher-14357-thread-3) [ ] o.a.s.s.SolrDispatchFilter solr.xml found in ZooKeeper. Loading...
[junit4] 2> 2015731 INFO (jetty-launcher-14357-thread-3) [ ] o.a.s.h.c.HttpShardHandlerFactory Host whitelist initialized: WhitelistHostChecker [whitelistHosts=null, whitelistHostCheckingEnabled=true]
[junit4] 2> 2015733 WARN (jetty-launcher-14357-thread-3) [ ] o.e.j.u.s.S.config No Client EndPointIdentificationAlgorithm configured for SslContextFactory@39bb50c0[provider=null,keyStore=null,trustStore=null]
[junit4] 2> 2015735 INFO (jetty-launcher-14357-thread-2) [ ] o.a.s.h.c.HttpShardHandlerFactory Host whitelist initialized: WhitelistHostChecker [whitelistHosts=null, whitelistHostCheckingEnabled=true]
[junit4] 2> 2015736 WARN (jetty-launcher-14357-thread-3) [ ] o.e.j.u.s.S.config No Client EndPointIdentificationAlgorithm configured for SslContextFactory@16b31081[provider=null,keyStore=null,trustStore=null]
[junit4] 2> 2015736 WARN (jetty-launcher-14357-thread-2) [ ] o.e.j.u.s.S.config No Client EndPointIdentificationAlgorithm configured for SslContextFactory@58b91b97[provider=null,keyStore=null,trustStore=null]
[junit4] 2> 2015737 INFO (jetty-launcher-14357-thread-3) [ ] o.a.s.c.ZkContainer Zookeeper client=127.0.0.1:40439/solr
[junit4] 2> 2015738 INFO (jetty-launcher-14357-thread-3) [ ] o.a.s.c.c.ConnectionManager Waiting for client to connect to ZooKeeper
[junit4] 2> 2015739 WARN (jetty-launcher-14357-thread-2) [ ] o.e.j.u.s.S.config No Client EndPointIdentificationAlgorithm configured for SslContextFactory@7ac7c172[provider=null,keyStore=null,trustStore=null]
[junit4] 2> 2015740 INFO (zkConnectionManagerCallback-14375-thread-1) [ ] o.a.s.c.c.ConnectionManager zkClient has connected
[junit4] 2> 2015740 INFO (jetty-launcher-14357-thread-3) [ ] o.a.s.c.c.ConnectionManager Client is connected to ZooKeeper
[junit4] 2> 2015740 INFO (jetty-launcher-14357-thread-2) [ ] o.a.s.c.ZkContainer Zookeeper client=127.0.0.1:40439/solr
[junit4] 2> 2015741 INFO (jetty-launcher-14357-thread-2) [ ] o.a.s.c.c.ConnectionManager Waiting for client to connect to ZooKeeper
[junit4] 2> 2015742 INFO (zkConnectionManagerCallback-14379-thread-1) [ ] o.a.s.c.c.ConnectionManager zkClient has connected
[junit4] 2> 2015743 INFO (jetty-launcher-14357-thread-2) [ ] o.a.s.c.c.ConnectionManager Client is connected to ZooKeeper
[junit4] 2> 2015883 INFO (jetty-launcher-14357-thread-1) [ ] o.a.s.h.c.HttpShardHandlerFactory Host whitelist initialized: WhitelistHostChecker [whitelistHosts=null, whitelistHostCheckingEnabled=true]
[junit4] 2> 2015884 WARN (jetty-launcher-14357-thread-1) [ ] o.e.j.u.s.S.config No Client EndPointIdentificationAlgorithm configured for SslContextFactory@4a732016[provider=null,keyStore=null,trustStore=null]
[junit4] 2> 2015887 WARN (jetty-launcher-14357-thread-1) [ ] o.e.j.u.s.S.config No Client EndPointIdentificationAlgorithm configured for SslContextFactory@3a548ba0[provider=null,keyStore=null,trustStore=null]
[junit4] 2> 2015888 INFO (jetty-launcher-14357-thread-1) [ ] o.a.s.c.ZkContainer Zookeeper client=127.0.0.1:40439/solr
[junit4] 2> 2015890 INFO (jetty-launcher-14357-thread-1) [ ] o.a.s.c.c.ConnectionManager Waiting for client to connect to ZooKeeper
[junit4] 2> 2015890 INFO (zkConnectionManagerCallback-14387-thread-1) [ ] o.a.s.c.c.ConnectionManager zkClient has connected
[junit4] 2> 2015890 INFO (jetty-launcher-14357-thread-1) [ ] o.a.s.c.c.ConnectionManager Client is connected to ZooKeeper
[junit4] 2> 2015951 INFO (jetty-launcher-14357-thread-2) [n:127.0.0.1:43871_solr ] o.a.s.c.c.ConnectionManager Waiting for client to connect to ZooKeeper
[junit4] 2> 2015952 INFO (zkConnectionManagerCallback-14389-thread-1) [ ] o.a.s.c.c.ConnectionManager zkClient has connected
[junit4] 2> 2015952 INFO (jetty-launcher-14357-thread-2) [n:127.0.0.1:43871_solr ] o.a.s.c.c.ConnectionManager Client is connected to ZooKeeper
[junit4] 2> 2015956 INFO (jetty-launcher-14357-thread-4) [ ] o.a.s.h.c.HttpShardHandlerFactory Host whitelist initialized: WhitelistHostChecker [whitelistHosts=null, whitelistHostCheckingEnabled=true]
[junit4] 2> 2015957 WARN (jetty-launcher-14357-thread-4) [ ] o.e.j.u.s.S.config No Client EndPointIdentificationAlgorithm configured for SslContextFactory@4483145f[provider=null,keyStore=null,trustStore=null]
[junit4] 2> 2015960 WARN (jetty-launcher-14357-thread-4) [ ] o.e.j.u.s.S.config No Client EndPointIdentificationAlgorithm configured for SslContextFactory@262ec266[provider=null,keyStore=null,trustStore=null]
[junit4] 2> 2015962 INFO (jetty-launcher-14357-thread-4) [ ] o.a.s.c.ZkContainer Zookeeper client=127.0.0.1:40439/solr
[junit4] 2> 2015963 INFO (jetty-launcher-14357-thread-4) [ ] o.a.s.c.c.ConnectionManager Waiting for client to connect to ZooKeeper
[junit4] 2> 2015964 INFO (zkConnectionManagerCallback-14395-thread-1) [ ] o.a.s.c.c.ConnectionManager zkClient has connected
[junit4] 2> 2015964 INFO (jetty-launcher-14357-thread-4) [ ] o.a.s.c.c.ConnectionManager Client is connected to ZooKeeper
[junit4] 2> 2016052 INFO (jetty-launcher-14357-thread-3) [n:127.0.0.1:34731_solr ] o.a.s.c.c.ConnectionManager Waiting for client to connect to ZooKeeper
[junit4] 2> 2016053 INFO (zkConnectionManagerCallback-14397-thread-1) [ ] o.a.s.c.c.ConnectionManager zkClient has connected
[junit4] 2> 2016053 INFO (jetty-launcher-14357-thread-3) [n:127.0.0.1:34731_solr ] o.a.s.c.c.ConnectionManager Client is connected to ZooKeeper
[junit4] 2> 2016155 INFO (jetty-launcher-14357-thread-1) [n:127.0.0.1:45970_solr ] o.a.s.c.c.ConnectionManager Waiting for client to connect to ZooKeeper
[junit4] 2> 2016161 INFO (zkConnectionManagerCallback-14403-thread-1) [ ] o.a.s.c.c.ConnectionManager zkClient has connected
[junit4] 2> 2016161 INFO (jetty-launcher-14357-thread-1) [n:127.0.0.1:45970_solr ] o.a.s.c.c.ConnectionManager Client is connected to ZooKeeper
[junit4] 2> 2016177 INFO (jetty-launcher-14357-thread-1) [n:127.0.0.1:45970_solr ] o.a.s.c.OverseerElectionContext I am going to be the leader 127.0.0.1:45970_solr
[junit4] 2> 2016178 INFO (jetty-launcher-14357-thread-1) [n:127.0.0.1:45970_solr ] o.a.s.c.Overseer Overseer (id=73440776517124109-127.0.0.1:45970_solr-n_0000000000) starting
[junit4] 2> 2016188 INFO (jetty-launcher-14357-thread-1) [n:127.0.0.1:45970_solr ] o.a.s.c.c.ConnectionManager Waiting for client to connect to ZooKeeper
[junit4] 2> 2016191 INFO (zkConnectionManagerCallback-14410-thread-1) [ ] o.a.s.c.c.ConnectionManager zkClient has connected
[junit4] 2> 2016191 INFO (jetty-launcher-14357-thread-1) [n:127.0.0.1:45970_solr ] o.a.s.c.c.ConnectionManager Client is connected to ZooKeeper
[junit4] 2> 2016196 INFO (jetty-launcher-14357-thread-1) [n:127.0.0.1:45970_solr ] o.a.s.c.s.i.ZkClientClusterStateProvider Cluster at 127.0.0.1:40439/solr ready
[junit4] 2> 2016198 INFO (OverseerStateUpdate-73440776517124109-127.0.0.1:45970_solr-n_0000000000) [n:127.0.0.1:45970_solr ] o.a.s.c.Overseer Starting to work on the main queue : 127.0.0.1:45970_solr
[junit4] 2> 2016199 INFO (jetty-launcher-14357-thread-1) [n:127.0.0.1:45970_solr ] o.a.s.c.ZkController Register node as live in ZooKeeper:/live_nodes/127.0.0.1:45970_solr
[junit4] 2> 2016201 INFO (jetty-launcher-14357-thread-3) [n:127.0.0.1:34731_solr ] o.a.s.c.c.ZkStateReader Updated live nodes from ZooKeeper... (0) -> (1)
[junit4] 2> 2016202 INFO (zkCallback-14409-thread-1) [ ] o.a.s.c.c.ZkStateReader Updated live nodes from ZooKeeper... (0) -> (1)
[junit4] 2> 2016203 INFO (OverseerStateUpdate-73440776517124109-127.0.0.1:45970_solr-n_0000000000) [n:127.0.0.1:45970_solr ] o.a.s.c.c.ZkStateReader Updated live nodes from ZooKeeper... (0) -> (1)
[junit4] 2> 2016214 INFO (jetty-launcher-14357-thread-3) [n:127.0.0.1:34731_solr ] o.a.s.c.ZkController Publish node=127.0.0.1:34731_solr as DOWN
[junit4] 2> 2016216 INFO (jetty-launcher-14357-thread-3) [n:127.0.0.1:34731_solr ] o.a.s.c.TransientSolrCoreCacheDefault Allocating transient cache for 2147483647 transient cores
[junit4] 2> 2016216 INFO (jetty-launcher-14357-thread-3) [n:127.0.0.1:34731_solr ] o.a.s.c.ZkController Register node as live in ZooKeeper:/live_nodes/127.0.0.1:34731_solr
[junit4] 2> 2016219 INFO (zkCallback-14409-thread-1) [ ] o.a.s.c.c.ZkStateReader Updated live nodes from ZooKeeper... (1) -> (2)
[junit4] 2> 2016219 INFO (zkCallback-14402-thread-1) [ ] o.a.s.c.c.ZkStateReader Updated live nodes from ZooKeeper... (1) -> (2)
[junit4] 2> 2016221 INFO (zkCallback-14396-thread-1) [ ] o.a.s.c.c.ZkStateReader Updated live nodes from ZooKeeper... (1) -> (2)
[junit4] 2> 2016224 INFO (jetty-launcher-14357-thread-3) [n:127.0.0.1:34731_solr ] o.a.s.c.c.ConnectionManager Waiting for client to connect to ZooKeeper
[junit4] 2> 2016225 INFO (zkConnectionManagerCallback-14415-thread-1) [ ] o.a.s.c.c.ConnectionManager zkClient has connected
[junit4] 2> 2016225 INFO (jetty-launcher-14357-thread-3) [n:127.0.0.1:34731_solr ] o.a.s.c.c.ConnectionManager Client is connected to ZooKeeper
[junit4] 2> 2016227 INFO (jetty-launcher-14357-thread-3) [n:127.0.0.1:34731_solr ] o.a.s.c.c.ZkStateReader Updated live nodes from ZooKeeper... (0) -> (2)
[junit4] 2> 2016228 INFO (jetty-launcher-14357-thread-1) [n:127.0.0.1:45970_solr ] o.a.s.h.a.MetricsHistoryHandler No .system collection, keeping metrics history in memory.
[junit4] 2> 2016229 INFO (jetty-launcher-14357-thread-3) [n:127.0.0.1:34731_solr ] o.a.s.c.s.i.ZkClientClusterStateProvider Cluster at 127.0.0.1:40439/solr ready
[junit4] 2> 2016247 INFO (jetty-launcher-14357-thread-2) [n:127.0.0.1:43871_solr ] o.a.s.c.c.ZkStateReader Updated live nodes from ZooKeeper... (0) -> (2)
[junit4] 2> 2016253 INFO (jetty-launcher-14357-thread-2) [n:127.0.0.1:43871_solr ] o.a.s.c.ZkController Publish node=127.0.0.1:43871_solr as DOWN
[junit4] 2> 2016254 INFO (jetty-launcher-14357-thread-2) [n:127.0.0.1:43871_solr ] o.a.s.c.TransientSolrCoreCacheDefault Allocating transient cache for 2147483647 transient cores
[junit4] 2> 2016254 INFO (jetty-launcher-14357-thread-2) [n:127.0.0.1:43871_solr ] o.a.s.c.ZkController Register node as live in ZooKeeper:/live_nodes/127.0.0.1:43871_solr
[junit4] 2> 2016256 INFO (zkCallback-14409-thread-1) [ ] o.a.s.c.c.ZkStateReader Updated live nodes from ZooKeeper... (2) -> (3)
[junit4] 2> 2016256 INFO (zkCallback-14402-thread-1) [ ] o.a.s.c.c.ZkStateReader Updated live nodes from ZooKeeper... (2) -> (3)
[junit4] 2> 2016257 INFO (jetty-launcher-14357-thread-4) [n:127.0.0.1:44322_solr ] o.a.s.c.c.ConnectionManager Waiting for client to connect to ZooKeeper
[junit4] 2> 2016259 INFO (zkCallback-14414-thread-1) [ ] o.a.s.c.c.ZkStateReader Updated live nodes from ZooKeeper... (2) -> (3)
[junit4] 2> 2016259 INFO (jetty-launcher-14357-thread-3) [n:127.0.0.1:34731_solr ] o.a.s.h.a.MetricsHistoryHandler No .system collection, keeping metrics history in memory.
[junit4] 2> 2016259 INFO (zkCallback-14388-thread-1) [ ] o.a.s.c.c.ZkStateReader Updated live nodes from ZooKeeper... (2) -> (3)
[junit4] 2> 2016259 INFO (jetty-launcher-14357-thread-2) [n:127.0.0.1:43871_solr ] o.a.s.c.c.ConnectionManager Waiting for client to connect to ZooKeeper
[junit4] 2> 2016261 INFO (zkConnectionManagerCallback-14418-thread-1) [ ] o.a.s.c.c.ConnectionManager zkClient has connected
[junit4] 2> 2016261 INFO (jetty-launcher-14357-thread-4) [n:127.0.0.1:44322_solr ] o.a.s.c.c.ConnectionManager Client is connected to ZooKeeper
[junit4] 2> 2016261 INFO (zkConnectionManagerCallback-14424-thread-1) [ ] o.a.s.c.c.ConnectionManager zkClient has connected
[junit4] 2> 2016261 INFO (jetty-launcher-14357-thread-2) [n:127.0.0.1:43871_solr ] o.a.s.c.c.ConnectionManager Client is connected to ZooKeeper
[junit4] 2> 2016263 INFO (zkCallback-14396-thread-1) [ ] o.a.s.c.c.ZkStateReader Updated live nodes from ZooKeeper... (2) -> (3)
[junit4] 2> 2016265 INFO (jetty-launcher-14357-thread-2) [n:127.0.0.1:43871_solr ] o.a.s.c.c.ZkStateReader Updated live nodes from ZooKeeper... (0) -> (3)
[junit4] 2> 2016276 INFO (jetty-launcher-14357-thread-2) [n:127.0.0.1:43871_solr ] o.a.s.c.s.i.ZkClientClusterStateProvider Cluster at 127.0.0.1:40439/solr ready
[junit4] 2> 2016282 INFO (jetty-launcher-14357-thread-1) [n:127.0.0.1:45970_solr ] o.a.s.m.r.SolrJmxReporter JMX monitoring for 'solr_45970.solr.node' (registry 'solr.node') enabled at server: com.sun.jmx.mbeanserver.JmxMBeanServer@69c45d78
[junit4] 2> 2016284 INFO (jetty-launcher-14357-thread-4) [n:127.0.0.1:44322_solr ] o.a.s.c.c.ZkStateReader Updated live nodes from ZooKeeper... (0) -> (3)
[junit4] 2> 2016289 INFO (jetty-launcher-14357-thread-4) [n:127.0.0.1:44322_solr ] o.a.s.c.ZkController Publish node=127.0.0.1:44322_solr as DOWN
[junit4] 2> 2016290 INFO (jetty-launcher-14357-thread-4) [n:127.0.0.1:44322_solr ] o.a.s.c.TransientSolrCoreCacheDefault Allocating transient cache for 2147483647 transient cores
[junit4] 2> 2016290 INFO (jetty-launcher-14357-thread-4) [n:127.0.0.1:44322_solr ] o.a.s.c.ZkController Register node as live in ZooKeeper:/live_nodes/127.0.0.1:44322_solr
[junit4] 2> 2016293 INFO (zkCallback-14409-thread-1) [ ] o.a.s.c.c.ZkStateReader Updated live nodes from ZooKeeper... (3) -> (4)
[junit4] 2> 2016293 INFO (zkCallback-14414-thread-1) [ ] o.a.s.c.c.ZkStateReader Updated live nodes from ZooKeeper... (3) -> (4)
[junit4] 2> 2016293 INFO (zkCallback-14423-thread-1) [ ] o.a.s.c.c.ZkStateReader Updated live nodes from ZooKeeper... (3) -> (4)
[junit4] 2> 2016293 INFO (zkCallback-14388-thread-1) [ ] o.a.s.c.c.ZkStateReader Updated live nodes from ZooKeeper... (3) -> (4)
[junit4] 2> 2016293 INFO (zkCallback-14396-thread-1) [ ] o.a.s.c.c.ZkStateReader Updated live nodes from ZooKeeper... (3) -> (4)
[junit4] 2> 2016293 INFO (zkCallback-14402-thread-1) [ ] o.a.s.c.c.ZkStateReader Updated live nodes from ZooKeeper... (3) -> (4)
[junit4] 2> 2016294 INFO (zkCallback-14417-thread-1) [ ] o.a.s.c.c.ZkStateReader Updated live nodes from ZooKeeper... (3) -> (4)
[junit4] 2> 2016296 INFO (jetty-launcher-14357-thread-4) [n:127.0.0.1:44322_solr ] o.a.s.c.c.ConnectionManager Waiting for client to connect to ZooKeeper
[junit4] 2> 2016300 INFO (zkConnectionManagerCallback-14431-thread-1) [ ] o.a.s.c.c.ConnectionManager zkClient has connected
[junit4] 2> 2016300 INFO (jetty-launcher-14357-thread-4) [n:127.0.0.1:44322_solr ] o.a.s.c.c.ConnectionManager Client is connected to ZooKeeper
[junit4] 2> 2016301 INFO (jetty-launcher-14357-thread-2) [n:127.0.0.1:43871_solr ] o.a.s.h.a.MetricsHistoryHandler No .system collection, keeping metrics history in memory.
[junit4] 2> 2016312 INFO (jetty-launcher-14357-thread-4) [n:127.0.0.1:44322_solr ] o.a.s.c.c.ZkStateReader Updated live nodes from ZooKeeper... (0) -> (4)
[junit4] 2> 2016314 INFO (jetty-launcher-14357-thread-4) [n:127.0.0.1:44322_solr ] o.a.s.c.s.i.ZkClientClusterStateProvider Cluster at 127.0.0.1:40439/solr ready
[junit4] 2> 2016317 INFO (jetty-launcher-14357-thread-1) [n:127.0.0.1:45970_solr ] o.a.s.m.r.SolrJmxReporter JMX monitoring for 'solr_45970.solr.jvm' (registry 'solr.jvm') enabled at server: com.sun.jmx.mbeanserver.JmxMBeanServer@69c45d78
[junit4] 2> 2016317 INFO (jetty-launcher-14357-thread-1) [n:127.0.0.1:45970_solr ] o.a.s.m.r.SolrJmxReporter JMX monitoring for 'solr_45970.solr.jetty' (registry 'solr.jetty') enabled at server: com.sun.jmx.mbeanserver.JmxMBeanServer@69c45d78
[junit4] 2> 2016321 INFO (jetty-launcher-14357-thread-3) [n:127.0.0.1:34731_solr ] o.a.s.m.r.SolrJmxReporter JMX monitoring for 'solr_34731.solr.node' (registry 'solr.node') enabled at server: com.sun.jmx.mbeanserver.JmxMBeanServer@69c45d78
[junit4] 2> 2016331 INFO (jetty-launcher-14357-thread-1) [n:127.0.0.1:45970_solr ] o.a.s.c.CorePropertiesLocator Found 0 core definitions underneath /x1/jenkins/jenkins-slave/workspace/Lucene-Solr-BadApples-Tests-master/solr/build/solr-core/test/J0/temp/solr.cloud.TestCloudConsistency_35970B71AC514204-001/tempDir-001/node1/.
[junit4] 2> 2016333 INFO (jetty-launcher-14357-thread-4) [n:127.0.0.1:44322_solr ] o.a.s.h.a.MetricsHistoryHandler No .system collection, keeping metrics history in memory.
[junit4] 2> 2016368 INFO (jetty-launcher-14357-thread-2) [n:127.0.0.1:43871_solr ] o.a.s.m.r.SolrJmxReporter JMX monitoring for 'solr_43871.solr.node' (registry 'solr.node') enabled at server: com.sun.jmx.mbeanserver.JmxMBeanServer@69c45d78
[junit4] 2> 2016389 INFO (jetty-launcher-14357-thread-3) [n:127.0.0.1:34731_solr ] o.a.s.m.r.SolrJmxReporter JMX monitoring for 'solr_34731.solr.jvm' (registry 'solr.jvm') enabled at server: com.sun.jmx.mbeanserver.JmxMBeanServer@69c45d78
[junit4] 2> 2016389 INFO (jetty-launcher-14357-thread-3) [n:127.0.0.1:34731_solr ] o.a.s.m.r.SolrJmxReporter JMX monitoring for 'solr_34731.solr.jetty' (registry 'solr.jetty') enabled at server: com.sun.jmx.mbeanserver.JmxMBeanServer@69c45d78
[junit4] 2> 2016394 INFO (jetty-launcher-14357-thread-3) [n:127.0.0.1:34731_solr ] o.a.s.c.CorePropertiesLocator Found 0 core definitions underneath /x1/jenkins/jenkins-slave/workspace/Lucene-Solr-BadApples-Tests-master/solr/build/solr-core/test/J0/temp/solr.cloud.TestCloudConsistency_35970B71AC514204-001/tempDir-001/node3/.
[junit4] 2> 2016415 INFO (jetty-launcher-14357-thread-4) [n:127.0.0.1:44322_solr ] o.a.s.m.r.SolrJmxReporter JMX monitoring for 'solr_44322.solr.node' (registry 'solr.node') enabled at server: com.sun.jmx.mbeanserver.JmxMBeanServer@69c45d78
[junit4] 2> 2016431 INFO (jetty-launcher-14357-thread-2) [n:127.0.0.1:43871_solr ] o.a.s.m.r.SolrJmxReporter JMX monitoring for 'solr_43871.solr.jvm' (registry 'solr.jvm') enabled at server: com.sun.jmx.mbeanserver.JmxMBeanServer@69c45d78
[junit4] 2> 2016431 INFO (jetty-launcher-14357-thread-2) [n:127.0.0.1:43871_solr ] o.a.s.m.r.SolrJmxReporter JMX monitoring for 'solr_43871.solr.jetty' (registry 'solr.jetty') enabled at server: com.sun.jmx.mbeanserver.JmxMBeanServer@69c45d78
[junit4] 2> 2016433 INFO (jetty-launcher-14357-thread-2) [n:127.0.0.1:43871_solr ] o.a.s.c.CorePropertiesLocator Found 0 core definitions underneath /x1/jenkins/jenkins-slave/workspace/Lucene-Solr-BadApples-Tests-master/solr/build/solr-core/test/J0/temp/solr.cloud.TestCloudConsistency_35970B71AC514204-001/tempDir-001/node2/.
[junit4] 2> 2016446 INFO (jetty-launcher-14357-thread-4) [n:127.0.0.1:44322_solr ] o.a.s.m.r.SolrJmxReporter JMX monitoring for 'solr_44322.solr.jvm' (registry 'solr.jvm') enabled at server: com.sun.jmx.mbeanserver.JmxMBeanServer@69c45d78
[junit4] 2> 2016446 INFO (jetty-launcher-14357-thread-4) [n:127.0.0.1:44322_solr ] o.a.s.m.r.SolrJmxReporter JMX monitoring for 'solr_44322.solr.jetty' (registry 'solr.jetty') enabled at server: com.sun.jmx.mbeanserver.JmxMBeanServer@69c45d78
[junit4] 2> 2016448 INFO (jetty-launcher-14357-thread-4) [n:127.0.0.1:44322_solr ] o.a.s.c.CorePropertiesLocator Found 0 core definitions underneath /x1/jenkins/jenkins-slave/workspace/Lucene-Solr-BadApples-Tests-master/solr/build/solr-core/test/J0/temp/solr.cloud.TestCloudConsistency_35970B71AC514204-001/tempDir-001/node4/.
[junit4] 2> 2016704 INFO (TEST-TestCloudConsistency.testOutOfSyncReplicasCannotBecomeLeader-seed#[35970B71AC514204]) [ ] o.a.s.c.c.ConnectionManager Waiting for client to connect to ZooKeeper
[junit4] 2> 2016706 INFO (zkConnectionManagerCallback-14438-thread-1) [ ] o.a.s.c.c.ConnectionManager zkClient has connected
[junit4] 2> 2016706 INFO (TEST-TestCloudConsistency.testOutOfSyncReplicasCannotBecomeLeader-seed#[35970B71AC514204]) [ ] o.a.s.c.c.ConnectionManager Client is connected to ZooKeeper
[junit4] 2> 2016708 INFO (TEST-TestCloudConsistency.testOutOfSyncReplicasCannotBecomeLeader-seed#[35970B71AC514204]) [ ] o.a.s.c.c.ZkStateReader Updated live nodes from ZooKeeper... (0) -> (4)
[junit4] 2> 2016710 INFO (TEST-TestCloudConsistency.testOutOfSyncReplicasCannotBecomeLeader-seed#[35970B71AC514204]) [ ] o.a.s.c.s.i.ZkClientClusterStateProvider Cluster at 127.0.0.1:40439/solr ready
[junit4] 2> 2016714 INFO (TEST-TestCloudConsistency.testOutOfSyncReplicasCannotBecomeLeader-seed#[35970B71AC514204]) [ ] o.a.s.c.CoreContainer Shutting down CoreContainer instance=271334988
[junit4] 2> 2016714 INFO (TEST-TestCloudConsistency.testOutOfSyncReplicasCannotBecomeLeader-seed#[35970B71AC514204]) [ ] o.a.s.c.ZkController Remove node as live in ZooKeeper:/live_nodes/127.0.0.1:45970_solr
[junit4] 2> 2016714 INFO (TEST-TestCloudConsistency.testOutOfSyncReplicasCannotBecomeLeader-seed#[35970B71AC514204]) [ ] o.a.s.c.ZkController Publish this node as DOWN...
[junit4] 2> 2016714 INFO (TEST-TestCloudConsistency.testOutOfSyncReplicasCannotBecomeLeader-seed#[35970B71AC514204]) [ ] o.a.s.c.ZkController Publish node=127.0.0.1:45970_solr as DOWN
[junit4] 2> 2016717 INFO (TEST-TestCloudConsistency.testOutOfSyncReplicasCannotBecomeLeader-seed#[35970B71AC514204]) [ ] o.a.s.c.TransientSolrCoreCacheDefault Allocating transient cache for 2147483647 transient cores
[junit4] 2> 2016718 INFO (TEST-TestCloudConsistency.testOutOfSyncReplicasCannotBecomeLeader-seed#[35970B71AC514204]) [ ] o.a.s.m.SolrMetricManager Closing metric reporters for registry=solr.node, tag=null
[junit4] 2> 2016718 INFO (TEST-TestCloudConsistency.testOutOfSyncReplicasCannotBecomeLeader-seed#[35970B71AC514204]) [ ] o.a.s.m.r.SolrJmxReporter Closing reporter [org.apache.solr.metrics.reporters.SolrJmxReporter@29698468: rootName = solr_45970, domain = solr.node, service url = null, agent id = null] for registry solr.node / com.codahale.metrics.MetricRegistry@1c5d6456
[junit4] 2> 2016728 INFO (TEST-TestCloudConsistency.testOutOfSyncReplicasCannotBecomeLeader-seed#[35970B71AC514204]) [ ] o.a.s.m.SolrMetricManager Closing metric reporters for registry=solr.jvm, tag=null
[junit4] 2> 2016728 INFO (TEST-TestCloudConsistency.testOutOfSyncReplicasCannotBecomeLeader-seed#[35970B71AC514204]) [ ] o.a.s.m.r.SolrJmxReporter Closing reporter [org.apache.solr.metrics.reporters.SolrJmxReporter@6145873: rootName = solr_45970, domain = solr.jvm, service url = null, agent id = null] for registry solr.jvm / com.codahale.metrics.MetricRegistry@ae3a47d
[junit4] 2> 2016735 INFO (TEST-TestCloudConsistency.testOutOfSyncReplicasCannotBecomeLeader-seed#[35970B71AC514204]) [ ] o.a.s.m.SolrMetricManager Closing metric reporters for registry=solr.jetty, tag=null
[junit4] 2> 2016735 INFO (TEST-TestCloudConsistency.testOutOfSyncReplicasCannotBecomeLeader-seed#[35970B71AC514204]) [ ] o.a.s.m.r.SolrJmxReporter Closing reporter [org.apache.solr.metrics.reporters.SolrJmxReporter@682b9f6c: rootName = solr_45970, domain = solr.jetty, service url = null, agent id = null] for registry solr.jetty / com.codahale.metrics.MetricRegistry@78bfec91
[junit4] 2> 2016735 INFO (TEST-TestCloudConsistency.testOutOfSyncReplicasCannotBecomeLeader-seed#[35970B71AC514204]) [ ] o.a.s.m.SolrMetricManager Closing metric reporters for registry=solr.cluster, tag=null
[junit4] 2> 2016736 INFO (closeThreadPool-14442-thread-2) [ ] o.a.s.c.Overseer Overseer (id=73440776517124109-127.0.0.1:45970_solr-n_0000000000) closing
[junit4] 2> 2016736 INFO (OverseerStateUpdate-73440776517124109-127.0.0.1:45970_solr-n_0000000000) [n:127.0.0.1:45970_solr ] o.a.s.c.Overseer Overseer Loop exiting : 127.0.0.1:45970_solr
[junit4] 2> 2016737 INFO (OverseerAutoScalingTriggerThread-73440776517124109-127.0.0.1:45970_solr-n_0000000000) [ ] o.a.s.c.a.OverseerTriggerThread OverseerTriggerThread woken up but we are closed, exiting.
[junit4] 2> 2016741 INFO (zkCallback-14417-thread-1) [ ] o.a.s.c.c.ZkStateReader Updated live nodes from ZooKeeper... (4) -> (3)
[junit4] 2> 2016741 INFO (zkCallback-14437-thread-1) [ ] o.a.s.c.c.ZkStateReader Updated live nodes from ZooKeeper... (4) -> (3)
[junit4] 2> 2016741 INFO (zkCallback-14414-thread-1) [ ] o.a.s.c.c.ZkStateReader Updated live nodes from ZooKeeper... (4) -> (3)
[junit4] 2> 2016741 INFO (closeThreadPool-14442-thread-1) [ ] o.a.s.c.Overseer Overseer (id=73440776517124109-127.0.0.1:45970_solr-n_0000000000) closing
[junit4] 2> 2016742 INFO (zkCallback-14388-thread-1) [ ] o.a.s.c.c.ZkStateReader Updated live nodes from ZooKeeper... (4) -> (3)
[junit4] 2> 2016742 INFO (zkCallback-14396-thread-1) [ ] o.a.s.c.c.ZkStateReader Updated live nodes from ZooKeeper... (4) -> (3)
[junit4] 2> 2016841 INFO (TEST-TestCloudConsistency.testOutOfSyncReplicasCannotBecomeLeader-seed#[35970B71AC514204]) [ ] o.a.s.c.Overseer Overseer (id=73440776517124109-127.0.0.1:45970_solr-n_0000000000) closing
[junit4] 2> 2016842 INFO (zkCallback-14423-thread-1) [ ] o.a.s.c.c.ZkStateReader Updated live nodes from ZooKeeper... (4) -> (3)
[junit4] 2> 2016843 INFO (zkCallback-14396-thread-2) [ ] o.a.s.c.OverseerElectionContext I am going to be the leader 127.0.0.1:34731_solr
[junit4] 2> 2016843 INFO (zkCallback-14430-thread-1) [ ] o.a.s.c.c.ZkStateReader Updated live nodes from ZooKeeper... (4) -> (3)
[junit4] 2> 2016843 INFO (TEST-TestCloudConsistency.testOutOfSyncReplicasCannotBecomeLeader-seed#[35970B71AC514204]) [ ] o.e.j.s.AbstractConnector Stopped ServerConnector@713a27a4{HTTP/1.1,[http/1.1, h2c]}{127.0.0.1:0}
[junit4] 2> 2016844 INFO (TEST-TestCloudConsistency.testOutOfSyncReplicasCannotBecomeLeader-seed#[35970B71AC514204]) [ ] o.e.j.s.h.ContextHandler Stopped o.e.j.s.ServletContextHandler@699e7246{/solr,null,UNAVAILABLE}
[junit4] 2> 2016844 INFO (TEST-TestCloudConsistency.testOutOfSyncReplicasCannotBecomeLeader-seed#[35970B71AC514204]) [ ] o.e.j.s.session node0 Stopped scavenging
[junit4] 2> 2016845 INFO (TEST-TestCloudConsistency.testOutOfSyncReplicasCannotBecomeLeader-seed#[35970B71AC514204]) [ ] o.a.s.c.s.e.JettySolrRunner Start Jetty (original configured port=0)
[junit4] 2> 2016845 INFO (zkCallback-14396-thread-2) [n:127.0.0.1:34731_solr ] o.a.s.c.Overseer Overseer (id=73440776517124108-127.0.0.1:34731_solr-n_0000000001) starting
[junit4] 2> 2016845 WARN (TEST-TestCloudConsistency.testOutOfSyncReplicasCannotBecomeLeader-seed#[35970B71AC514204]) [ ] o.e.j.s.AbstractConnector Ignoring deprecated socket close linger time
[junit4] 2> 2016845 INFO (TEST-TestCloudConsistency.testOutOfSyncReplicasCannotBecomeLeader-seed#[35970B71AC514204]) [ ] o.a.s.c.s.e.JettySolrRunner Trying to start Jetty on port 0 try number 1 ...
[junit4] 2> 2016845 INFO (TEST-TestCloudConsistency.testOutOfSyncReplicasCannotBecomeLeader-seed#[35970B71AC514204]) [ ] o.e.j.s.Server jetty-9.4.14.v20181114; built: 2018-11-14T21:20:31.478Z; git: c4550056e785fb5665914545889f21dc136ad9e6; jvm 11.0.1+13-LTS
[junit4] 2> 2016847 INFO (TEST-TestCloudConsistency.testOutOfSyncReplicasCannotBecomeLeader-seed#[35970B71AC514204]) [ ] o.e.j.s.session DefaultSessionIdManager workerName=node0
[junit4] 2> 2016847 INFO (TEST-TestCloudConsistency.testOutOfSyncReplicasCannotBecomeLeader-seed#[35970B71AC514204]) [ ] o.e.j.s.session No SessionScavenger set, using defaults
[junit4] 2> 2016847 INFO (TEST-TestCloudConsistency.testOutOfSyncReplicasCannotBecomeLeader-seed#[35970B71AC514204]) [ ] o.e.j.s.session node0 Scavenging every 600000ms
[junit4] 2> 2016847 INFO (TEST-TestCloudConsistency.testOutOfSyncReplicasCannotBecomeLeader-seed#[35970B71AC514204]) [ ] o.e.j.s.h.ContextHandler Started o.e.j.s.ServletContextHandler@1eb19548{/solr,null,AVAILABLE}
[junit4] 2> 2016848 INFO (TEST-TestCloudConsistency.testOutOfSyncReplicasCannotBecomeLeader-seed#[35970B71AC514204]) [ ] o.e.j.s.AbstractConnector Started ServerConnector@2a0f1d3e{HTTP/1.1,[http/1.1, h2c]}{127.0.0.1:33490}
[junit4] 2> 2016848 INFO (TEST-TestCloudConsistency.testOutOfSyncReplicasCannotBecomeLeader-seed#[35970B71AC514204]) [ ] o.e.j.s.Server Started @2016899ms
[junit4] 2> 2016848 INFO (TEST-TestCloudConsistency.testOutOfSyncReplicasCannotBecomeLeader-seed#[35970B71AC514204]) [ ] o.a.s.c.s.e.JettySolrRunner Jetty properties: {hostContext=/solr, hostPort=34645}
[junit4] 2> 2016848 ERROR (TEST-TestCloudConsistency.testOutOfSyncReplicasCannotBecomeLeader-seed#[35970B71AC514204]) [ ] o.a.s.u.StartupLoggingUtils Missing Java Option solr.log.dir. Logging may be missing or incomplete.
[junit4] 2> 2016848 INFO (TEST-TestCloudConsistency.testOutOfSyncReplicasCannotBecomeLeader-seed#[35970B71AC514204]) [ ] o.a.s.s.SolrDispatchFilter Using logger factory org.apache.logging.slf4j.Log4jLoggerFactory
[junit4] 2> 2016848 INFO (TEST-TestCloudConsistency.testOutOfSyncReplicasCannotBecomeLeader-seed#[35970B71AC514204]) [ ] o.a.s.s.SolrDispatchFilter ___ _ Welcome to Apache Solr? version 9.0.0
[junit4] 2> 2016848 INFO (TEST-TestCloudConsistency.testOutOfSyncReplicasCannotBecomeLeader-seed#[35970B71AC514204]) [ ] o.a.s.s.SolrDispatchFilter / __| ___| |_ _ Starting in cloud mode on port null
[junit4] 2> 2016848 INFO (TEST-TestCloudConsistency.testOutOfSyncReplicasCannotBecomeLeader-seed#[35970B71AC514204]) [ ] o.a.s.s.SolrDispatchFilter \__ \/ _ \ | '_| Install dir: null
[junit4] 2> 2016848 INFO (TEST-TestCloudConsistency.testOutOfSyncReplicasCannotBecomeLeader-seed#[35970B71AC514204]) [ ] o.a.s.s.SolrDispatchFilter |___/\___/_|_| Start time: 2019-06-08T05:15:41.880922Z
[junit4] 2> 2016850 INFO (TEST-TestCloudConsistency.testOutOfSyncReplicasCannotBecomeLeader-seed#[35970B71AC514204]) [ ] o.a.s.c.c.ConnectionManager Waiting for client to connect to ZooKeeper
[junit4] 2> 2016851 INFO (zkConnectionManagerCallback-14444-thread-1) [ ] o.a.s.c.c.ConnectionManager zkClient has connected
[junit4] 2> 2016851 INFO (TEST-TestCloudConsistency.testOutOfSyncReplicasCannotBecomeLeader-seed#[35970B71AC514204]) [ ] o.a.s.c.c.ConnectionManager Client is connected to ZooKeeper
[junit4] 2> 2016852 INFO (OverseerStateUpdate-73440776517124108-127.0.0.1:34731_solr-n_0000000001) [n:127.0.0.1:34731_solr ] o.a.s.c.Overseer Starting to work on the main queue : 127.0.0.1:34731_solr
[junit4] 2> 2016852 INFO (TEST-TestCloudConsistency.testOutOfSyncReplicasCannotBecomeLeader-seed#[35970B71AC514204]) [ ] o.a.s.s.SolrDispatchFilter solr.xml found in ZooKeeper. Loading...
[junit4] 2> 2017196 INFO (TEST-TestCloudConsistency.testOutOfSyncReplicasCannotBecomeLeader-seed#[35970B71AC514204]) [ ] o.a.s.h.c.HttpShardHandlerFactory Host whitelist initialized: WhitelistHostChecker [whitelistHosts=null, whitelistHostCheckingEnabled=true]
[junit4] 2> 2017198 WARN (TEST-TestCloudConsistency.testOutOfSyncReplicasCannotBecomeLeader-seed#[35970B71AC514204]) [ ] o.e.j.u.s.S.config No Client EndPointIdentificationAlgorithm configured for SslContextFactory@2c696e3b[provider=null,keyStore=null,trustStore=null]
[junit4] 2> 2017201 WARN (TEST-TestCloudConsistency.testOutOfSyncReplicasCannotBecomeLeader-seed#[35970B71AC514204]) [ ] o.e.j.u.s.S.config No Client EndPointIdentificationAlgorithm configured for SslContextFactory@4c1fda6d[provider=null,keyStore=null,trustStore=null]
[junit4] 2> 2017203 INFO (TEST-TestCloudConsistency.testOutOfSyncReplicasCannotBecomeLeader-seed#[35970B71AC514204]) [ ] o.a.s.c.ZkContainer Zookeeper client=127.0.0.1:40439/solr
[junit4] 2> 2017204 INFO (TEST-TestCloudConsistency.testOutOfSyncReplicasCannotBecomeLeader-seed#[35970B71AC514204]) [ ] o.a.s.c.c.ConnectionManager Waiting for client to connect to ZooKeeper
[junit4] 2> 2017206 INFO (zkConnectionManagerCallback-14451-thread-1) [ ] o.a.s.c.c.ConnectionManager zkClient has connected
[junit4] 2> 2017206 INFO (TEST-TestCloudConsistency.testOutOfSyncReplicasCannotBecomeLeader-seed#[35970B71AC514204]) [ ] o.a.s.c.c.ConnectionManager Client is connected to ZooKeeper
[junit4] 2> 2017309 INFO (TEST-TestCloudConsistency.testOutOfSyncReplicasCannotBecomeLeader-seed#[35970B71AC514204]) [n:127.0.0.1:34645_solr ] o.a.s.c.c.ConnectionManager Waiting for client to connect to ZooKeeper
[junit4] 2> 2017310 INFO (zkConnectionManagerCallback-14453-thread-1) [ ] o.a.s.c.c.ConnectionManager zkClient has connected
[junit4] 2> 2017310 INFO (TEST-TestCloudConsistency.testOutOfSyncReplicasCannotBecomeLeader-seed#[35970B71AC514204]) [n:127.0.0.1:34645_solr ] o.a.s.c.c.ConnectionManager Client is connected to ZooKeeper
[junit4] 2> 2017318 INFO (TEST-TestCloudConsistency.testOutOfSyncReplicasCannotBecomeLeader-seed#[35970B71AC514204]) [n:127.0.0.1:34645_solr ] o.a.s.c.c.ZkStateReader Updated live nodes from ZooKeeper... (0) -> (3)
[junit4] 2> 2017323 INFO (TEST-TestCloudConsistency.testOutOfSyncReplicasCannotBecomeLeader-seed#[35970B71AC514204]) [n:127.0.0.1:34645_solr ] o.a.s.c.ZkController Publish node=127.0.0.1:34645_solr as DOWN
[junit4] 2> 2017324 INFO (TEST-TestCloudConsistency.testOutOfSyncReplicasCannotBecomeLeader-seed#[35970B71AC514204]) [n:127.0.0.1:34645_solr ] o.a.s.c.TransientSolrCoreCacheDefault Allocating transient cache for 2147483647 transient cores
[junit4] 2> 2017325 INFO (TEST-TestCloudConsistency.testOutOfSyncReplicasCannotBecomeLeader-seed#[35970B71AC514204]) [n:127.0.0.1:34645_solr ] o.a.s.c.ZkController Register node as live in ZooKeeper:/live_nodes/127.0.0.1:34645_solr
[junit4] 2> 2017327 INFO (zkCallback-14437-thread-1) [ ] o.a.s.c.c.ZkStateReader Updated live nodes from ZooKeeper... (3) -> (4)
[junit4] 2> 2017327 INFO (zkCallback-14423-thread-1) [ ] o.a.s.c.c.ZkStateReader Updated live nodes from ZooKeeper... (3) -> (4)
[junit4] 2> 2017327 INFO (zkCallback-14388-thread-1) [ ] o.a.s.c.c.ZkStateReader Updated live nodes from ZooKeeper... (3) -> (4)
[junit4] 2> 2017327 INFO (zkCallback-14414-thread-1) [ ] o.a.s.c.c.ZkStateReader Updated live nodes from ZooKeeper... (3) -> (4)
[junit4] 2> 2017327 INFO (zkCallback-14396-thread-2) [ ] o.a.s.c.c.ZkStateReader Updated live nodes from ZooKeeper... (3) -> (4)
[junit4] 2> 2017327 INFO (zkCallback-14417-thread-1) [ ] o.a.s.c.c.ZkStateReader Updated live nodes from ZooKeeper... (3) -> (4)
[junit4] 2> 2017327 INFO (zkCallback-14430-thread-1) [ ] o.a.s.c.c.ZkStateReader Updated live nodes from ZooKeeper... (3) -> (4)
[junit4] 2> 2017327 INFO (zkCallback-14452-thread-1) [ ] o.a.s.c.c.ZkStateReader Updated live nodes from ZooKeeper... (3) -> (4)
[junit4] 2> 2017329 INFO (TEST-TestCloudConsistency.testOutOfSyncReplicasCannotBecomeLeader-seed#[35970B71AC514204]) [n:127.0.0.1:34645_solr ] o.a.s.c.c.ConnectionManager Waiting for client to connect to ZooKeeper
[junit4] 2> 2017330 INFO (zkConnectionManagerCallback-14460-thread-1) [ ] o.a.s.c.c.ConnectionManager zkClient has connected
[junit4] 2> 2017330 INFO (TEST-TestCloudConsistency.testOutOfSyncReplicasCannotBecomeLeader-seed#[35970B71AC514204]) [n:127.0.0.1:34645_solr ] o.a.s.c.c.ConnectionManager Client is connected to ZooKeeper
[junit4] 2> 2017332 INFO (TEST-TestCloudConsistency.testOutOfSyncReplicasCannotBecomeLeader-seed#[35970B71AC514204]) [n:127.0.0.1:34645_solr ] o.a.s.c.c.ZkStateReader Updated live nodes from ZooKeeper... (0) -> (4)
[junit4] 2> 2017334 INFO (TEST-TestCloudConsistency.testOutOfSyncReplicasCannotBecomeLeader-seed#[35970B71AC514204]) [n:127.0.0.1:34645_solr ] o.a.s.c.s.i.ZkClientClusterStateProvider Cluster at 127.0.0.1:40439/solr ready
[junit4] 2> 2017353 INFO (TEST-TestCloudConsistency.testOutOfSyncReplicasCannotBecomeLeader-seed#[35970B71AC514204]) [n:127.0.0.1:34645_solr ] o.a.s.h.a.MetricsHistoryHandler No .system collection, keeping metrics history in memory.
[junit4] 2> 2017387 INFO (TEST-TestCloudConsistency.testOutOfSyncReplicasCannotBecomeLeader-seed#[35970B71AC514204]) [n:127.0.0.1:34645_solr ] o.a.s.m.r.SolrJmxReporter JMX monitoring for 'solr_34645.solr.node' (registry 'solr.node') enabled at server: com.sun.jmx.mbeanserver.JmxMBeanServer@69c45d78
[junit4] 2> 2017412 INFO (TEST-TestCloudConsistency.testOutOfSyncReplicasCannotBecomeLeader-seed#[35970B71AC514204]) [n:127.0.0.1:34645_solr ] o.a.s.m.r.SolrJmxReporter JMX monitoring for 'solr_34645.solr.jvm' (registry 'solr.jvm') enabled at server: com.sun.jmx.mbeanserver.JmxMBeanServer@69c45d78
[junit4] 2> 2017412 INFO (TEST-TestCloudConsistency.testOutOfSyncReplicasCannotBecomeLeader-seed#[35970B71AC514204]) [n:127.0.0.1:34645_solr ] o.a.s.m.r.SolrJmxReporter JMX monitoring for 'solr_34645.solr.jetty' (registry 'solr.jetty') enabled at server: com.sun.jmx.mbeanserver.JmxMBeanServer@69c45d78
[junit4] 2> 2017414 INFO (TEST-TestCloudConsistency.testOutOfSyncReplicasCannotBecomeLeader-seed#[35970B71AC514204]) [n:127.0.0.1:34645_solr ] o.a.s.c.CorePropertiesLocator Found 0 core definitions underneath /x1/jenkins/jenkins-slave/workspace/Lucene-Solr-BadApples-Tests-master/solr/build/solr-core/test/J0/temp/solr.cloud.TestCloudConsistency_35970B71AC514204-001/tempDir-001/node1/.
[junit4] 2> 2017509 INFO (TEST-TestCloudConsistency.testOutOfSyncReplicasCannotBecomeLeader-seed#[35970B71AC514204]) [ ] o.a.s.c.TestCloudConsistency Adding proxy for URL: http://127.0.0.1:33490/solr. Proxy: http://127.0.0.1:34645/solr
[junit4] 2> 2017509 INFO (TEST-TestCloudConsistency.testOutOfSyncReplicasCannotBecomeLeader-seed#[35970B71AC514204]) [ ] o.a.s.c.CoreContainer Shutting down CoreContainer instance=1556899296
[junit4] 2> 2017509 INFO (TEST-TestCloudConsistency.testOutOfSyncReplicasCannotBecomeLeader-seed#[35970B71AC514204]) [ ] o.a.s.c.ZkController Remove node as live in ZooKeeper:/live_nodes/127.0.0.1:34731_solr
[junit4] 2> 2017511 INFO (TEST-TestCloudConsistency.testOutOfSyncReplicasCannotBecomeLeader-seed#[35970B71AC514204]) [ ] o.a.s.c.ZkController Publish this node as DOWN...
[junit4] 2> 2017511 INFO (TEST-TestCloudConsistency.testOutOfSyncReplicasCannotBecomeLeader-seed#[35970B71AC514204]) [ ] o.a.s.c.ZkController Publish node=127.0.0.1:34731_solr as DOWN
[junit4] 2> 2017514 INFO (TEST-TestCloudConsistency.testOutOfSyncReplicasCannotBecomeLeader-seed#[35970B71AC514204]) [ ] o.a.s.m.SolrMetricManager Closing metric reporters for registry=solr.node, tag=null
[junit4] 2> 2017514 INFO (TEST-TestCloudConsistency.testOutOfSyncReplicasCannotBecomeLeader-seed#[35970B71AC514204]) [ ] o.a.s.m.r.SolrJmxReporter Closing reporter [org.apache.solr.metrics.reporters.SolrJmxReporter@6ddf953b: rootName = solr_34731, domain = solr.node, service url = null, agent id = null] for registry solr.node / com.codahale.metrics.MetricRegistry@326d7aa
[junit4] 2> 2017525 INFO (TEST-TestCloudConsistency.testOutOfSyncReplicasCannotBecomeLeader-seed#[35970B71AC514204]) [ ] o.a.s.m.SolrMetricManager Closing metric reporters for registry=solr.jvm, tag=null
[junit4] 2> 2017525 INFO (TEST-TestCloudConsistency.testOutOfSyncReplicasCannotBecomeLeader-seed#[35970B71AC514204]) [ ] o.a.s.m.r.SolrJmxReporter Closing reporter [org.apache.solr.metrics.reporters.SolrJmxReporter@6e546079: rootName = solr_34731, domain = solr.jvm, service url = null, agent id = null] for registry solr.jvm / com.codahale.metrics.MetricRegistry@ae3a47d
[junit4] 2> 2017532 INFO (TEST-TestCloudConsistency.testOutOfSyncReplicasCannotBecomeLeader-seed#[35970B71AC514204]) [ ] o.a.s.m.SolrMetricManager Closing metric reporters for registry=solr.jetty, tag=null
[junit4] 2> 2017532 INFO (TEST-TestCloudConsistency.testOutOfSyncReplicasCannotBecomeLeader-seed#[35970B71AC514204]) [ ] o.a.s.m.r.SolrJmxReporter Closing reporter [org.apache.solr.metrics.reporters.SolrJmxReporter@35b629a9: rootName = solr_34731, domain = solr.jetty, service url = null, agent id = null] for registry solr.jetty / com.codahale.metrics.MetricRegistry@78bfec91
[junit4] 2> 2017532 INFO (TEST-TestCloudConsistency.testOutOfSyncReplicasCannotBecomeLeader-seed#[35970B71AC514204]) [ ] o.a.s.m.SolrMetricManager Closing metric reporters for registry=solr.cluster, tag=null
[junit4] 2> 2017533 INFO (closeThreadPool-14465-thread-1) [ ] o.a.s.c.Overseer Overseer (id=73440776517124108-127.0.0.1:34731_solr-n_0000000001) closing
[junit4] 2> 2017533 INFO (OverseerStateUpdate-73440776517124108-127.0.0.1:34731_solr-n_0000000001) [n:127.0.0.1:34731_solr ] o.a.s.c.Overseer Overseer Loop exiting : 127.0.0.1:34731_solr
[junit4] 2> 2017533 INFO (OverseerAutoScalingTriggerThread-73440776517124108-127.0.0.1:34731_solr-n_0000000001) [ ] o.a.s.c.a.OverseerTriggerThread OverseerTriggerThread woken up but we are closed, exiting.
[junit4] 2> 2017538 INFO (closeThreadPool-14465-thread-2) [ ] o.a.s.c.Overseer Overseer (id=73440776517124108-127.0.0.1:34731_solr-n_0000000001) closing
[junit4] 2> 2017539 INFO (zkCallback-14437-thread-1) [ ] o.a.s.c.c.ZkStateReader Updated live nodes from ZooKeeper... (4) -> (3)
[junit4] 2> 2017539 INFO (zkCallback-14423-thread-1) [ ] o.a.s.c.c.ZkStateReader Updated live nodes from ZooKeeper... (4) -> (3)
[junit4] 2> 2017540 INFO (zkCallback-14417-thread-1) [ ] o.a.s.c.c.ZkStateReader Updated live nodes from ZooKeeper... (4) -> (3)
[junit4] 2> 2017540 INFO (zkCallback-14430-thread-1) [ ] o.a.s.c.c.ZkStateReader Updated live nodes from ZooKeeper... (4) -> (3)
[junit4] 2> 2017540 INFO (zkCallback-14452-thread-1) [ ] o.a.s.c.c.ZkStateReader Updated live nodes from ZooKeeper... (4) -> (3)
[junit4] 2> 2017540 INFO (zkCallback-14388-thread-1) [ ] o.a.s.c.OverseerElectionContext I am going to be the leader 127.0.0.1:43871_solr
[junit4] 2> 2017640 INFO (TEST-TestCloudConsistency.testOutOfSyncReplicasCannotBecomeLeader-seed#[35970B71AC514204]) [ ] o.a.s.c.Overseer Overseer (id=73440776517124108-127.0.0.1:34731_solr-n_0000000001) closing
[junit4] 2> 2017641 INFO (zkCallback-14388-thread-2) [ ] o.a.s.c.c.ZkStateReader Updated live nodes from ZooKeeper... (4) -> (3)
[junit4] 2> 2017641 INFO (zkCallback-14459-thread-1) [ ] o.a.s.c.c.ZkStateReader Updated live nodes from ZooKeeper... (4) -> (3)
[junit4] 2> 2017642 INFO (zkCallback-14388-thread-1) [n:127.0.0.1:43871_solr ] o.a.s.c.Overseer Overseer (id=73440776517124106-127.0.0.1:43871_solr-n_0000000002) starting
[junit4] 2> 2017643 INFO (TEST-TestCloudConsistency.testOutOfSyncReplicasCannotBecomeLeader-seed#[35970B71AC514204]) [ ] o.e.j.s.AbstractConnector Stopped ServerConnector@4d71d2d8{HTTP/1.1,[http/1.1, h2c]}{127.0.0.1:0}
[junit4] 2> 2017643 INFO (TEST-TestCloudConsistency.testOutOfSyncReplicasCannotBecomeLeader-seed#[35970B71AC514204]) [ ] o.e.j.s.h.ContextHandler Stopped o.e.j.s.ServletContextHandler@65419b2e{/solr,null,UNAVAILABLE}
[junit4] 2> 2017644 INFO (TEST-TestCloudConsistency.testOutOfSyncReplicasCannotBecomeLeader-seed#[35970B71AC514204]) [ ] o.e.j.s.session node0 Stopped scavenging
[junit4] 2> 2017644 INFO (TEST-TestCloudConsistency.testOutOfSyncReplicasCannotBecomeLeader-seed#[35970B71AC514204]) [ ] o.a.s.c.s.e.JettySolrRunner Start Jetty (original configured port=0)
[junit4] 2> 2017645 WARN (TEST-TestCloudConsistency.testOutOfSyncReplicasCannotBecomeLeader-seed#[35970B71AC514204]) [ ] o.e.j.s.AbstractConnector Ignoring deprecated socket close linger time
[junit4] 2> 2017645 INFO (TEST-TestCloudConsistency.testOutOfSyncReplicasCannotBecomeLeader-seed#[35970B71AC514204]) [ ] o.a.s.c.s.e.JettySolrRunner Trying to start Jetty on port 0 try number 1 ...
[junit4] 2> 2017645 INFO (TEST-TestCloudConsistency.testOutOfSyncReplicasCannotBecomeLeader-seed#[35970B71AC514204]) [ ] o.e.j.s.Server jetty-9.4.14.v20181114; built: 2018-11-14T21:20:31.478Z; git: c4550056e785fb5665914545889f21dc136ad9e6; jvm 11.0.1+13-LTS
[junit4] 2> 2017647 INFO (TEST-TestCloudConsistency.testOutOfSyncReplicasCannotBecomeLeader-seed#[35970B71AC514204]) [ ] o.e.j.s.session DefaultSessionIdManager workerName=node0
[junit4] 2> 2017647 INFO (TEST-TestCloudConsistency.testOutOfSyncReplicasCannotBecomeLeader-seed#[35970B71AC514204]) [ ] o.e.j.s.session No SessionScavenger set, using defaults
[junit4] 2> 2017647 INFO (TEST-TestCloudConsistency.testOutOfSyncReplicasCannotBecomeLeader-seed#[35970B71AC514204]) [ ] o.e.j.s.session node0 Scavenging every 600000ms
[junit4] 2> 2017647 INFO (TEST-TestCloudConsistency.testOutOfSyncReplicasCannotBecomeLeader-seed#[35970B71AC514204]) [ ] o.e.j.s.h.ContextHandler Started o.e.j.s.ServletContextHandler@651aa6d4{/solr,null,AVAILABLE}
[junit4] 2> 2017648 INFO (TEST-TestCloudConsistency.testOutOfSyncReplicasCannotBecomeLeader-seed#[35970B71AC514204]) [ ] o.e.j.s.AbstractConnector Started ServerConnector@16e179c5{HTTP/1.1,[http/1.1, h2c]}{127.0.0.1:35584}
[junit4] 2> 2017648 INFO (TEST-TestCloudConsistency.testOutOfSyncReplicasCannotBecomeLeader-seed#[35970B71AC514204]) [ ] o.e.j.s.Server Started @2017699ms
[junit4] 2> 2017648 INFO (TEST-TestCloudConsistency.testOutOfSyncReplicasCannotBecomeLeader-seed#[35970B71AC514204]) [ ] o.a.s.c.s.e.JettySolrRunner Jetty properties: {hostContext=/solr, hostPort=35955}
[junit4] 2> 2017648 ERROR (TEST-TestCloudConsistency.testOutOfSyncReplicasCannotBecomeLeader-seed#[35970B71AC514204]) [ ] o.a.s.u.StartupLoggingUtils Missing Java Option solr.log.dir. Logging may be missing or incomplete.
[junit4] 2> 2017648 INFO (TEST-TestCloudConsistency.testOutOfSyncReplicasCannotBecomeLeader-seed#[35970B71AC514204]) [ ] o.a.s.s.SolrDispatchFilter Using logger factory org.apache.logging.slf4j.Log4jLoggerFactory
[junit4] 2> 2017648 INFO (TEST-TestCloudConsistency.testOutOfSyncReplicasCannotBecomeLeader-seed#[35970B71AC514204]) [ ] o.a.s.s.SolrDispatchFilter ___ _ Welcome to Apache Solr? version 9.0.0
[junit4] 2> 2017648 INFO (TEST-TestCloudConsistency.testOutOfSyncReplicasCannotBecomeLeader-seed#[35970B71AC514204]) [ ] o.a.s.s.SolrDispatchFilter / __| ___| |_ _ Starting in cloud mode on port null
[junit4] 2> 2017648 INFO (TEST-TestCloudConsistency.testOutOfSyncReplicasCannotBecomeLeader-seed#[35970B71AC514204]) [ ] o.a.s.s.SolrDispatchFilter \__ \/ _ \ | '_| Install dir: null
[junit4] 2> 2017648 INFO (TEST-TestCloudConsistency.testOutOfSyncReplicasCannotBecomeLeader-seed#[35970B71AC514204]) [ ] o.a.s.s.SolrDispatchFilter |___/\___/_|_| Start time: 2019-06-08T05:15:42.680974Z
[junit4] 2> 2017651 INFO (TEST-TestCloudConsistency.testOutOfSyncReplicasCannotBecomeLeader-seed#[35970B71AC514204]) [ ] o.a.s.c.c.ConnectionManager Waiting for client to connect to ZooKeeper
[junit4] 2> 2017651 INFO (zkConnectionManagerCallback-14467-thread-1) [ ] o.a.s.c.c.ConnectionManager zkClient has connected
[junit4] 2> 2017651 INFO (TEST-TestCloudConsistency.testOutOfSyncReplicasCannotBecomeLeader-seed#[35970B71AC514204]) [ ] o.a.s.c.c.ConnectionManager Client is connected to ZooKeeper
[junit4] 2> 2017652 INFO (OverseerStateUpdate-73440776517124106-127.0.0.1:43871_solr-n_0000000002) [n:127.0.0.1:43871_solr ] o.a.s.c.Overseer Starting to work on the main queue : 127.0.0.1:43871_solr
[junit4] 2> 2017653 INFO (TEST-TestCloudConsistency.testOutOfSyncReplicasCannotBecomeLeader-seed#[35970B71AC514204]) [ ] o.a.s.s.SolrDispatchFilter solr.xml found in ZooKeeper. Loading...
[junit4] 2> 2017903 INFO (TEST-TestCloudConsistency.testOutOfSyncReplicasCannotBecomeLeader-seed#[35970B71AC514204]) [ ] o.a.s.h.c.HttpShardHandlerFactory Host whitelist initialized: WhitelistHostChecker [whitelistHosts=null, whitelistHostCheckingEnabled=true]
[junit4] 2> 2017917 WARN (TEST-TestCloudConsistency.testOutOfSyncReplicasCannotBecomeLeader-seed#[35970B71AC514204]) [ ] o.e.j.u.s.S.config No Client EndPointIdentificationAlgorithm configured for SslContextFactory@29ce0a42[provider=null,keyStore=null,trustStore=null]
[junit4] 2> 2017941 WARN (TEST-TestCloudConsistency.testOutOfSyncReplicasCannotBecomeLeader-seed#[35970B71AC514204]) [ ] o.e.j.u.s.S.config No Client EndPointIdentificationAlgorithm configured for SslContextFactory@925f6e5[provider=null,keyStore=null,trustStore=null]
[junit4] 2> 2017943 INFO (TEST-TestCloudConsistency.testOutOfSyncReplicasCannotBecomeLeader-seed#[35970B71AC514204]) [ ] o.a.s.c.ZkContainer Zookeeper client=127.0.0.1:40439/solr
[junit4] 2> 2017964 INFO (TEST-TestCloudConsistency.testOutOfSyncReplicasCannotBecomeLeader-seed#[35970B71AC514204]) [ ] o.a.s.c.c.ConnectionManager Waiting for client to connect to ZooKeeper
[junit4] 2> 2017975 INFO (zkConnectionManagerCallback-14474-thread-1) [ ] o.a.s.c.c.ConnectionManager zkClient has connected
[junit4] 2> 2017975 INFO (TEST-TestCloudConsistency.testOutOfSyncReplicasCannotBecomeLeader-seed#[35970B71AC514204]) [ ] o.a.s.c.c.ConnectionManager Client is connected to ZooKeeper
[junit4] 2> 2018096 INFO (TEST-TestCloudConsistency.testOutOfSyncReplicasCannotBecomeLeader-seed#[35970B71AC514204]) [ ] o.a.s.c.c.ConnectionManager Waiting for client to connect to ZooKeeper
[junit4] 2> 2018096 INFO (zkConnectionManagerCallback-14476-thread-1) [ ] o.a.s.c.c.ConnectionManager zkClient has connected
[junit4] 2> 2018096 INFO (TEST-TestCloudConsistency.testOutOfSyncReplicasCannotBecomeLeader-seed#[35970B71AC514204]) [ ] o.a.s.c.c.ConnectionManager Client is connected to ZooKeeper
[junit4] 2> 2018105 INFO (TEST-TestCloudConsistency.testOutOfSyncReplicasCannotBecomeLeader-seed#[35970B71AC514204]) [ ] o.a.s.c.c.ZkStateReader Updated live nodes from ZooKeeper... (0) -> (3)
[junit4] 2> 2018115 INFO (TEST-TestCloudConsistency.testOutOfSyncReplicasCannotBecomeLeader-seed#[35970B71AC514204]) [ ] o.a.s.c.ZkController Publish node=127.0.0.1:35955_solr as DOWN
[junit4] 2> 2018117 INFO (TEST-TestCloudConsistency.testOutOfSyncReplicasCannotBecomeLeader-seed#[35970B71AC514204]) [ ] o.a.s.c.TransientSolrCoreCacheDefault Allocating transient cache for 2147483647 transient cores
[junit4] 2> 2018117 INFO (TEST-TestCloudConsistency.testOutOfSyncReplicasCannotBecomeLeader-seed#[35970B71AC514204]) [ ] o.a.s.c.ZkController Register node as live in ZooKeeper:/live_nodes/127.0.0.1:35955_solr
[junit4] 2> 2018119 INFO (zkCallback-14437-thread-1) [ ] o.a.s.c.c.ZkStateReader Updated live nodes from ZooKeeper... (3) -> (4)
[junit4] 2> 2018119 INFO (zkCallback-14459-thread-1) [ ] o.a.s.c.c.ZkStateReader Updated live nodes from ZooKeeper... (3) -> (4)
[junit4] 2> 2018120 INFO (zkCallback-14417-thread-1) [ ] o.a.s.c.c.ZkStateReader Updated live nodes from ZooKeeper... (3) -> (4)
[junit4] 2> 2018120 INFO (zkCallback-14452-thread-1) [ ] o.a.s.c.c.ZkStateReader Updated live nodes from ZooKeeper... (3) -> (4)
[junit4] 2> 2018120 INFO (zkCallback-14423-thread-1) [ ] o.a.s.c.c.ZkStateReader Updated live nodes from ZooKeeper... (3) -> (4)
[junit4] 2> 2018120 INFO (zkCallback-14430-thread-1) [ ] o.a.s.c.c.ZkStateReader Updated live nodes from ZooKeeper... (3) -> (4)
[junit4] 2> 2018120 INFO (zkCallback-14388-thread-1) [ ] o.a.s.c.c.ZkStateReader Updated live nodes from ZooKeeper... (3) -> (4)
[junit4] 2> 2018124 INFO (zkCallback-14475-thread-1) [ ] o.a.s.c.c.ZkStateReader Updated live nodes from ZooKeeper... (3) -> (4)
[junit4] 2> 2018134 INFO (TEST-TestCloudConsistency.testOutOfSyncReplicasCannotBecomeLeader-seed#[35970B71AC514204]) [ ] o.a.s.c.c.ConnectionManager Waiting for client to connect to ZooKeeper
[junit4] 2> 2018144 INFO (zkConnectionManagerCallback-14483-thread-1) [ ] o.a.s.c.c.ConnectionManager zkClient has connected
[junit4] 2> 2018145 INFO (TEST-TestCloudConsistency.testOutOfSyncReplicasCannotBecomeLeader-seed#[35970B71AC514204]) [ ] o.a.s.c.c.ConnectionManager Client is connected to ZooKeeper
[junit4] 2> 2018150 INFO (TEST-TestCloudConsistency.testOutOfSyncReplicasCannotBecomeLeader-seed#[35970B71AC514204]) [ ] o.a.s.c.c.ZkStateReader Updated live nodes from ZooKeeper... (0) -> (4)
[junit4] 2> 2018153 INFO (TEST-TestCloudConsistency.testOutOfSyncReplicasCannotBecomeLeader-seed#[35970B71AC514204]) [ ] o.a.s.c.s.i.ZkClientClusterStateProvider Cluster at 127.0.0.1:40439/solr ready
[junit4] 2> 2018201 INFO (TEST-TestCloudConsistency.testOutOfSyncReplicasCannotBecomeLeader-seed#[35970B71AC514204]) [ ] o.a.s.h.a.MetricsHistoryHandler No .system collection, keeping metrics history in memory.
[junit4] 2> 2018249 INFO (TEST-TestCloudConsistency.testOutOfSyncReplicasCannotBecomeLeader-seed#[35970B71AC514204]) [ ] o.a.s.m.r.SolrJmxReporter JMX monitoring for 'solr_35955.solr.node' (registry 'solr.node') enabled at server: com.sun.jmx.mbeanserver.JmxMBeanServer@69c45d78
[junit4] 2> 2018275 INFO (TEST-TestCloudConsistency.testOutOfSyncReplicasCannotBecomeLeader-seed#[35970B71AC514204]) [ ] o.a.s.m.r.SolrJmxReporter JMX monitoring for 'solr_35955.solr.jvm' (registry 'solr.jvm') enabled at server: com.sun.jmx.mbeanserver.JmxMBeanServer@69c45d78
[junit4] 2> 2018275 INFO (TEST-TestCloudConsistency.testOutOfSyncReplicasCannotBecomeLeader-seed#[35970B71AC514204]) [ ] o.a.s.m.r.SolrJmxReporter JMX monitoring for 'solr_35955.solr.jetty' (registry 'solr.jetty') enabled at server: com.sun.jmx.mbeanserver.JmxMBeanServer@69c45d78
[junit4] 2> 2018277 INFO (TEST-TestCloudConsistency.testOutOfSyncReplicasCannotBecomeLeader-seed#[35970B71AC514204]) [ ] o.a.s.c.CorePropertiesLocator Found 0 core definitions underneath /x1/jenkins/jenkins-slave/workspace/Lucene-Solr-BadApples-Tests-master/solr/build/solr-core/test/J0/temp/solr.cloud.TestCloudConsistency_35970B71AC514204-001/tempDir-001/node3/.
[junit4] 2> 2018391 INFO (TEST-TestCloudConsistency.testOutOfSyncReplicasCannotBecomeLeader-seed#[35970B71AC514204]) [ ] o.a.s.c.TestCloudConsistency Adding proxy for URL: http://127.0.0.1:35584/solr. Proxy: http://127.0.0.1:35955/solr
[junit4] 2> 2018391 INFO (TEST-TestCloudConsistency.testOutOfSyncReplicasCannotBecomeLeader-seed#[35970B71AC514204]) [ ] o.a.s.c.CoreContainer Shutting down CoreContainer instance=1153801749
[junit4] 2> 2018391 INFO (TEST-TestCloudConsistency.testOutOfSyncReplicasCannotBecomeLeader-seed#[35970B71AC514204]) [ ] o.a.s.c.ZkController Remove node as live in ZooKeeper:/live_nodes/127.0.0.1:44322_solr
[junit4] 2> 2018392 INFO (TEST-TestCloudConsistency.testOutOfSyncReplicasCannotBecomeLeader-seed#[35970B71AC514204]) [ ] o.a.s.c.ZkController Publish this node as DOWN...
[junit4] 2> 2018392 INFO (TEST-TestCloudConsistency.testOutOfSyncReplicasCannotBecomeLeader-seed#[35970B71AC514204]) [ ] o.a.s.c.ZkController Publish node=127.0.0.1:44322_solr as DOWN
[junit4] 2> 2018396 INFO (TEST-TestCloudConsistency.testOutOfSyncReplicasCannotBecomeLeader-seed#[35970B71AC514204]) [ ] o.a.s.m.SolrMetricManager Closing metric reporters for registry=solr.node, tag=null
[junit4] 2> 2018396 INFO (TEST-TestCloudConsistency.testOutOfSyncReplicasCannotBecomeLeader-seed#[35970B71AC514204]) [ ] o.a.s.m.r.SolrJmxReporter Closing reporter [org.apache.solr.metrics.reporters.SolrJmxReporter@9fb5eb8: rootName = solr_44322, domain = solr.node, service url = null, agent id = null] for registry solr.node / com.codahale.metrics.MetricRegistry@464fb437
[junit4] 2> 2018412 INFO (TEST-TestCloudConsistency.testOutOfSyncReplicasCannotBecomeLeader-seed#[35970B71AC514204]) [ ] o.a.s.m.SolrMetricManager Closing metric reporters for registry=solr.jvm, tag=null
[junit4] 2> 2018412 INFO (TEST-TestCloudConsistency.testOutOfSyncReplicasCannotBecomeLeader-seed#[35970B71AC514204]) [ ] o.a.s.m.r.SolrJmxReporter Closing reporter [org.apache.solr.metrics.reporters.SolrJmxReporter@4a0d7b14: rootName = solr_44322, domain = solr.jvm, service url = null, agent id = null] for registry solr.jvm / com.codahale.metrics.MetricRegistry@ae3a47d
[junit4] 2> 2018421 INFO (TEST-TestCloudConsistency.testOutOfSyncReplicasCannotBecomeLeader-seed#[35970B71AC514204]) [ ] o.a.s.m.SolrMetricManager Closing metric reporters for registry=solr.jetty, tag=null
[junit4] 2> 2018421 INFO (TEST-TestCloudConsistency.testOutOfSyncReplicasCannotBecomeLeader-seed#[35970B71AC514204]) [ ] o.a.s.m.r.SolrJmxReporter Closing reporter [org.apache.solr.metrics.reporters.SolrJmxReporter@3661f559: rootName = solr_44322, domain = solr.jetty, service url = null, agent id = null] for registry solr.jetty / com.codahale.metrics.MetricRegistry@78bfec91
[junit4] 2> 2018421 INFO (TEST-TestCloudConsistency.testOutOfSyncReplicasCannotBecomeLeader-seed#[35970B71AC514204]) [ ] o.a.s.m.SolrMetricManager Closing metric reporters for registry=solr.cluster, tag=null
[junit4] 2> 2018438 INFO (zkCallback-14437-thread-1) [ ] o.a.s.c.c.ZkStateReader Updated live nodes from ZooKeeper... (4) -> (3)
[junit4] 2> 2018439 INFO (zkCallback-14459-thread-1) [ ] o.a.s.c.c.ZkStateReader Updated live nodes from ZooKeeper... (4) -> (3)
[junit4] 2> 2018439 INFO (zkCallback-14430-thread-1) [ ] o.a.s.c.c.ZkStateReader Updated live nodes from ZooKeeper... (4) -> (3)
[junit4] 2> 2018528 INFO (zkCallback-14423-thread-1) [ ] o.a.s.c.c.ZkStateReader Updated live nodes from ZooKeeper... (4) -> (3)
[junit4] 2> 2018528 INFO (zkCallback-14388-thread-1) [ ] o.a.s.c.c.ZkStateReader Updated live nodes from ZooKeeper... (4) -> (3)
[junit4] 2> 2018528 INFO (zkCallback-14452-thread-2) [ ] o.a.s.c.c.ZkStateReader Updated live nodes from ZooKeeper... (4) -> (3)
[junit4] 2> 2018528 INFO (zkCallback-14475-thread-1) [ ] o.a.s.c.c.ZkStateReader Updated live nodes from ZooKeeper... (4) -> (3)
[junit4] 2> 2018528 INFO (zkCallback-14482-thread-1) [ ] o.a.s.c.c.ZkStateReader Updated live nodes from ZooKeeper... (4) -> (3)
[junit4] 2> 2018630 INFO (TEST-TestCloudConsistency.testOutOfSyncReplicasCannotBecomeLeader-seed#[35970B71AC514204]) [ ] o.e.j.s.AbstractConnector Stopped ServerConnector@155a0bcb{HTTP/1.1,[http/1.1, h2c]}{127.0.0.1:0}
[junit4] 2> 2018630 INFO (TEST-TestCloudConsistency.testOutOfSyncReplicasCannotBecomeLeader-seed#[35970B71AC514204]) [ ] o.e.j.s.h.ContextHandler Stopped o.e.j.s.ServletContextHandler@ecc167d{/solr,null,UNAVAILABLE}
[junit4] 2> 2018631 INFO (TEST-TestCloudConsistency.testOutOfSyncReplicasCannotBecomeLeader-seed#[35970B71AC514204]) [ ] o.e.j.s.session node0 Stopped scavenging
[junit4] 2> 2018632 INFO (TEST-TestCloudConsistency.testOutOfSyncReplicasCannotBecomeLeader-seed#[35970B71AC514204]) [ ] o.a.s.c.s.e.JettySolrRunner Start Jetty (original configured port=0)
[junit4] 2> 2018632 WARN (TEST-TestCloudConsistency.testOutOfSyncReplicasCannotBecomeLeader-seed#[35970B71AC514204]) [ ] o.e.j.s.AbstractConnector Ignoring deprecated socket close linger time
[junit4] 2> 2018633 INFO (TEST-TestCloudConsistency.testOutOfSyncReplicasCannotBecomeLeader-seed#[35970B71AC514204]) [ ] o.a.s.c.s.e.JettySolrRunner Trying to start Jetty on port 0 try number 1 ...
[junit4] 2> 2018633 INFO (TEST-TestCloudConsistency.testOutOfSyncReplicasCannotBecomeLeader-seed#[35970B71AC514204]) [ ] o.e.j.s.Server jetty-9.4.14.v20181114; built: 2018-11-14T21:20:31.478Z; git: c4550056e785fb5665914545889f21dc136ad9e6; jvm 11.0.1+13-LTS
[junit4] 2> 2018635 INFO (TEST-TestCloudConsistency.testOutOfSyncReplicasCannotBecomeLeader-seed#[35970B71AC514204]) [ ] o.e.j.s.session DefaultSessionIdManager workerName=node0
[junit4] 2> 2018635 INFO (TEST-TestCloudConsistency.testOutOfSyncReplicasCannotBecomeLeader-seed#[35970B71AC514204]) [ ] o.e.j.s.session No SessionScavenger set, using defaults
[junit4] 2> 2018635 INFO (TEST-TestCloudConsistency.testOutOfSyncReplicasCannotBecomeLeader-seed#[35970B71AC514204]) [ ] o.e.j.s.session node0 Scavenging every 600000ms
[junit4] 2> 2018636 INFO (TEST-TestCloudConsistency.testOutOfSyncReplicasCannotBecomeLeader-seed#[35970B71AC514204]) [ ] o.e.j.s.h.ContextHandler Started o.e.j.s.ServletContextHandler@6123864a{/solr,null,AVAILABLE}
[junit4] 2> 2018644 INFO (TEST-TestCloudConsistency.testOutOfSyncReplicasCannotBecomeLeader-seed#[35970B71AC514204]) [ ] o.e.j.s.AbstractConnector Started ServerConnector@24431854{HTTP/1.1,[http/1.1, h2c]}{127.0.0.1:33460}
[junit4] 2> 2018644 INFO (TEST-TestCloudConsistency.testOutOfSyncReplicasCannotBecomeLeader-seed#[35970B71AC514204]) [ ] o.e.j.s.Server Started @2018695ms
[junit4] 2> 2018644 INFO (TEST-TestCloudConsistency.testOutOfSyncReplicasCannotBecomeLeader-seed#[35970B71AC514204]) [ ] o.a.s.c.s.e.JettySolrRunner Jetty properties: {hostContext=/solr, hostPort=45957}
[junit4] 2> 2018645 ERROR (TEST-TestCloudConsistency.testOutOfSyncReplicasCannotBecomeLeader-seed#[35970B71AC514204]) [ ] o.a.s.u.StartupLoggingUtils Missing Java Option solr.log.dir. Logging may be missing or incomplete.
[junit4] 2> 2018645 INFO (TEST-TestCloudConsistency.testOutOfSyncReplicasCannotBecomeLeader-seed#[35970B71AC514204]) [ ] o.a.s.s.SolrDispatchFilter Using logger factory org.apache.logging.slf4j.Log4jLoggerFactory
[junit4] 2> 2018645 INFO (TEST-TestCloudConsistency.testOutOfSyncReplicasCannotBecomeLeader-seed#[35970B71AC514204]) [ ] o.a.s.s.SolrDispatchFilter ___ _ Welcome to Apache Solr? version 9.0.0
[junit4] 2> 2018645 INFO (TEST-TestCloudConsistency.testOutOfSyncReplicasCannotBecomeLeader-seed#[35970B71AC514204]) [ ] o.a.s.s.SolrDispatchFilter / __| ___| |_ _ Starting in cloud mode on port null
[junit4] 2> 2018645 INFO (TEST-TestCloudConsistency.testOutOfSyncReplicasCannotBecomeLeader-seed#[35970B71AC514204]) [ ] o.a.s.s.SolrDispatchFilter \__ \/ _ \ | '_| Install dir: null
[junit4] 2> 2018645 INFO (TEST-TestCloudConsistency.testOutOfSyncReplicasCannotBecomeLeader-seed#[35970B71AC514204]) [ ] o.a.s.s.SolrDispatchFilter |___/\___/_|_| Start time: 2019-06-08T05:15:43.677479Z
[junit4] 2> 2018657 INFO (TEST-TestCloudConsistency.testOutOfSyncReplicasCannotBecomeLeader-seed#[35970B71AC514204]) [ ] o.a.s.c.c.ConnectionManager Waiting for client to connect to ZooKeeper
[junit4] 2> 2018658 INFO (zkConnectionManagerCallback-14490-thread-1) [ ] o.a.s.c.c.ConnectionManager zkClient has connected
[junit4] 2> 2018659 INFO (TEST-TestCloudConsistency.testOutOfSyncReplicasCannotBecomeLeader-seed#[35970B71AC514204]) [ ] o.a.s.c.c.ConnectionManager Client is connected to ZooKeeper
[junit4] 2> 2018660 INFO (TEST-TestCloudConsistency.testOutOfSyncReplicasCannotBecomeLeader-seed#[35970B71AC514204]) [ ] o.a.s.s.SolrDispatchFilter solr.xml found in ZooKeeper. Loading...
[junit4] 2> 2019151 INFO (TEST-TestCloudConsistency.testOutOfSyncReplicasCannotBecomeLeader-seed#[35970B71AC514204]) [ ] o.a.s.h.c.HttpShardHandlerFactory Host whitelist initialized: WhitelistHostChecker [whitelistHosts=null, whitelistHostCheckingEnabled=true]
[junit4] 2> 2019152 WARN (TEST-TestCloudConsistency.testOutOfSyncReplicasCannotBecomeLeader-seed#[35970B71AC514204]) [ ] o.e.j.u.s.S.config No Client EndPointIdentificationAlgorithm configured for SslContextFactory@6cc74c55[provider=null,keyStore=null,trustStore=null]
[junit4] 2> 2019156 WARN (TEST-TestCloudConsistency.testOutOfSyncReplicasCannotBecomeLeader-seed#[35970B71AC514204]) [ ] o.e.j.u.s.S.config No Client EndPointIdentificationAlgorithm configured for SslContextFactory@2b5d1101[provider=null,keyStore=null,trustStore=null]
[junit4] 2> 2019157 INFO (TEST-TestCloudConsistency.testOutOfSyncReplicasCannotBecomeLeader-seed#[35970B71AC514204]) [ ] o.a.s.c.ZkContainer Zookeeper client=127.0.0.1:40439/solr
[junit4] 2> 2019159 INFO (TEST-TestCloudConsistency.testOutOfSyncReplicasCannotBecomeLeader-seed#[35970B71AC514204]) [ ] o.a.s.c.c.ConnectionManager Waiting for client to connect to ZooKeeper
[junit4] 2> 2019160 INFO (zkConnectionManagerCallback-14497-thread-1) [ ] o.a.s.c.c.ConnectionManager zkClient has connected
[junit4] 2> 2019160 INFO (TEST-TestCloudConsistency.testOutOfSyncReplicasCannotBecomeLeader-seed#[35970B71AC514204]) [ ] o.a.s.c.c.ConnectionManager Client is connected to ZooKeeper
[junit4] 2> 2019263 INFO (TEST-TestCloudConsistency.testOutOfSyncReplicasCannotBecomeLeader-seed#[35970B71AC514204]) [ ] o.a.s.c.c.ConnectionManager Waiting for client to connect to ZooKeeper
[junit4] 2> 2019265 INFO (zkConnectionManagerCallback-14499-thread-1) [ ] o.a.s.c.c.ConnectionManager zkClient has connected
[junit4] 2> 2019265 INFO (TEST-TestCloudConsistency.testOutOfSyncReplicasCannotBecomeLeader-seed#[35970B71AC514204]) [ ] o.a.s.c.c.ConnectionManager Client is connected to ZooKeeper
[junit4] 2> 2019272 INFO (TEST-TestCloudConsistency.testOutOfSyncReplicasCannotBecomeLeader-seed#[35970B71AC514204]) [ ] o.a.s.c.c.ZkStateReader Updated live nodes from ZooKeeper... (0) -> (3)
[junit4] 2> 2019278 INFO (TEST-TestCloudConsistency.testOutOfSyncReplicasCannotBecomeLeader-seed#[35970B71AC514204]) [ ] o.a.s.c.ZkController Publish node=127.0.0.1:45957_solr as DOWN
[junit4] 2> 2019279 INFO (TEST-TestCloudConsistency.testOutOfSyncReplicasCannotBecomeLeader-seed#[35970B71AC514204]) [ ] o.a.s.c.TransientSolrCoreCacheDefault Allocating transient cache for 2147483647 transient cores
[junit4] 2> 2019279 INFO (TEST-TestCloudConsistency.testOutOfSyncReplicasCannotBecomeLeader-seed#[35970B71AC514204]) [ ] o.a.s.c.ZkController Register node as live in ZooKeeper:/live_nodes/127.0.0.1:45957_solr
[junit4] 2> 2019281 INFO (zkCallback-14475-thread-1) [ ] o.a.s.c.c.ZkStateReader Updated live nodes from ZooKeeper... (3) -> (4)
[junit4] 2> 2019281 INFO (zkCallback-14459-thread-1) [ ] o.a.s.c.c.ZkStateReader Updated live nodes from ZooKeeper... (3) -> (4)
[junit4] 2> 2019281 INFO (zkCallback-14482-thread-1) [ ] o.a.s.c.c.ZkStateReader Updated live nodes from ZooKeeper... (3) -> (4)
[junit4] 2> 2019281 INFO (zkCallback-14423-thread-1) [ ] o.a.s.c.c.ZkStateReader Updated live nodes from ZooKeeper... (3) -> (4)
[junit4] 2> 2019281 INFO (zkCallback-14388-thread-1) [ ] o.a.s.c.c.ZkStateReader Updated live nodes from ZooKeeper... (3) -> (4)
[junit4] 2> 2019282 INFO (zkCallback-14452-thread-2) [ ] o.a.s.c.c.ZkStateReader Updated live nodes from ZooKeeper... (3) -> (4)
[junit4] 2> 2019282 INFO (zkCallback-14437-thread-1) [ ] o.a.s.c.c.ZkStateReader Updated live nodes from ZooKeeper... (3) -> (4)
[junit4] 2> 2019282 INFO (zkCallback-14498-thread-1) [ ] o.a.s.c.c.ZkStateReader Updated live nodes from ZooKeeper... (3) -> (4)
[junit4] 2> 2019284 INFO (TEST-TestCloudConsistency.testOutOfSyncReplicasCannotBecomeLeader-seed#[35970B71AC514204]) [ ] o.a.s.c.c.ConnectionManager Waiting for client to connect to ZooKeeper
[junit4] 2> 2019285 INFO (zkConnectionManagerCallback-14506-thread-1) [ ] o.a.s.c.c.ConnectionManager zkClient has connected
[junit4] 2> 2019285 INFO (TEST-TestCloudConsistency.testOutOfSyncReplicasCannotBecomeLeader-seed#[35970B71AC514204]) [ ] o.a.s.c.c.ConnectionManager Client is connected to ZooKeeper
[junit4] 2> 2019287 INFO (TEST-TestCloudConsistency.testOutOfSyncReplicasCannotBecomeLeader-seed#[35970B71AC514204]) [ ] o.a.s.c.c.ZkStateReader Updated live nodes from ZooKeeper... (0) -> (4)
[junit4] 2> 2019289 INFO (TEST-TestCloudConsistency.testOutOfSyncReplicasCannotBecomeLeader-seed#[35970B71AC514204]) [ ] o.a.s.c.s.i.ZkClientClusterStateProvider Cluster at 127.0.0.1:40439/solr ready
[junit4] 2> 2019308 INFO (TEST-TestCloudConsistency.testOutOfSyncReplicasCannotBecomeLeader-seed#[35970B71AC514204]) [ ] o.a.s.h.a.MetricsHistoryHandler No .system collection, keeping metrics history in memory.
[junit4] 2> 2019342 INFO (TEST-TestCloudConsistency.testOutOfSyncReplicasCannotBecomeLeader-seed#[35970B71AC514204]) [ ] o.a.s.m.r.SolrJmxReporter JMX monitoring for 'solr_45957.solr.node' (registry 'solr.node') enabled at server: com.sun.jmx.mbeanserver.JmxMBeanServer@69c45d78
[junit4] 2> 2019367 INFO (TEST-TestCloudConsistency.testOutOfSyncReplicasCannotBe
[...truncated too long message...]
y disallowed.ivy.jars.list as its length is 0.
-ivy-fail-disallowed-ivy-version:
ivy-fail:
ivy-configure:
[ivy:configure] :: loading settings :: file = /x1/jenkins/jenkins-slave/workspace/Lucene-Solr-BadApples-Tests-master/lucene/top-level-ivy-settings.xml
resolve:
ivy-availability-check:
[loadresource] Do not set property disallowed.ivy.jars.list as its length is 0.
-ivy-fail-disallowed-ivy-version:
ivy-fail:
ivy-fail:
ivy-configure:
[ivy:configure] :: loading settings :: file = /x1/jenkins/jenkins-slave/workspace/Lucene-Solr-BadApples-Tests-master/lucene/top-level-ivy-settings.xml
resolve:
ivy-availability-check:
[loadresource] Do not set property disallowed.ivy.jars.list as its length is 0.
-ivy-fail-disallowed-ivy-version:
ivy-fail:
ivy-configure:
[ivy:configure] :: loading settings :: file = /x1/jenkins/jenkins-slave/workspace/Lucene-Solr-BadApples-Tests-master/lucene/top-level-ivy-settings.xml
resolve:
ivy-availability-check:
[loadresource] Do not set property disallowed.ivy.jars.list as its length is 0.
-ivy-fail-disallowed-ivy-version:
ivy-fail:
ivy-fail:
ivy-configure:
[ivy:configure] :: loading settings :: file = /x1/jenkins/jenkins-slave/workspace/Lucene-Solr-BadApples-Tests-master/lucene/top-level-ivy-settings.xml
resolve:
ivy-availability-check:
[loadresource] Do not set property disallowed.ivy.jars.list as its length is 0.
-ivy-fail-disallowed-ivy-version:
ivy-fail:
ivy-fail:
ivy-configure:
[ivy:configure] :: loading settings :: file = /x1/jenkins/jenkins-slave/workspace/Lucene-Solr-BadApples-Tests-master/lucene/top-level-ivy-settings.xml
resolve:
ivy-availability-check:
[loadresource] Do not set property disallowed.ivy.jars.list as its length is 0.
-ivy-fail-disallowed-ivy-version:
ivy-fail:
ivy-fail:
ivy-configure:
[ivy:configure] :: loading settings :: file = /x1/jenkins/jenkins-slave/workspace/Lucene-Solr-BadApples-Tests-master/lucene/top-level-ivy-settings.xml
resolve:
ivy-availability-check:
[loadresource] Do not set property disallowed.ivy.jars.list as its length is 0.
-ivy-fail-disallowed-ivy-version:
ivy-fail:
ivy-fail:
ivy-configure:
[ivy:configure] :: loading settings :: file = /x1/jenkins/jenkins-slave/workspace/Lucene-Solr-BadApples-Tests-master/lucene/top-level-ivy-settings.xml
resolve:
ivy-availability-check:
[loadresource] Do not set property disallowed.ivy.jars.list as its length is 0.
-ivy-fail-disallowed-ivy-version:
ivy-fail:
ivy-fail:
ivy-configure:
[ivy:configure] :: loading settings :: file = /x1/jenkins/jenkins-slave/workspace/Lucene-Solr-BadApples-Tests-master/lucene/top-level-ivy-settings.xml
resolve:
ivy-availability-check:
[loadresource] Do not set property disallowed.ivy.jars.list as its length is 0.
-ivy-fail-disallowed-ivy-version:
ivy-fail:
ivy-fail:
ivy-configure:
[ivy:configure] :: loading settings :: file = /x1/jenkins/jenkins-slave/workspace/Lucene-Solr-BadApples-Tests-master/lucene/top-level-ivy-settings.xml
resolve:
ivy-availability-check:
[loadresource] Do not set property disallowed.ivy.jars.list as its length is 0.
-ivy-fail-disallowed-ivy-version:
ivy-fail:
ivy-fail:
ivy-configure:
[ivy:configure] :: loading settings :: file = /x1/jenkins/jenkins-slave/workspace/Lucene-Solr-BadApples-Tests-master/lucene/top-level-ivy-settings.xml
resolve:
ivy-availability-check:
[loadresource] Do not set property disallowed.ivy.jars.list as its length is 0.
-ivy-fail-disallowed-ivy-version:
ivy-fail:
ivy-fail:
ivy-configure:
[ivy:configure] :: loading settings :: file = /x1/jenkins/jenkins-slave/workspace/Lucene-Solr-BadApples-Tests-master/lucene/top-level-ivy-settings.xml
resolve:
ivy-availability-check:
[loadresource] Do not set property disallowed.ivy.jars.list as its length is 0.
-ivy-fail-disallowed-ivy-version:
ivy-fail:
ivy-fail:
ivy-configure:
[ivy:configure] :: loading settings :: file = /x1/jenkins/jenkins-slave/workspace/Lucene-Solr-BadApples-Tests-master/lucene/top-level-ivy-settings.xml
resolve:
ivy-availability-check:
[loadresource] Do not set property disallowed.ivy.jars.list as its length is 0.
-ivy-fail-disallowed-ivy-version:
ivy-fail:
ivy-fail:
ivy-configure:
[ivy:configure] :: loading settings :: file = /x1/jenkins/jenkins-slave/workspace/Lucene-Solr-BadApples-Tests-master/lucene/top-level-ivy-settings.xml
resolve:
ivy-availability-check:
[loadresource] Do not set property disallowed.ivy.jars.list as its length is 0.
-ivy-fail-disallowed-ivy-version:
ivy-fail:
ivy-fail:
ivy-configure:
[ivy:configure] :: loading settings :: file = /x1/jenkins/jenkins-slave/workspace/Lucene-Solr-BadApples-Tests-master/lucene/top-level-ivy-settings.xml
resolve:
jar-checksums:
[mkdir] Created dir: /x1/jenkins/jenkins-slave/workspace/Lucene-Solr-BadApples-Tests-master/solr/null1320822045
[copy] Copying 248 files to /x1/jenkins/jenkins-slave/workspace/Lucene-Solr-BadApples-Tests-master/solr/null1320822045
[delete] Deleting directory /x1/jenkins/jenkins-slave/workspace/Lucene-Solr-BadApples-Tests-master/solr/null1320822045
check-working-copy:
[ivy:cachepath] :: resolving dependencies :: #;working@lucene1-us-west
[ivy:cachepath] confs: [default]
[ivy:cachepath] found org.eclipse.jgit#org.eclipse.jgit;5.3.0.201903130848-r in public
[ivy:cachepath] found com.jcraft#jsch;0.1.54 in public
[ivy:cachepath] found com.jcraft#jzlib;1.1.1 in public
[ivy:cachepath] found com.googlecode.javaewah#JavaEWAH;1.1.6 in public
[ivy:cachepath] found org.slf4j#slf4j-api;1.7.2 in public
[ivy:cachepath] found org.bouncycastle#bcpg-jdk15on;1.60 in public
[ivy:cachepath] found org.bouncycastle#bcprov-jdk15on;1.60 in public
[ivy:cachepath] found org.bouncycastle#bcpkix-jdk15on;1.60 in public
[ivy:cachepath] found org.slf4j#slf4j-nop;1.7.2 in public
[ivy:cachepath] :: resolution report :: resolve 35ms :: artifacts dl 2ms
---------------------------------------------------------------------
| | modules || artifacts |
| conf | number| search|dwnlded|evicted|| number|dwnlded|
---------------------------------------------------------------------
| default | 9 | 0 | 0 | 0 || 9 | 0 |
---------------------------------------------------------------------
[wc-checker] Initializing working copy...
[wc-checker] Checking working copy status...
-jenkins-base:
BUILD SUCCESSFUL
Total time: 129 minutes 11 seconds
Archiving artifacts
java.lang.InterruptedException: no matches found within 10000
at hudson.FilePath$ValidateAntFileMask.hasMatch(FilePath.java:2847)
at hudson.FilePath$ValidateAntFileMask.invoke(FilePath.java:2726)
at hudson.FilePath$ValidateAntFileMask.invoke(FilePath.java:2707)
at hudson.FilePath$FileCallableWrapper.call(FilePath.java:3086)
Also: hudson.remoting.Channel$CallSiteStackTrace: Remote call to lucene
at hudson.remoting.Channel.attachCallSiteStackTrace(Channel.java:1741)
at hudson.remoting.UserRequest$ExceptionResponse.retrieve(UserRequest.java:357)
at hudson.remoting.Channel.call(Channel.java:955)
at hudson.FilePath.act(FilePath.java:1072)
at hudson.FilePath.act(FilePath.java:1061)
at hudson.FilePath.validateAntFileMask(FilePath.java:2705)
at hudson.tasks.ArtifactArchiver.perform(ArtifactArchiver.java:243)
at hudson.tasks.BuildStepCompatibilityLayer.perform(BuildStepCompatibilityLayer.java:81)
at hudson.tasks.BuildStepMonitor$1.perform(BuildStepMonitor.java:20)
at hudson.model.AbstractBuild$AbstractBuildExecution.perform(AbstractBuild.java:744)
at hudson.model.AbstractBuild$AbstractBuildExecution.performAllBuildSteps(AbstractBuild.java:690)
at hudson.model.Build$BuildExecution.post2(Build.java:186)
at hudson.model.AbstractBuild$AbstractBuildExecution.post(AbstractBuild.java:635)
at hudson.model.Run.execute(Run.java:1835)
at hudson.model.FreeStyleBuild.run(FreeStyleBuild.java:43)
at hudson.model.ResourceController.execute(ResourceController.java:97)
at hudson.model.Executor.run(Executor.java:429)
Caused: hudson.FilePath$TunneledInterruptedException
at hudson.FilePath$FileCallableWrapper.call(FilePath.java:3088)
at hudson.remoting.UserRequest.perform(UserRequest.java:212)
at hudson.remoting.UserRequest.perform(UserRequest.java:54)
at hudson.remoting.Request$2.run(Request.java:369)
at hudson.remoting.InterceptingExecutorService$1.call(InterceptingExecutorService.java:72)
at java.util.concurrent.FutureTask.run(FutureTask.java:266)
at java.util.concurrent.ThreadPoolExecutor.runWorker(ThreadPoolExecutor.java:1142)
at java.util.concurrent.ThreadPoolExecutor$Worker.run(ThreadPoolExecutor.java:617)
at java.lang.Thread.run(Thread.java:748)
Caused: java.lang.InterruptedException: java.lang.InterruptedException: no matches found within 10000
at hudson.FilePath.act(FilePath.java:1074)
at hudson.FilePath.act(FilePath.java:1061)
at hudson.FilePath.validateAntFileMask(FilePath.java:2705)
at hudson.tasks.ArtifactArchiver.perform(ArtifactArchiver.java:243)
at hudson.tasks.BuildStepCompatibilityLayer.perform(BuildStepCompatibilityLayer.java:81)
at hudson.tasks.BuildStepMonitor$1.perform(BuildStepMonitor.java:20)
at hudson.model.AbstractBuild$AbstractBuildExecution.perform(AbstractBuild.java:744)
at hudson.model.AbstractBuild$AbstractBuildExecution.performAllBuildSteps(AbstractBuild.java:690)
at hudson.model.Build$BuildExecution.post2(Build.java:186)
at hudson.model.AbstractBuild$AbstractBuildExecution.post(AbstractBuild.java:635)
at hudson.model.Run.execute(Run.java:1835)
at hudson.model.FreeStyleBuild.run(FreeStyleBuild.java:43)
at hudson.model.ResourceController.execute(ResourceController.java:97)
at hudson.model.Executor.run(Executor.java:429)
No artifacts found that match the file pattern "**/*.events,heapdumps/**,**/hs_err_pid*". Configuration error?
Recording test results
Build step 'Publish JUnit test result report' changed build result to UNSTABLE
Email was triggered for: Unstable (Test Failures)
Sending email for trigger: Unstable (Test Failures)