You are viewing a plain text version of this content. The canonical link for it is here.
Posted to builds@cassandra.apache.org by Apache Jenkins Server <je...@builds.apache.org> on 2025/01/19 16:28:58 UTC
Build complete: Cassandra-4.0 #749 [UNSTABLE] 4bc61e5209d474c50639a4858e273653fbb4e399
-------------------------------------------------------------------------------
Build Cassandra-4.0 #749 Still Unstable
URL: https://ci-cassandra.apache.org/job/Cassandra-4.0/749/
-------------------------------------------------------------------------------
Changes:
[Stefan Miklosovic] Do not attach rows and partitions to CheckForAbort when already attached
-------------------------------------------------------------------------------
Failed Tests:
8 tests failed.
FAILED: dtest-novnode.auth_test.TestNetworkAuth.test_create_dc_validation
FAILED: dtest-offheap.auth_test.TestAuthUnavailable.test_authorization_from_cache_while_unavailable
FAILED: dtest-offheap.cqlsh_tests.test_cqlsh_copy.TestCqlshCopy.test_bulk_round_trip_with_timeouts
FAILED: dtest-offheap.bootstrap_test.TestBootstrap.test_simultaneous_bootstrap
FAILED: dtest-offheap.cqlsh_tests.test_cqlsh_copy.TestCqlshCopy.test_bulk_round_trip_with_single_core
FAILED: dtest.materialized_views_test.TestMaterializedViewsConsistency.test_multi_partition_consistent_reads_after_write
FAILED: dtest.commitlog_test.TestCommitLog.test_mv_lock_contention_during_replay
FAILED: dtest.cqlsh_tests.test_cqlsh_copy.TestCqlshCopy.test_bulk_round_trip_with_timeouts
-------------------------------------------------------------------------------
For complete test report and logs see https://nightlies.apache.org/cassandra/Cassandra-4.0/749/