You are viewing a plain text version of this content. The canonical link for it is here.
Posted to commits@jena.apache.org by Apache Jenkins Server <je...@builds.apache.org> on 2015/05/09 12:08:44 UTC

Build failed in Jenkins: Jena_Development_Deploy #924

See <https://builds.apache.org/job/Jena_Development_Deploy/924/changes>

Changes:

[ajs6f] Using Java 8 types in o.a.j.atlas

[ajs6f] Further simplification in jena-base

[ajs6f] Emendations in response to comments from @afs

[ajs6f] Bringing back NodeTransform

[andy] JENA-934: Skip a prefix of the empty string - not allowed in JSON-LD

[andy] Fix warnings after JENA-931

[andy] Clean code.

[andy] Delete old dev code.

[andy] openjena -> apache.jena

[andy] com.hp.hpl.jena -> org.apache.jena in log4j files

[andy] Fix XML error in POM

[andy] Remove dead code.

[andy] Typo

[andy] Typo

[andy] Rename in NodeFactory: createUncachedLiteral -> createLiteralByValue.

[claude] Fixed issues with plugin versions and repositories in the POM.

------------------------------------------
[...truncated 1881 lines...]
[INFO] 
[INFO] --- maven-resources-plugin:2.6:resources (default-resources) @ jena-fuseki1 ---
[INFO] Using 'UTF-8' encoding to copy filtered resources.
[INFO] Copying 0 resource
[INFO] Copying 1 resource
[INFO] Copying 3 resources
[INFO] 
[INFO] --- maven-compiler-plugin:3.1:compile (default-compile) @ jena-fuseki1 ---
[INFO] Changes detected - recompiling the module!
[INFO] Compiling 70 source files to <https://builds.apache.org/job/Jena_Development_Deploy/ws/jena-fuseki1/target/classes>
[INFO] 
[INFO] --- maven-resources-plugin:2.6:testResources (default-testResources) @ jena-fuseki1 ---
[INFO] Using 'UTF-8' encoding to copy filtered resources.
[INFO] Copying 1 resource
[INFO] Copying 3 resources
[INFO] 
[INFO] --- maven-compiler-plugin:3.1:testCompile (default-testCompile) @ jena-fuseki1 ---
[INFO] Changes detected - recompiling the module!
[INFO] Compiling 8 source files to <https://builds.apache.org/job/Jena_Development_Deploy/ws/jena-fuseki1/target/test-classes>
[INFO] 
[INFO] --- maven-surefire-plugin:2.17:test (default-test) @ jena-fuseki1 ---
[INFO] Surefire report directory: <https://builds.apache.org/job/Jena_Development_Deploy/ws/jena-fuseki1/target/surefire-reports>

-------------------------------------------------------
 T E S T S
-------------------------------------------------------
Running org.apache.jena.fuseki.TS_Fuseki
Tests run: 82, Failures: 0, Errors: 0, Skipped: 0, Time elapsed: 3.333 sec - in org.apache.jena.fuseki.TS_Fuseki

Results :

Tests run: 82, Failures: 0, Errors: 0, Skipped: 0

[JENKINS] Recording test results
[INFO] 
[INFO] --- maven-jar-plugin:2.5:jar (default-jar) @ jena-fuseki1 ---
[INFO] Building jar: <https://builds.apache.org/job/Jena_Development_Deploy/ws/jena-fuseki1/target/jena-fuseki1-1.3.0-SNAPSHOT.jar>
[INFO] 
[INFO] --- maven-site-plugin:3.4:attach-descriptor (attach-descriptor) @ jena-fuseki1 ---
[INFO] 
[INFO] --- maven-javadoc-plugin:2.9.1:jar (attach-javadocs) @ jena-fuseki1 ---
[INFO] 
8 warnings
[WARNING] Javadoc Warnings
[WARNING] javadoc: warning - Error fetching URL: http://jena.apache.org/documentation/javadoc/jena
[WARNING] javadoc: warning - Error fetching URL: http://jena.apache.org/documentation/javadoc/arq
[WARNING] javadoc: warning - Error fetching URL: http://jena.apache.org/documentation/javadoc/tdb
[WARNING] javadoc: warning - Error fetching URL: http://jena.apache.org/documentation/javadoc/text
[WARNING] javadoc: warning - Error fetching URL: http://jena.apache.org/documentation/javadoc/spatial
[WARNING] javadoc: warning - Error fetching URL: http://jena.apache.org/documentation/javadoc/fuseki
[WARNING] javadoc: warning - Error fetching URL: http://jena.apache.org/documentation/javadoc/security
[WARNING] javadoc: warning - Error fetching URL: http://jena.apache.org/documentation/javadoc/jdbc
[INFO] Building jar: <https://builds.apache.org/job/Jena_Development_Deploy/ws/jena-fuseki1/target/jena-fuseki1-1.3.0-SNAPSHOT-javadoc.jar>
[INFO] 
[INFO] --- maven-jar-plugin:2.5:test-jar (default) @ jena-fuseki1 ---
[INFO] Building jar: <https://builds.apache.org/job/Jena_Development_Deploy/ws/jena-fuseki1/target/jena-fuseki1-1.3.0-SNAPSHOT-tests.jar>
[INFO] 
[INFO] --- maven-shade-plugin:2.3:shade (default) @ jena-fuseki1 ---
[INFO] Including org.apache.jena:jena-arq:jar:3.0.0-SNAPSHOT in the shaded jar.
[INFO] Including org.apache.jena:jena-core:jar:3.0.0-SNAPSHOT in the shaded jar.
[INFO] Including org.apache.jena:jena-shaded-guava:jar:3.0.0-SNAPSHOT in the shaded jar.
[INFO] Including com.github.jsonld-java:jsonld-java:jar:0.5.1 in the shaded jar.
[INFO] Including com.fasterxml.jackson.core:jackson-core:jar:2.3.3 in the shaded jar.
[INFO] Including com.fasterxml.jackson.core:jackson-databind:jar:2.3.3 in the shaded jar.
[INFO] Including com.fasterxml.jackson.core:jackson-annotations:jar:2.3.0 in the shaded jar.
[INFO] Including org.apache.httpcomponents:httpclient-cache:jar:4.2.6 in the shaded jar.
[INFO] Including org.apache.thrift:libthrift:jar:0.9.2 in the shaded jar.
[INFO] Including org.apache.commons:commons-csv:jar:1.0 in the shaded jar.
[INFO] Including org.apache.commons:commons-lang3:jar:3.3.2 in the shaded jar.
[INFO] Including org.apache.jena:jena-base:jar:3.0.0-SNAPSHOT in the shaded jar.
[INFO] Including org.apache.jena:jena-iri:jar:3.0.0-SNAPSHOT in the shaded jar.
[INFO] Including xerces:xercesImpl:jar:2.11.0 in the shaded jar.
[INFO] Including xml-apis:xml-apis:jar:1.4.01 in the shaded jar.
[INFO] Including org.apache.jena:jena-tdb:jar:3.0.0-SNAPSHOT in the shaded jar.
[INFO] Including org.apache.jena:jena-text:jar:3.0.0-SNAPSHOT in the shaded jar.
[INFO] Skipping pom dependency org.apache.jena:apache-jena-libs:pom:3.0.0-SNAPSHOT in the shaded jar.
[INFO] Including org.apache.lucene:lucene-core:jar:4.6.1 in the shaded jar.
[INFO] Including org.apache.lucene:lucene-analyzers-common:jar:4.6.1 in the shaded jar.
[INFO] Including org.apache.lucene:lucene-queryparser:jar:4.6.1 in the shaded jar.
[INFO] Including org.apache.lucene:lucene-queries:jar:4.6.1 in the shaded jar.
[INFO] Including org.apache.lucene:lucene-sandbox:jar:4.6.1 in the shaded jar.
[INFO] Including jakarta-regexp:jakarta-regexp:jar:1.4 in the shaded jar.
[INFO] Including org.apache.solr:solr-solrj:jar:4.6.1 in the shaded jar.
[INFO] Including org.apache.zookeeper:zookeeper:jar:3.4.5 in the shaded jar.
[INFO] Including org.noggit:noggit:jar:0.5 in the shaded jar.
[INFO] Including org.apache.httpcomponents:httpmime:jar:4.2.6 in the shaded jar.
[INFO] Including org.codehaus.woodstox:wstx-asl:jar:3.2.7 in the shaded jar.
[INFO] Including org.apache.jena:jena-spatial:jar:3.0.0-SNAPSHOT in the shaded jar.
[INFO] Including org.apache.lucene:lucene-spatial:jar:4.6.1 in the shaded jar.
[INFO] Including com.spatial4j:spatial4j:jar:0.4 in the shaded jar.
[INFO] Including org.apache.httpcomponents:httpclient:jar:4.2.6 in the shaded jar.
[INFO] Including org.apache.httpcomponents:httpcore:jar:4.2.5 in the shaded jar.
[INFO] Including commons-codec:commons-codec:jar:1.6 in the shaded jar.
[INFO] Including commons-fileupload:commons-fileupload:jar:1.3.1 in the shaded jar.
[INFO] Including commons-io:commons-io:jar:2.2 in the shaded jar.
[INFO] Including org.eclipse.jetty:jetty-server:jar:8.1.14.v20131031 in the shaded jar.
[INFO] Including org.eclipse.jetty.orbit:javax.servlet:jar:3.0.0.v201112011016 in the shaded jar.
[INFO] Including org.eclipse.jetty:jetty-continuation:jar:8.1.14.v20131031 in the shaded jar.
[INFO] Including org.eclipse.jetty:jetty-http:jar:8.1.14.v20131031 in the shaded jar.
[INFO] Including org.eclipse.jetty:jetty-io:jar:8.1.14.v20131031 in the shaded jar.
[INFO] Including org.eclipse.jetty:jetty-servlet:jar:8.1.14.v20131031 in the shaded jar.
[INFO] Including org.eclipse.jetty:jetty-servlets:jar:8.1.14.v20131031 in the shaded jar.
[INFO] Including org.eclipse.jetty:jetty-client:jar:8.1.14.v20131031 in the shaded jar.
[INFO] Including org.eclipse.jetty:jetty-xml:jar:8.1.14.v20131031 in the shaded jar.
[INFO] Including org.eclipse.jetty:jetty-security:jar:8.1.14.v20131031 in the shaded jar.
[INFO] Including org.eclipse.jetty:jetty-util:jar:8.1.14.v20131031 in the shaded jar.
[INFO] Including org.apache.velocity:velocity:jar:1.7 in the shaded jar.
[INFO] Including commons-collections:commons-collections:jar:3.2.1 in the shaded jar.
[INFO] Including commons-lang:commons-lang:jar:2.4 in the shaded jar.
[INFO] Including org.slf4j:slf4j-api:jar:1.7.9 in the shaded jar.
[INFO] Including org.slf4j:slf4j-log4j12:jar:1.7.9 in the shaded jar.
[INFO] Including org.slf4j:jcl-over-slf4j:jar:1.7.9 in the shaded jar.
[INFO] Including log4j:log4j:jar:1.2.17 in the shaded jar.
[INFO] Attaching shaded artifact.
[INFO] 
[INFO] --- maven-assembly-plugin:2.4.1:single (create-zip-assembly) @ jena-fuseki1 ---
[INFO] Reading assembly descriptor: assembly-dist.xml
[INFO] Building zip: <https://builds.apache.org/job/Jena_Development_Deploy/ws/jena-fuseki1/target/jena-fuseki1-1.3.0-SNAPSHOT-distribution.zip>
[INFO] Building tar: <https://builds.apache.org/job/Jena_Development_Deploy/ws/jena-fuseki1/target/jena-fuseki1-1.3.0-SNAPSHOT-distribution.tar.gz>
[INFO] 
[INFO] --- maven-install-plugin:2.5.2:install (default-install) @ jena-fuseki1 ---
[INFO] Installing <https://builds.apache.org/job/Jena_Development_Deploy/ws/jena-fuseki1/target/jena-fuseki1-1.3.0-SNAPSHOT.jar> to /home/jenkins/jenkins-slave/maven-repositories/0/org/apache/jena/jena-fuseki1/1.3.0-SNAPSHOT/jena-fuseki1-1.3.0-SNAPSHOT.jar
[INFO] Installing <https://builds.apache.org/job/Jena_Development_Deploy/ws/jena-fuseki1/pom.xml> to /home/jenkins/jenkins-slave/maven-repositories/0/org/apache/jena/jena-fuseki1/1.3.0-SNAPSHOT/jena-fuseki1-1.3.0-SNAPSHOT.pom
[INFO] Installing <https://builds.apache.org/job/Jena_Development_Deploy/ws/jena-fuseki1/target/jena-fuseki1-1.3.0-SNAPSHOT-javadoc.jar> to /home/jenkins/jenkins-slave/maven-repositories/0/org/apache/jena/jena-fuseki1/1.3.0-SNAPSHOT/jena-fuseki1-1.3.0-SNAPSHOT-javadoc.jar
[INFO] Installing <https://builds.apache.org/job/Jena_Development_Deploy/ws/jena-fuseki1/target/jena-fuseki1-1.3.0-SNAPSHOT-tests.jar> to /home/jenkins/jenkins-slave/maven-repositories/0/org/apache/jena/jena-fuseki1/1.3.0-SNAPSHOT/jena-fuseki1-1.3.0-SNAPSHOT-tests.jar
[INFO] Installing <https://builds.apache.org/job/Jena_Development_Deploy/ws/jena-fuseki1/target/jena-fuseki1-1.3.0-SNAPSHOT-server.jar> to /home/jenkins/jenkins-slave/maven-repositories/0/org/apache/jena/jena-fuseki1/1.3.0-SNAPSHOT/jena-fuseki1-1.3.0-SNAPSHOT-server.jar
[INFO] Installing <https://builds.apache.org/job/Jena_Development_Deploy/ws/jena-fuseki1/target/jena-fuseki1-1.3.0-SNAPSHOT-distribution.zip> to /home/jenkins/jenkins-slave/maven-repositories/0/org/apache/jena/jena-fuseki1/1.3.0-SNAPSHOT/jena-fuseki1-1.3.0-SNAPSHOT-distribution.zip
[INFO] Installing <https://builds.apache.org/job/Jena_Development_Deploy/ws/jena-fuseki1/target/jena-fuseki1-1.3.0-SNAPSHOT-distribution.tar.gz> to /home/jenkins/jenkins-slave/maven-repositories/0/org/apache/jena/jena-fuseki1/1.3.0-SNAPSHOT/jena-fuseki1-1.3.0-SNAPSHOT-distribution.tar.gz
[INFO] 
[INFO] --- maven-deploy-plugin:2.8.2:deploy (default-deploy) @ jena-fuseki1 ---
[INFO] Downloading: https://repository.apache.org/content/repositories/snapshots/org/apache/jena/jena-fuseki1/1.3.0-SNAPSHOT/maven-metadata.xml
[INFO] Downloaded: https://repository.apache.org/content/repositories/snapshots/org/apache/jena/jena-fuseki1/1.3.0-SNAPSHOT/maven-metadata.xml (2 KB at 0.0 KB/sec)
[INFO] Uploading: https://repository.apache.org/content/repositories/snapshots/org/apache/jena/jena-fuseki1/1.3.0-SNAPSHOT/jena-fuseki1-1.3.0-20150509.100420-15.jar
[INFO] Uploaded: https://repository.apache.org/content/repositories/snapshots/org/apache/jena/jena-fuseki1/1.3.0-SNAPSHOT/jena-fuseki1-1.3.0-20150509.100420-15.jar (186 KB at 42.4 KB/sec)
[INFO] Uploading: https://repository.apache.org/content/repositories/snapshots/org/apache/jena/jena-fuseki1/1.3.0-SNAPSHOT/jena-fuseki1-1.3.0-20150509.100420-15.pom
[INFO] Uploaded: https://repository.apache.org/content/repositories/snapshots/org/apache/jena/jena-fuseki1/1.3.0-SNAPSHOT/jena-fuseki1-1.3.0-20150509.100420-15.pom (11 KB at 28.1 KB/sec)
[INFO] Downloading: https://repository.apache.org/content/repositories/snapshots/org/apache/jena/jena-fuseki1/maven-metadata.xml
[INFO] Downloaded: https://repository.apache.org/content/repositories/snapshots/org/apache/jena/jena-fuseki1/maven-metadata.xml (387 B at 0.7 KB/sec)
[INFO] Uploading: https://repository.apache.org/content/repositories/snapshots/org/apache/jena/jena-fuseki1/1.3.0-SNAPSHOT/maven-metadata.xml
[INFO] Uploaded: https://repository.apache.org/content/repositories/snapshots/org/apache/jena/jena-fuseki1/1.3.0-SNAPSHOT/maven-metadata.xml (2 KB at 4.3 KB/sec)
[INFO] Uploading: https://repository.apache.org/content/repositories/snapshots/org/apache/jena/jena-fuseki1/maven-metadata.xml
[INFO] Uploaded: https://repository.apache.org/content/repositories/snapshots/org/apache/jena/jena-fuseki1/maven-metadata.xml (387 B at 1.0 KB/sec)
[INFO] Uploading: https://repository.apache.org/content/repositories/snapshots/org/apache/jena/jena-fuseki1/1.3.0-SNAPSHOT/jena-fuseki1-1.3.0-20150509.100420-15-javadoc.jar
[INFO] Uploaded: https://repository.apache.org/content/repositories/snapshots/org/apache/jena/jena-fuseki1/1.3.0-SNAPSHOT/jena-fuseki1-1.3.0-20150509.100420-15-javadoc.jar (397 KB at 299.6 KB/sec)
[INFO] Uploading: https://repository.apache.org/content/repositories/snapshots/org/apache/jena/jena-fuseki1/1.3.0-SNAPSHOT/maven-metadata.xml
[INFO] Uploaded: https://repository.apache.org/content/repositories/snapshots/org/apache/jena/jena-fuseki1/1.3.0-SNAPSHOT/maven-metadata.xml (2 KB at 8.2 KB/sec)
[INFO] Uploading: https://repository.apache.org/content/repositories/snapshots/org/apache/jena/jena-fuseki1/1.3.0-SNAPSHOT/jena-fuseki1-1.3.0-20150509.100420-15-tests.jar
[INFO] Uploaded: https://repository.apache.org/content/repositories/snapshots/org/apache/jena/jena-fuseki1/1.3.0-SNAPSHOT/jena-fuseki1-1.3.0-20150509.100420-15-tests.jar (27 KB at 96.3 KB/sec)
[INFO] Uploading: https://repository.apache.org/content/repositories/snapshots/org/apache/jena/jena-fuseki1/1.3.0-SNAPSHOT/maven-metadata.xml
[INFO] Uploaded: https://repository.apache.org/content/repositories/snapshots/org/apache/jena/jena-fuseki1/1.3.0-SNAPSHOT/maven-metadata.xml (2 KB at 9.7 KB/sec)
[INFO] Uploading: https://repository.apache.org/content/repositories/snapshots/org/apache/jena/jena-fuseki1/1.3.0-SNAPSHOT/jena-fuseki1-1.3.0-20150509.100420-15-server.jar
[INFO] Uploaded: https://repository.apache.org/content/repositories/snapshots/org/apache/jena/jena-fuseki1/1.3.0-SNAPSHOT/jena-fuseki1-1.3.0-20150509.100420-15-server.jar (21877 KB at 2366.8 KB/sec)
[INFO] Uploading: https://repository.apache.org/content/repositories/snapshots/org/apache/jena/jena-fuseki1/1.3.0-SNAPSHOT/maven-metadata.xml
[INFO] Uploaded: https://repository.apache.org/content/repositories/snapshots/org/apache/jena/jena-fuseki1/1.3.0-SNAPSHOT/maven-metadata.xml (2 KB at 5.4 KB/sec)
[INFO] Uploading: https://repository.apache.org/content/repositories/snapshots/org/apache/jena/jena-fuseki1/1.3.0-SNAPSHOT/jena-fuseki1-1.3.0-20150509.100420-15-distribution.zip
[JENKINS] Archiving disabled
[JENKINS] Archiving disabled
[JENKINS] Archiving disabled
[JENKINS] Archiving disabled
[JENKINS] Archiving disabled
[JENKINS] Archiving disabled
[JENKINS] Archiving disabled
[JENKINS] Archiving disabled
[JENKINS] Archiving disabled
[JENKINS] Archiving disabled
[JENKINS] Archiving disabled
[JENKINS] Archiving disabled
[JENKINS] Archiving disabled
[JENKINS] Archiving disabled
[JENKINS] Archiving disabled
[JENKINS] Archiving disabled
[JENKINS] Archiving disabled
[JENKINS] Archiving disabled
[JENKINS] Archiving disabled
[JENKINS] Archiving disabled
[JENKINS] Archiving disabled
[JENKINS] Archiving disabled
[JENKINS] Archiving disabled
[JENKINS] Archiving disabled
[JENKINS] Archiving disabled
[JENKINS] Archiving disabled
[JENKINS] Archiving disabled
[JENKINS] Archiving disabled
[JENKINS] Archiving disabled
[JENKINS] Archiving disabled
[JENKINS] Archiving disabled
[JENKINS] Archiving disabled
[JENKINS] Archiving disabled
[JENKINS] Archiving disabled
[JENKINS] Archiving disabled
[JENKINS] Archiving disabled
[JENKINS] Archiving disabled[INFO] ------------------------------------------------------------------------
[INFO] Reactor Summary:
[INFO] 
[INFO] Apache Jena - Parent .............................. SUCCESS [8.812s]
[INFO] Apache Jena - Shadowed external libraries ......... SUCCESS [12.974s]
[INFO] Apache Jena - IRI ................................. SUCCESS [29.888s]
[INFO] Apache Jena - Base Common Environment ............. SUCCESS [1:11.453s]
[INFO] Apache Jena - Core ................................ SUCCESS [1:14.494s]
[INFO] Apache Jena - ARQ (SPARQL 1.1 Query Engine) ....... SUCCESS [1:15.688s]
[INFO] Apache Jena - TDB (Native Triple Store) ........... SUCCESS [24.227s]
[INFO] Apache Jena - Libraries POM ....................... SUCCESS [5.249s]
[INFO] Apache Jena - SPARQL Text Search .................. SUCCESS [33.050s]
[INFO] Apache Jena - SPARQL Spatial Search ............... SUCCESS [30.008s]
[INFO] Apache Jena - Data Tables for RDF and SPARQL ...... SUCCESS [42.189s]
[INFO] Apache Jena - SDB (SQL based triple store) ........ SUCCESS [42.253s]
[INFO] Apache Jena - Fuseki1 ............................. FAILURE [3:01.485s]
[INFO] Apache Jena - Fuseki - A SPARQL 1.1 Server ........ SKIPPED
[INFO] Apache Jena - Fuseki Server Engine ................ SKIPPED
[INFO] Apache Jena - Fuseki WAR File ..................... SKIPPED
[INFO] Apache Jena - Fuseki Server Standalone Jar ........ SKIPPED
[INFO] Apache Jena - Fuseki Binary Distribution .......... SKIPPED
[INFO] Apache Jena - JDBC Parent ......................... SKIPPED
[INFO] Apache Jena - JDBC Core API ....................... SKIPPED
[INFO] Apache Jena - JDBC Remote Endpoint Driver ......... SKIPPED
[INFO] Apache Jena - JDBC In-Memory Driver ............... SKIPPED
[INFO] Apache Jena - JDBC TDB Driver ..................... SKIPPED
[INFO] Apache Jena - JDBC Driver Bundle .................. SKIPPED
[INFO] Apache Jena - Maven Plugins, including schemagen .. SKIPPED
[INFO] Apache Jena - Elephas ............................. SKIPPED
[INFO] Apache Jena - Elephas - Common API ................ SKIPPED
[INFO] Apache Jena - Elephas - I/O ....................... SKIPPED
[INFO] Apache Jena - Elephas - Map/Reduce ................ SKIPPED
[INFO] Apache Jena - Elephas - Statistics Demo App ....... SKIPPED
[INFO] Apache Jena - Distribution ........................ SKIPPED
[INFO] Apache Jena - OSGi ................................ SKIPPED
[INFO] Apache Jena - OSGi bundle ......................... SKIPPED
[INFO] Apache Jena - Extras .............................. SKIPPED
[INFO] Apache Jena - Extras - Query Builder .............. SKIPPED
[INFO] Apache Jena ....................................... SKIPPED
[INFO] ------------------------------------------------------------------------
[INFO] BUILD FAILURE
[INFO] ------------------------------------------------------------------------
[INFO] Total time: 10:46.335s
[INFO] Finished at: Sat May 09 10:05:55 UTC 2015

[INFO] Final Memory: 79M/528M
[INFO] ------------------------------------------------------------------------
[ERROR] Failed to execute goal org.apache.maven.plugins:maven-deploy-plugin:2.8.2:deploy (default-deploy) on project jena-fuseki1: Failed to deploy artifacts: Could not transfer artifact org.apache.jena:jena-fuseki1:zip:distribution:1.3.0-20150509.100420-15 from/to apache.snapshots.https (https://repository.apache.org/content/repositories/snapshots): Failed to transfer file: https://repository.apache.org/content/repositories/snapshots/org/apache/jena/jena-fuseki1/1.3.0-SNAPSHOT/jena-fuseki1-1.3.0-20150509.100420-15-distribution.zip. Return code is: 502, ReasonPhrase: Proxy Error. -> [Help 1]
[ERROR] 
[ERROR] To see the full stack trace of the errors, re-run Maven with the -e switch.
[ERROR] Re-run Maven using the -X switch to enable full debug logging.
[ERROR] 
[ERROR] For more information about the errors and possible solutions, please read the following articles:
[ERROR] [Help 1] http://cwiki.apache.org/confluence/display/MAVEN/MojoExecutionException
[ERROR] 
[ERROR] After correcting the problems, you can resume the build with the command
[ERROR]   mvn <goals> -rf :jena-fuseki1
channel stopped

Jenkins build is back to normal : Jena_Development_Deploy #925

Posted by Apache Jenkins Server <je...@builds.apache.org>.
See <https://builds.apache.org/job/Jena_Development_Deploy/925/changes>