You are viewing a plain text version of this content. The canonical link for it is here.
Posted to dev@kafka.apache.org by Apache Jenkins Server <je...@builds.apache.org> on 2021/02/09 05:26:52 UTC

Build failed in Jenkins: Kafka » kafka-trunk-jdk11 #496

See <https://ci-builds.apache.org/job/Kafka/job/kafka-trunk-jdk11/496/display/redirect?page=changes>

Changes:

[github] MINOR: replace hard-coding utf-8 with StandardCharsets.UTF_8 (#10079)


------------------------------------------
[...truncated 7.11 MB...]

KafkaZkClientTest > testGetConsumerOffsetNoData() STARTED

KafkaZkClientTest > testGetConsumerOffsetNoData() PASSED

KafkaZkClientTest > testDeleteTopicPathMethods() STARTED

KafkaZkClientTest > testDeleteTopicPathMethods() PASSED

KafkaZkClientTest > testSetTopicPartitionStatesRaw() STARTED

KafkaZkClientTest > testSetTopicPartitionStatesRaw() PASSED

KafkaZkClientTest > testAclManagementMethods() STARTED

KafkaZkClientTest > testAclManagementMethods() PASSED

KafkaZkClientTest > testPreferredReplicaElectionMethods() STARTED

KafkaZkClientTest > testPreferredReplicaElectionMethods() PASSED

KafkaZkClientTest > testPropagateLogDir() STARTED

KafkaZkClientTest > testPropagateLogDir() PASSED

KafkaZkClientTest > testGetDataAndStat() STARTED

KafkaZkClientTest > testGetDataAndStat() PASSED

KafkaZkClientTest > testReassignPartitionsInProgress() STARTED

KafkaZkClientTest > testReassignPartitionsInProgress() PASSED

KafkaZkClientTest > testCreateTopLevelPaths() STARTED

KafkaZkClientTest > testCreateTopLevelPaths() PASSED

KafkaZkClientTest > testGetAllTopicsInClusterDoesNotTriggerWatch() STARTED

KafkaZkClientTest > testGetAllTopicsInClusterDoesNotTriggerWatch() PASSED

KafkaZkClientTest > testIsrChangeNotificationGetters() STARTED

KafkaZkClientTest > testIsrChangeNotificationGetters() PASSED

KafkaZkClientTest > testLogDirEventNotificationsDeletion() STARTED

KafkaZkClientTest > testLogDirEventNotificationsDeletion() PASSED

KafkaZkClientTest > testGetLogConfigs() STARTED

KafkaZkClientTest > testGetLogConfigs() PASSED

KafkaZkClientTest > testBrokerSequenceIdMethods() STARTED

KafkaZkClientTest > testBrokerSequenceIdMethods() PASSED

KafkaZkClientTest > testAclMethods() STARTED

KafkaZkClientTest > testAclMethods() PASSED

KafkaZkClientTest > testCreateSequentialPersistentPath() STARTED

KafkaZkClientTest > testCreateSequentialPersistentPath() PASSED

KafkaZkClientTest > testConditionalUpdatePath() STARTED

KafkaZkClientTest > testConditionalUpdatePath() PASSED

KafkaZkClientTest > testGetAllTopicsInClusterTriggersWatch() STARTED

KafkaZkClientTest > testGetAllTopicsInClusterTriggersWatch() PASSED

KafkaZkClientTest > testDeleteTopicZNode() STARTED

KafkaZkClientTest > testDeleteTopicZNode() PASSED

KafkaZkClientTest > testDeletePath() STARTED

KafkaZkClientTest > testDeletePath() PASSED

KafkaZkClientTest > testGetBrokerMethods() STARTED

KafkaZkClientTest > testGetBrokerMethods() PASSED

KafkaZkClientTest > testCreateTokenChangeNotification() STARTED

KafkaZkClientTest > testCreateTokenChangeNotification() PASSED

KafkaZkClientTest > testGetTopicsAndPartitions() STARTED

KafkaZkClientTest > testGetTopicsAndPartitions() PASSED

KafkaZkClientTest > testRegisterBrokerInfo() STARTED

KafkaZkClientTest > testRegisterBrokerInfo() PASSED

KafkaZkClientTest > testRetryRegisterBrokerInfo() STARTED

KafkaZkClientTest > testRetryRegisterBrokerInfo() PASSED

KafkaZkClientTest > testConsumerOffsetPath() STARTED

KafkaZkClientTest > testConsumerOffsetPath() PASSED

KafkaZkClientTest > testDeleteRecursiveWithControllerEpochVersionCheck() STARTED

KafkaZkClientTest > testDeleteRecursiveWithControllerEpochVersionCheck() PASSED

KafkaZkClientTest > testTopicAssignments() STARTED

KafkaZkClientTest > testTopicAssignments() PASSED

KafkaZkClientTest > testControllerManagementMethods() STARTED

KafkaZkClientTest > testControllerManagementMethods() PASSED

KafkaZkClientTest > testTopicAssignmentMethods() STARTED

KafkaZkClientTest > testTopicAssignmentMethods() PASSED

KafkaZkClientTest > testConnectionViaNettyClient() STARTED

KafkaZkClientTest > testConnectionViaNettyClient() PASSED

KafkaZkClientTest > testPropagateIsrChanges() STARTED

KafkaZkClientTest > testPropagateIsrChanges() PASSED

KafkaZkClientTest > testControllerEpochMethods() STARTED

KafkaZkClientTest > testControllerEpochMethods() PASSED

KafkaZkClientTest > testDeleteRecursive() STARTED

KafkaZkClientTest > testDeleteRecursive() PASSED

KafkaZkClientTest > testGetTopicPartitionStates() STARTED

KafkaZkClientTest > testGetTopicPartitionStates() PASSED

KafkaZkClientTest > testCreateConfigChangeNotification() STARTED

KafkaZkClientTest > testCreateConfigChangeNotification() PASSED

KafkaZkClientTest > testDelegationTokenMethods() STARTED

KafkaZkClientTest > testDelegationTokenMethods() PASSED

LiteralAclStoreTest > shouldHaveCorrectPaths() STARTED

LiteralAclStoreTest > shouldHaveCorrectPaths() PASSED

LiteralAclStoreTest > shouldRoundTripChangeNode() STARTED

LiteralAclStoreTest > shouldRoundTripChangeNode() PASSED

LiteralAclStoreTest > shouldThrowFromEncodeOnNoneLiteral() STARTED

LiteralAclStoreTest > shouldThrowFromEncodeOnNoneLiteral() PASSED

LiteralAclStoreTest > shouldWriteChangesToTheWritePath() STARTED

LiteralAclStoreTest > shouldWriteChangesToTheWritePath() PASSED

LiteralAclStoreTest > shouldHaveCorrectPatternType() STARTED

LiteralAclStoreTest > shouldHaveCorrectPatternType() PASSED

LiteralAclStoreTest > shouldDecodeResourceUsingTwoPartLogic() STARTED

LiteralAclStoreTest > shouldDecodeResourceUsingTwoPartLogic() PASSED

ReassignPartitionsZNodeTest > testDecodeInvalidJson() STARTED

ReassignPartitionsZNodeTest > testDecodeInvalidJson() PASSED

ReassignPartitionsZNodeTest > testEncode() STARTED

ReassignPartitionsZNodeTest > testEncode() PASSED

ReassignPartitionsZNodeTest > testDecodeValidJson() STARTED

ReassignPartitionsZNodeTest > testDecodeValidJson() PASSED

ControllerContextTest > testPartitionFullReplicaAssignmentReturnsEmptyAssignmentIfTopicOrPartitionDoesNotExist() STARTED

ControllerContextTest > testPartitionFullReplicaAssignmentReturnsEmptyAssignmentIfTopicOrPartitionDoesNotExist() PASSED

ControllerContextTest > testPartitionReplicaAssignmentForTopicReturnsEmptyMapIfTopicDoesNotExist() STARTED

ControllerContextTest > testPartitionReplicaAssignmentForTopicReturnsEmptyMapIfTopicDoesNotExist() PASSED

ControllerContextTest > testPreferredReplicaImbalanceMetric() STARTED

ControllerContextTest > testPreferredReplicaImbalanceMetric() PASSED

ControllerContextTest > testPartitionReplicaAssignmentForTopicReturnsExpectedReplicaAssignments() STARTED

ControllerContextTest > testPartitionReplicaAssignmentForTopicReturnsExpectedReplicaAssignments() PASSED

ControllerContextTest > testReassignTo() STARTED

ControllerContextTest > testReassignTo() PASSED

ControllerContextTest > testPartitionReplicaAssignment() STARTED

ControllerContextTest > testPartitionReplicaAssignment() PASSED

ControllerContextTest > testUpdatePartitionFullReplicaAssignmentUpdatesReplicaAssignment() STARTED

ControllerContextTest > testUpdatePartitionFullReplicaAssignmentUpdatesReplicaAssignment() PASSED

ControllerContextTest > testReassignToIdempotence() STARTED

ControllerContextTest > testReassignToIdempotence() PASSED

ControllerContextTest > testPartitionReplicaAssignmentReturnsEmptySeqIfTopicOrPartitionDoesNotExist() STARTED

ControllerContextTest > testPartitionReplicaAssignmentReturnsEmptySeqIfTopicOrPartitionDoesNotExist() PASSED

ServerGenerateBrokerIdTest > testBrokerMetadataOnIdCollision() SKIPPED

2564 tests completed, 1 failed, 7 skipped

> Task :core:test FAILED

FAILURE: Build failed with an exception.

* What went wrong:
Execution failed for task ':core:test'.
> Process 'Gradle Test Executor 78' finished with non-zero exit value 1
  This problem might be caused by incorrect test process configuration.
  Please refer to the test execution section in the User Manual at https://docs.gradle.org/6.8.1/userguide/java_testing.html#sec:test_execution

* Try:
Run with --stacktrace option to get the stack trace. Run with --info or --debug option to get more log output. Run with --scan to get full insights.

* Get more help at https://help.gradle.org

Deprecated Gradle features were used in this build, making it incompatible with Gradle 7.0.
Use '--warning-mode all' to show the individual deprecation warnings.
See https://docs.gradle.org/6.8.1/userguide/command_line_interface.html#sec:command_line_warnings

BUILD FAILED in 1h 26m 40s
251 actionable tasks: 244 executed, 7 up-to-date
Build step 'Execute shell' marked build as failure
Recording test results
Not sending mail to unregistered user github@hugo-hirsch.de

Build failed in Jenkins: Kafka » kafka-trunk-jdk11 #498

Posted by Apache Jenkins Server <je...@builds.apache.org>.
See <https://ci-builds.apache.org/job/Kafka/job/kafka-trunk-jdk11/498/display/redirect?page=changes>

Changes:

[github] JUnit extensions for integration tests (#9986)

[github] KAFKA-10021: Changed Kafka backing stores to use shared admin client to get end offsets and create topics (#9780)


------------------------------------------
[...truncated 7.21 MB...]

ControllerEventManagerTest > testSuccessfulEvent() PASSED

ControllerEventManagerTest > testMetricsCleanedOnClose() STARTED

ControllerEventManagerTest > testMetricsCleanedOnClose() PASSED

ControllerChannelManagerTest > testStopReplicaRequestWithAlreadyDefinedDeletedPartition() STARTED

ControllerChannelManagerTest > testStopReplicaRequestWithAlreadyDefinedDeletedPartition() PASSED

ControllerChannelManagerTest > testUpdateMetadataInterBrokerProtocolVersion() STARTED

ControllerChannelManagerTest > testUpdateMetadataInterBrokerProtocolVersion() PASSED

ControllerChannelManagerTest > testLeaderAndIsrRequestIsNew() STARTED

ControllerChannelManagerTest > testLeaderAndIsrRequestIsNew() PASSED

ControllerChannelManagerTest > testStopReplicaRequestsWhileTopicQueuedForDeletion() STARTED

ControllerChannelManagerTest > testStopReplicaRequestsWhileTopicQueuedForDeletion() PASSED

ControllerChannelManagerTest > testLeaderAndIsrRequestSentToLiveOrShuttingDownBrokers() STARTED

ControllerChannelManagerTest > testLeaderAndIsrRequestSentToLiveOrShuttingDownBrokers() PASSED

ControllerChannelManagerTest > testStopReplicaInterBrokerProtocolVersion() STARTED

ControllerChannelManagerTest > testStopReplicaInterBrokerProtocolVersion() PASSED

ControllerChannelManagerTest > testStopReplicaSentOnlyToLiveAndShuttingDownBrokers() STARTED

ControllerChannelManagerTest > testStopReplicaSentOnlyToLiveAndShuttingDownBrokers() PASSED

ControllerChannelManagerTest > testStopReplicaGroupsByBroker() STARTED

ControllerChannelManagerTest > testStopReplicaGroupsByBroker() PASSED

ControllerChannelManagerTest > testUpdateMetadataDoesNotIncludePartitionsWithoutLeaderAndIsr() STARTED

ControllerChannelManagerTest > testUpdateMetadataDoesNotIncludePartitionsWithoutLeaderAndIsr() PASSED

ControllerChannelManagerTest > testMixedDeleteAndNotDeleteStopReplicaRequests() STARTED

ControllerChannelManagerTest > testMixedDeleteAndNotDeleteStopReplicaRequests() PASSED

ControllerChannelManagerTest > testLeaderAndIsrInterBrokerProtocolVersion() STARTED

ControllerChannelManagerTest > testLeaderAndIsrInterBrokerProtocolVersion() PASSED

ControllerChannelManagerTest > testUpdateMetadataRequestSent() STARTED

ControllerChannelManagerTest > testUpdateMetadataRequestSent() PASSED

ControllerChannelManagerTest > testUpdateMetadataRequestDuringTopicDeletion() STARTED

ControllerChannelManagerTest > testUpdateMetadataRequestDuringTopicDeletion() PASSED

ControllerChannelManagerTest > testUpdateMetadataIncludesLiveOrShuttingDownBrokers() STARTED

ControllerChannelManagerTest > testUpdateMetadataIncludesLiveOrShuttingDownBrokers() PASSED

ControllerChannelManagerTest > testStopReplicaRequestSent() STARTED

ControllerChannelManagerTest > testStopReplicaRequestSent() PASSED

ControllerChannelManagerTest > testStopReplicaRequestsWhileTopicDeletionStarted() STARTED

ControllerChannelManagerTest > testStopReplicaRequestsWhileTopicDeletionStarted() PASSED

ControllerChannelManagerTest > testLeaderAndIsrRequestSent() STARTED

ControllerChannelManagerTest > testLeaderAndIsrRequestSent() PASSED

ControllerChannelManagerTest > testStopReplicaRequestWithoutDeletePartitionWhileTopicDeletionStarted() STARTED

ControllerChannelManagerTest > testStopReplicaRequestWithoutDeletePartitionWhileTopicDeletionStarted() PASSED

FeatureZNodeTest > testDecodeFailOnInvalidFeatures() STARTED

FeatureZNodeTest > testDecodeFailOnInvalidFeatures() PASSED

FeatureZNodeTest > testEncodeDecode() STARTED

FeatureZNodeTest > testEncodeDecode() PASSED

FeatureZNodeTest > testDecodeSuccess() STARTED

FeatureZNodeTest > testDecodeSuccess() PASSED

FeatureZNodeTest > testDecodeFailOnInvalidVersionAndStatus() STARTED

FeatureZNodeTest > testDecodeFailOnInvalidVersionAndStatus() PASSED

ExtendedAclStoreTest > shouldHaveCorrectPaths() STARTED

ExtendedAclStoreTest > shouldHaveCorrectPaths() PASSED

ExtendedAclStoreTest > shouldRoundTripChangeNode() STARTED

ExtendedAclStoreTest > shouldRoundTripChangeNode() PASSED

ExtendedAclStoreTest > shouldThrowFromEncodeOnLiteral() STARTED

ExtendedAclStoreTest > shouldThrowFromEncodeOnLiteral() PASSED

ExtendedAclStoreTest > shouldThrowIfConstructedWithLiteral() STARTED

ExtendedAclStoreTest > shouldThrowIfConstructedWithLiteral() PASSED

ExtendedAclStoreTest > shouldWriteChangesToTheWritePath() STARTED

ExtendedAclStoreTest > shouldWriteChangesToTheWritePath() PASSED

ExtendedAclStoreTest > shouldHaveCorrectPatternType() STARTED

ExtendedAclStoreTest > shouldHaveCorrectPatternType() PASSED

DefaultMessageFormatterTest > [1] name=print nothing, record=ConsumerRecord(topic = someTopic, partition = 9, leaderEpoch = null, offset = 9876, CreateTime = 1234, serialized key size = 0, serialized value size = 0, headers = RecordHeaders(headers = [RecordHeader(key = h1, value = [118, 49]), RecordHeader(key = h2, value = [118, 50])], isReadOnly = false), key = [B@b5d9e55, value = [B@78112278), properties=Map(print.value -> false), expected= STARTED

DefaultMessageFormatterTest > [1] name=print nothing, record=ConsumerRecord(topic = someTopic, partition = 9, leaderEpoch = null, offset = 9876, CreateTime = 1234, serialized key size = 0, serialized value size = 0, headers = RecordHeaders(headers = [RecordHeader(key = h1, value = [118, 49]), RecordHeader(key = h2, value = [118, 50])], isReadOnly = false), key = [B@b5d9e55, value = [B@78112278), properties=Map(print.value -> false), expected= PASSED

DefaultMessageFormatterTest > [2] name=print key, record=ConsumerRecord(topic = someTopic, partition = 9, leaderEpoch = null, offset = 9876, CreateTime = 1234, serialized key size = 0, serialized value size = 0, headers = RecordHeaders(headers = [RecordHeader(key = h1, value = [118, 49]), RecordHeader(key = h2, value = [118, 50])], isReadOnly = false), key = [B@3be311d3, value = [B@3e25eac6), properties=Map(print.key -> true, print.value -> false), expected=someKey
 STARTED

DefaultMessageFormatterTest > [2] name=print key, record=ConsumerRecord(topic = someTopic, partition = 9, leaderEpoch = null, offset = 9876, CreateTime = 1234, serialized key size = 0, serialized value size = 0, headers = RecordHeaders(headers = [RecordHeader(key = h1, value = [118, 49]), RecordHeader(key = h2, value = [118, 50])], isReadOnly = false), key = [B@3be311d3, value = [B@3e25eac6), properties=Map(print.key -> true, print.value -> false), expected=someKey
 PASSED

DefaultMessageFormatterTest > [3] name=print value, record=ConsumerRecord(topic = someTopic, partition = 9, leaderEpoch = null, offset = 9876, CreateTime = 1234, serialized key size = 0, serialized value size = 0, headers = RecordHeaders(headers = [RecordHeader(key = h1, value = [118, 49]), RecordHeader(key = h2, value = [118, 50])], isReadOnly = false), key = [B@18aedb1b, value = [B@50b6c212), properties=Map(), expected=someValue
 STARTED

DefaultMessageFormatterTest > [3] name=print value, record=ConsumerRecord(topic = someTopic, partition = 9, leaderEpoch = null, offset = 9876, CreateTime = 1234, serialized key size = 0, serialized value size = 0, headers = RecordHeaders(headers = [RecordHeader(key = h1, value = [118, 49]), RecordHeader(key = h2, value = [118, 50])], isReadOnly = false), key = [B@18aedb1b, value = [B@50b6c212), properties=Map(), expected=someValue
 PASSED

DefaultMessageFormatterTest > [4] name=print empty timestamp, record=ConsumerRecord(topic = someTopic, partition = 9, leaderEpoch = null, offset = 9876, NoTimestampType = 1234, serialized key size = 0, serialized value size = 0, headers = RecordHeaders(headers = [RecordHeader(key = h1, value = [118, 49]), RecordHeader(key = h2, value = [118, 50])], isReadOnly = false), key = [B@73f83c5e, value = [B@621a8b3d), properties=Map(print.timestamp -> true, print.value -> false), expected=NO_TIMESTAMP
 STARTED

DefaultMessageFormatterTest > [4] name=print empty timestamp, record=ConsumerRecord(topic = someTopic, partition = 9, leaderEpoch = null, offset = 9876, NoTimestampType = 1234, serialized key size = 0, serialized value size = 0, headers = RecordHeaders(headers = [RecordHeader(key = h1, value = [118, 49]), RecordHeader(key = h2, value = [118, 50])], isReadOnly = false), key = [B@73f83c5e, value = [B@621a8b3d), properties=Map(print.timestamp -> true, print.value -> false), expected=NO_TIMESTAMP
 PASSED

DefaultMessageFormatterTest > [5] name=print log append time timestamp, record=ConsumerRecord(topic = someTopic, partition = 9, leaderEpoch = null, offset = 9876, LogAppendTime = 1234, serialized key size = 0, serialized value size = 0, headers = RecordHeaders(headers = [RecordHeader(key = h1, value = [118, 49]), RecordHeader(key = h2, value = [118, 50])], isReadOnly = false), key = [B@c02f266, value = [B@6ac207a6), properties=Map(print.timestamp -> true, print.value -> false), expected=LogAppendTime:1234
 STARTED

DefaultMessageFormatterTest > [5] name=print log append time timestamp, record=ConsumerRecord(topic = someTopic, partition = 9, leaderEpoch = null, offset = 9876, LogAppendTime = 1234, serialized key size = 0, serialized value size = 0, headers = RecordHeaders(headers = [RecordHeader(key = h1, value = [118, 49]), RecordHeader(key = h2, value = [118, 50])], isReadOnly = false), key = [B@c02f266, value = [B@6ac207a6), properties=Map(print.timestamp -> true, print.value -> false), expected=LogAppendTime:1234
 PASSED

DefaultMessageFormatterTest > [6] name=print create time timestamp, record=ConsumerRecord(topic = someTopic, partition = 9, leaderEpoch = null, offset = 9876, CreateTime = 1234, serialized key size = 0, serialized value size = 0, headers = RecordHeaders(headers = [RecordHeader(key = h1, value = [118, 49]), RecordHeader(key = h2, value = [118, 50])], isReadOnly = false), key = [B@58eadc6c, value = [B@6e1ff72f), properties=Map(print.timestamp -> true, print.value -> false), expected=CreateTime:1234
 STARTED

DefaultMessageFormatterTest > [6] name=print create time timestamp, record=ConsumerRecord(topic = someTopic, partition = 9, leaderEpoch = null, offset = 9876, CreateTime = 1234, serialized key size = 0, serialized value size = 0, headers = RecordHeaders(headers = [RecordHeader(key = h1, value = [118, 49]), RecordHeader(key = h2, value = [118, 50])], isReadOnly = false), key = [B@58eadc6c, value = [B@6e1ff72f), properties=Map(print.timestamp -> true, print.value -> false), expected=CreateTime:1234
 PASSED

DefaultMessageFormatterTest > [7] name=print partition, record=ConsumerRecord(topic = someTopic, partition = 9, leaderEpoch = null, offset = 9876, CreateTime = 1234, serialized key size = 0, serialized value size = 0, headers = RecordHeaders(headers = [RecordHeader(key = h1, value = [118, 49]), RecordHeader(key = h2, value = [118, 50])], isReadOnly = false), key = [B@7595b948, value = [B@f106f6b), properties=Map(print.partition -> true, print.value -> false), expected=Partition:9
 STARTED

DefaultMessageFormatterTest > [7] name=print partition, record=ConsumerRecord(topic = someTopic, partition = 9, leaderEpoch = null, offset = 9876, CreateTime = 1234, serialized key size = 0, serialized value size = 0, headers = RecordHeaders(headers = [RecordHeader(key = h1, value = [118, 49]), RecordHeader(key = h2, value = [118, 50])], isReadOnly = false), key = [B@7595b948, value = [B@f106f6b), properties=Map(print.partition -> true, print.value -> false), expected=Partition:9
 PASSED

DefaultMessageFormatterTest > [8] name=print offset, record=ConsumerRecord(topic = someTopic, partition = 9, leaderEpoch = null, offset = 9876, CreateTime = 1234, serialized key size = 0, serialized value size = 0, headers = RecordHeaders(headers = [RecordHeader(key = h1, value = [118, 49]), RecordHeader(key = h2, value = [118, 50])], isReadOnly = false), key = [B@117cb59, value = [B@10a0f2db), properties=Map(print.offset -> true, print.value -> false), expected=Offset:9876
 STARTED

DefaultMessageFormatterTest > [8] name=print offset, record=ConsumerRecord(topic = someTopic, partition = 9, leaderEpoch = null, offset = 9876, CreateTime = 1234, serialized key size = 0, serialized value size = 0, headers = RecordHeaders(headers = [RecordHeader(key = h1, value = [118, 49]), RecordHeader(key = h2, value = [118, 50])], isReadOnly = false), key = [B@117cb59, value = [B@10a0f2db), properties=Map(print.offset -> true, print.value -> false), expected=Offset:9876
 PASSED

DefaultMessageFormatterTest > [9] name=print headers, record=ConsumerRecord(topic = someTopic, partition = 9, leaderEpoch = null, offset = 9876, CreateTime = 1234, serialized key size = 0, serialized value size = 0, headers = RecordHeaders(headers = [RecordHeader(key = h1, value = [118, 49]), RecordHeader(key = h2, value = [118, 50])], isReadOnly = false), key = [B@48a7467e, value = [B@44c00336), properties=Map(print.headers -> true, print.value -> false), expected=h1:v1,h2:v2
 STARTED

DefaultMessageFormatterTest > [9] name=print headers, record=ConsumerRecord(topic = someTopic, partition = 9, leaderEpoch = null, offset = 9876, CreateTime = 1234, serialized key size = 0, serialized value size = 0, headers = RecordHeaders(headers = [RecordHeader(key = h1, value = [118, 49]), RecordHeader(key = h2, value = [118, 50])], isReadOnly = false), key = [B@48a7467e, value = [B@44c00336), properties=Map(print.headers -> true, print.value -> false), expected=h1:v1,h2:v2
 PASSED

DefaultMessageFormatterTest > [10] name=print empty headers, record=ConsumerRecord(topic = someTopic, partition = 9, leaderEpoch = null, offset = 9876, CreateTime = 1234, serialized key size = 0, serialized value size = 0, headers = RecordHeaders(headers = [], isReadOnly = false), key = [B@331ce33e, value = [B@454a8be0), properties=Map(print.headers -> true, print.value -> false), expected=NO_HEADERS
 STARTED

DefaultMessageFormatterTest > [10] name=print empty headers, record=ConsumerRecord(topic = someTopic, partition = 9, leaderEpoch = null, offset = 9876, CreateTime = 1234, serialized key size = 0, serialized value size = 0, headers = RecordHeaders(headers = [], isReadOnly = false), key = [B@331ce33e, value = [B@454a8be0), properties=Map(print.headers -> true, print.value -> false), expected=NO_HEADERS
 PASSED

DefaultMessageFormatterTest > [11] name=print all possible fields with default delimiters, record=ConsumerRecord(topic = someTopic, partition = 9, leaderEpoch = null, offset = 9876, CreateTime = 1234, serialized key size = 0, serialized value size = 0, headers = RecordHeaders(headers = [RecordHeader(key = h1, value = [118, 49]), RecordHeader(key = h2, value = [118, 50])], isReadOnly = false), key = [B@70c39ec1, value = [B@6ab27b3b), properties=HashMap(print.key -> true, print.headers -> true, print.partition -> true, print.offset -> true, print.timestamp -> true, print.value -> true), expected=CreateTime:1234	Partition:9	Offset:9876	h1:v1,h2:v2	someKey	someValue
 STARTED

DefaultMessageFormatterTest > [11] name=print all possible fields with default delimiters, record=ConsumerRecord(topic = someTopic, partition = 9, leaderEpoch = null, offset = 9876, CreateTime = 1234, serialized key size = 0, serialized value size = 0, headers = RecordHeaders(headers = [RecordHeader(key = h1, value = [118, 49]), RecordHeader(key = h2, value = [118, 50])], isReadOnly = false), key = [B@70c39ec1, value = [B@6ab27b3b), properties=HashMap(print.key -> true, print.headers -> true, print.partition -> true, print.offset -> true, print.timestamp -> true, print.value -> true), expected=CreateTime:1234	Partition:9	Offset:9876	h1:v1,h2:v2	someKey	someValue
 PASSED

DefaultMessageFormatterTest > [12] name=print all possible fields with custom delimiters, record=ConsumerRecord(topic = someTopic, partition = 9, leaderEpoch = null, offset = 9876, CreateTime = 1234, serialized key size = 0, serialized value size = 0, headers = RecordHeaders(headers = [RecordHeader(key = h1, value = [118, 49]), RecordHeader(key = h2, value = [118, 50])], isReadOnly = false), key = [B@3e637040, value = [B@2fe7e9e7), properties=HashMap(line.separator -> ^, print.key -> true, headers.separator -> #, print.headers -> true, key.separator -> |, print.partition -> true, print.offset -> true, print.timestamp -> true, print.value -> true), expected=CreateTime:1234|Partition:9|Offset:9876|h1:v1#h2:v2|someKey|someValue^ STARTED

DefaultMessageFormatterTest > [12] name=print all possible fields with custom delimiters, record=ConsumerRecord(topic = someTopic, partition = 9, leaderEpoch = null, offset = 9876, CreateTime = 1234, serialized key size = 0, serialized value size = 0, headers = RecordHeaders(headers = [RecordHeader(key = h1, value = [118, 49]), RecordHeader(key = h2, value = [118, 50])], isReadOnly = false), key = [B@3e637040, value = [B@2fe7e9e7), properties=HashMap(line.separator -> ^, print.key -> true, headers.separator -> #, print.headers -> true, key.separator -> |, print.partition -> true, print.offset -> true, print.timestamp -> true, print.value -> true), expected=CreateTime:1234|Partition:9|Offset:9876|h1:v1#h2:v2|someKey|someValue^ PASSED

DefaultMessageFormatterTest > [13] name=print key with custom deserializer, record=ConsumerRecord(topic = someTopic, partition = 9, leaderEpoch = null, offset = 9876, CreateTime = 1234, serialized key size = 0, serialized value size = 0, headers = RecordHeaders(headers = [RecordHeader(key = h1, value = [118, 49]), RecordHeader(key = h2, value = [118, 50])], isReadOnly = false), key = [B@433e5f4c, value = [B@3a2c9fb3), properties=Map(print.key -> true, print.headers -> true, print.value -> true, key.deserializer -> unit.kafka.tools.UpperCaseDeserializer), expected=h1:v1,h2:v2	SOMEKEY	someValue
 STARTED

DefaultMessageFormatterTest > [13] name=print key with custom deserializer, record=ConsumerRecord(topic = someTopic, partition = 9, leaderEpoch = null, offset = 9876, CreateTime = 1234, serialized key size = 0, serialized value size = 0, headers = RecordHeaders(headers = [RecordHeader(key = h1, value = [118, 49]), RecordHeader(key = h2, value = [118, 50])], isReadOnly = false), key = [B@433e5f4c, value = [B@3a2c9fb3), properties=Map(print.key -> true, print.headers -> true, print.value -> true, key.deserializer -> unit.kafka.tools.UpperCaseDeserializer), expected=h1:v1,h2:v2	SOMEKEY	someValue
 PASSED

DefaultMessageFormatterTest > [14] name=print value with custom deserializer, record=ConsumerRecord(topic = someTopic, partition = 9, leaderEpoch = null, offset = 9876, CreateTime = 1234, serialized key size = 0, serialized value size = 0, headers = RecordHeaders(headers = [RecordHeader(key = h1, value = [118, 49]), RecordHeader(key = h2, value = [118, 50])], isReadOnly = false), key = [B@3ea59984, value = [B@602a48e4), properties=Map(print.key -> true, print.headers -> true, print.value -> true, value.deserializer -> unit.kafka.tools.UpperCaseDeserializer), expected=h1:v1,h2:v2	someKey	SOMEVALUE
 STARTED

DefaultMessageFormatterTest > [14] name=print value with custom deserializer, record=ConsumerRecord(topic = someTopic, partition = 9, leaderEpoch = null, offset = 9876, CreateTime = 1234, serialized key size = 0, serialized value size = 0, headers = RecordHeaders(headers = [RecordHeader(key = h1, value = [118, 49]), RecordHeader(key = h2, value = [118, 50])], isReadOnly = false), key = [B@3ea59984, value = [B@602a48e4), properties=Map(print.key -> true, print.headers -> true, print.value -> true, value.deserializer -> unit.kafka.tools.UpperCaseDeserializer), expected=h1:v1,h2:v2	someKey	SOMEVALUE
 PASSED

DefaultMessageFormatterTest > [15] name=print headers with custom deserializer, record=ConsumerRecord(topic = someTopic, partition = 9, leaderEpoch = null, offset = 9876, CreateTime = 1234, serialized key size = 0, serialized value size = 0, headers = RecordHeaders(headers = [RecordHeader(key = h1, value = [118, 49]), RecordHeader(key = h2, value = [118, 50])], isReadOnly = false), key = [B@3fd3db1e, value = [B@33978ff2), properties=Map(print.key -> true, print.headers -> true, print.value -> true, headers.deserializer -> unit.kafka.tools.UpperCaseDeserializer), expected=h1:V1,h2:V2	someKey	someValue
 STARTED

DefaultMessageFormatterTest > [15] name=print headers with custom deserializer, record=ConsumerRecord(topic = someTopic, partition = 9, leaderEpoch = null, offset = 9876, CreateTime = 1234, serialized key size = 0, serialized value size = 0, headers = RecordHeaders(headers = [RecordHeader(key = h1, value = [118, 49]), RecordHeader(key = h2, value = [118, 50])], isReadOnly = false), key = [B@3fd3db1e, value = [B@33978ff2), properties=Map(print.key -> true, print.headers -> true, print.value -> true, headers.deserializer -> unit.kafka.tools.UpperCaseDeserializer), expected=h1:V1,h2:V2	someKey	someValue
 PASSED

DefaultMessageFormatterTest > [16] name=print key and value, record=ConsumerRecord(topic = someTopic, partition = 9, leaderEpoch = null, offset = 9876, CreateTime = 1234, serialized key size = 0, serialized value size = 0, headers = RecordHeaders(headers = [RecordHeader(key = h1, value = [118, 49]), RecordHeader(key = h2, value = [118, 50])], isReadOnly = false), key = [B@21ec59bd, value = [B@13b3580c), properties=Map(print.key -> true, print.value -> true), expected=someKey	someValue
 STARTED

DefaultMessageFormatterTest > [16] name=print key and value, record=ConsumerRecord(topic = someTopic, partition = 9, leaderEpoch = null, offset = 9876, CreateTime = 1234, serialized key size = 0, serialized value size = 0, headers = RecordHeaders(headers = [RecordHeader(key = h1, value = [118, 49]), RecordHeader(key = h2, value = [118, 50])], isReadOnly = false), key = [B@21ec59bd, value = [B@13b3580c), properties=Map(print.key -> true, print.value -> true), expected=someKey	someValue
 PASSED

DefaultMessageFormatterTest > [17] name=print fields in the beginning, middle and the end, record=ConsumerRecord(topic = someTopic, partition = 9, leaderEpoch = null, offset = 9876, CreateTime = 1234, serialized key size = 0, serialized value size = 0, headers = RecordHeaders(headers = [RecordHeader(key = h1, value = [118, 49]), RecordHeader(key = h2, value = [118, 50])], isReadOnly = false), key = [B@e549f04, value = [B@473cbcbc), properties=Map(print.key -> true, print.value -> true, print.partition -> true), expected=Partition:9	someKey	someValue
 STARTED

DefaultMessageFormatterTest > [17] name=print fields in the beginning, middle and the end, record=ConsumerRecord(topic = someTopic, partition = 9, leaderEpoch = null, offset = 9876, CreateTime = 1234, serialized key size = 0, serialized value size = 0, headers = RecordHeaders(headers = [RecordHeader(key = h1, value = [118, 49]), RecordHeader(key = h2, value = [118, 50])], isReadOnly = false), key = [B@e549f04, value = [B@473cbcbc), properties=Map(print.key -> true, print.value -> true, print.partition -> true), expected=Partition:9	someKey	someValue
 PASSED

DefaultMessageFormatterTest > [18] name=null value without custom null literal, record=ConsumerRecord(topic = someTopic, partition = 9, leaderEpoch = null, offset = 9876, CreateTime = 1234, serialized key size = 0, serialized value size = 0, headers = RecordHeaders(headers = [RecordHeader(key = h1, value = [118, 49]), RecordHeader(key = h2, value = [118, 50])], isReadOnly = false), key = [B@59dcd605, value = null), properties=Map(print.key -> true), expected=someKey	null
 STARTED

DefaultMessageFormatterTest > [18] name=null value without custom null literal, record=ConsumerRecord(topic = someTopic, partition = 9, leaderEpoch = null, offset = 9876, CreateTime = 1234, serialized key size = 0, serialized value size = 0, headers = RecordHeaders(headers = [RecordHeader(key = h1, value = [118, 49]), RecordHeader(key = h2, value = [118, 50])], isReadOnly = false), key = [B@59dcd605, value = null), properties=Map(print.key -> true), expected=someKey	null
 PASSED

DefaultMessageFormatterTest > [19] name=null value with custom null literal, record=ConsumerRecord(topic = someTopic, partition = 9, leaderEpoch = null, offset = 9876, CreateTime = 1234, serialized key size = 0, serialized value size = 0, headers = RecordHeaders(headers = [RecordHeader(key = h1, value = [118, 49]), RecordHeader(key = h2, value = [118, 50])], isReadOnly = false), key = [B@1cba8e6b, value = null), properties=Map(print.key -> true, null.literal -> NULL), expected=someKey	NULL
 STARTED

DefaultMessageFormatterTest > [19] name=null value with custom null literal, record=ConsumerRecord(topic = someTopic, partition = 9, leaderEpoch = null, offset = 9876, CreateTime = 1234, serialized key size = 0, serialized value size = 0, headers = RecordHeaders(headers = [RecordHeader(key = h1, value = [118, 49]), RecordHeader(key = h2, value = [118, 50])], isReadOnly = false), key = [B@1cba8e6b, value = null), properties=Map(print.key -> true, null.literal -> NULL), expected=someKey	NULL
 PASSED

FAILURE: Build failed with an exception.

* What went wrong:
Execution failed for task ':connect:runtime:test'.
> There were failing tests. See the report at: file://<https://ci-builds.apache.org/job/Kafka/job/kafka-trunk-jdk11/ws/connect/runtime/build/reports/tests/test/index.html>

* Try:
Run with --stacktrace option to get the stack trace. Run with --info or --debug option to get more log output. Run with --scan to get full insights.

* Get more help at https://help.gradle.org

Deprecated Gradle features were used in this build, making it incompatible with Gradle 7.0.
Use '--warning-mode all' to show the individual deprecation warnings.
See https://docs.gradle.org/6.8.1/userguide/command_line_interface.html#sec:command_line_warnings

BUILD FAILED in 1h 30m 10s
250 actionable tasks: 243 executed, 7 up-to-date
Build step 'Execute shell' marked build as failure
Recording test results
Not sending mail to unregistered user github@hugo-hirsch.de

Build failed in Jenkins: Kafka » kafka-trunk-jdk11 #497

Posted by Apache Jenkins Server <je...@builds.apache.org>.
See <https://ci-builds.apache.org/job/Kafka/job/kafka-trunk-jdk11/497/display/redirect?page=changes>

Changes:

[github] MINOR: add Utils.isBlank to check whitespace character string and empty string (#10012)


------------------------------------------
[...truncated 3.62 MB...]
KafkaZkClientTest > testDeleteTopicPathMethods() STARTED

KafkaZkClientTest > testDeleteTopicPathMethods() PASSED

KafkaZkClientTest > testSetTopicPartitionStatesRaw() STARTED

KafkaZkClientTest > testSetTopicPartitionStatesRaw() PASSED

KafkaZkClientTest > testAclManagementMethods() STARTED

KafkaZkClientTest > testAclManagementMethods() PASSED

KafkaZkClientTest > testPreferredReplicaElectionMethods() STARTED

KafkaZkClientTest > testPreferredReplicaElectionMethods() PASSED

KafkaZkClientTest > testPropagateLogDir() STARTED

KafkaZkClientTest > testPropagateLogDir() PASSED

KafkaZkClientTest > testGetDataAndStat() STARTED

KafkaZkClientTest > testGetDataAndStat() PASSED

KafkaZkClientTest > testReassignPartitionsInProgress() STARTED

KafkaZkClientTest > testReassignPartitionsInProgress() PASSED

KafkaZkClientTest > testCreateTopLevelPaths() STARTED

KafkaZkClientTest > testCreateTopLevelPaths() PASSED

KafkaZkClientTest > testGetAllTopicsInClusterDoesNotTriggerWatch() STARTED

KafkaZkClientTest > testGetAllTopicsInClusterDoesNotTriggerWatch() PASSED

KafkaZkClientTest > testIsrChangeNotificationGetters() STARTED

KafkaZkClientTest > testIsrChangeNotificationGetters() PASSED

KafkaZkClientTest > testLogDirEventNotificationsDeletion() STARTED

KafkaZkClientTest > testLogDirEventNotificationsDeletion() PASSED

KafkaZkClientTest > testGetLogConfigs() STARTED

KafkaZkClientTest > testGetLogConfigs() PASSED

KafkaZkClientTest > testBrokerSequenceIdMethods() STARTED

KafkaZkClientTest > testBrokerSequenceIdMethods() PASSED

KafkaZkClientTest > testAclMethods() STARTED

KafkaZkClientTest > testAclMethods() PASSED

KafkaZkClientTest > testCreateSequentialPersistentPath() STARTED

KafkaZkClientTest > testCreateSequentialPersistentPath() PASSED

KafkaZkClientTest > testConditionalUpdatePath() STARTED

KafkaZkClientTest > testConditionalUpdatePath() PASSED

KafkaZkClientTest > testGetAllTopicsInClusterTriggersWatch() STARTED

KafkaZkClientTest > testGetAllTopicsInClusterTriggersWatch() PASSED

KafkaZkClientTest > testDeleteTopicZNode() STARTED

KafkaZkClientTest > testDeleteTopicZNode() PASSED

KafkaZkClientTest > testDeletePath() STARTED

KafkaZkClientTest > testDeletePath() PASSED

KafkaZkClientTest > testGetBrokerMethods() STARTED

KafkaZkClientTest > testGetBrokerMethods() PASSED

KafkaZkClientTest > testCreateTokenChangeNotification() STARTED

KafkaZkClientTest > testCreateTokenChangeNotification() PASSED

KafkaZkClientTest > testGetTopicsAndPartitions() STARTED

KafkaZkClientTest > testGetTopicsAndPartitions() PASSED

KafkaZkClientTest > testRegisterBrokerInfo() STARTED

KafkaZkClientTest > testRegisterBrokerInfo() PASSED

KafkaZkClientTest > testRetryRegisterBrokerInfo() STARTED

KafkaZkClientTest > testRetryRegisterBrokerInfo() PASSED

KafkaZkClientTest > testConsumerOffsetPath() STARTED

KafkaZkClientTest > testConsumerOffsetPath() PASSED

KafkaZkClientTest > testDeleteRecursiveWithControllerEpochVersionCheck() STARTED

KafkaZkClientTest > testDeleteRecursiveWithControllerEpochVersionCheck() PASSED

KafkaZkClientTest > testTopicAssignments() STARTED

KafkaZkClientTest > testTopicAssignments() PASSED

KafkaZkClientTest > testControllerManagementMethods() STARTED

KafkaZkClientTest > testControllerManagementMethods() PASSED

KafkaZkClientTest > testTopicAssignmentMethods() STARTED

KafkaZkClientTest > testTopicAssignmentMethods() PASSED

KafkaZkClientTest > testConnectionViaNettyClient() STARTED

KafkaZkClientTest > testConnectionViaNettyClient() PASSED

KafkaZkClientTest > testPropagateIsrChanges() STARTED

KafkaZkClientTest > testPropagateIsrChanges() PASSED

KafkaZkClientTest > testControllerEpochMethods() STARTED

KafkaZkClientTest > testControllerEpochMethods() PASSED

KafkaZkClientTest > testDeleteRecursive() STARTED

KafkaZkClientTest > testDeleteRecursive() PASSED

KafkaZkClientTest > testGetTopicPartitionStates() STARTED

KafkaZkClientTest > testGetTopicPartitionStates() PASSED

KafkaZkClientTest > testCreateConfigChangeNotification() STARTED

KafkaZkClientTest > testCreateConfigChangeNotification() PASSED

KafkaZkClientTest > testDelegationTokenMethods() STARTED

KafkaZkClientTest > testDelegationTokenMethods() PASSED

LiteralAclStoreTest > shouldHaveCorrectPaths() STARTED

LiteralAclStoreTest > shouldHaveCorrectPaths() PASSED

LiteralAclStoreTest > shouldRoundTripChangeNode() STARTED

LiteralAclStoreTest > shouldRoundTripChangeNode() PASSED

LiteralAclStoreTest > shouldThrowFromEncodeOnNoneLiteral() STARTED

LiteralAclStoreTest > shouldThrowFromEncodeOnNoneLiteral() PASSED

LiteralAclStoreTest > shouldWriteChangesToTheWritePath() STARTED

LiteralAclStoreTest > shouldWriteChangesToTheWritePath() PASSED

LiteralAclStoreTest > shouldHaveCorrectPatternType() STARTED

LiteralAclStoreTest > shouldHaveCorrectPatternType() PASSED

LiteralAclStoreTest > shouldDecodeResourceUsingTwoPartLogic() STARTED

LiteralAclStoreTest > shouldDecodeResourceUsingTwoPartLogic() PASSED

ReassignPartitionsZNodeTest > testDecodeInvalidJson() STARTED

ReassignPartitionsZNodeTest > testDecodeInvalidJson() PASSED

ReassignPartitionsZNodeTest > testEncode() STARTED

ReassignPartitionsZNodeTest > testEncode() PASSED

ReassignPartitionsZNodeTest > testDecodeValidJson() STARTED

ReassignPartitionsZNodeTest > testDecodeValidJson() PASSED

ControllerContextTest > testPartitionFullReplicaAssignmentReturnsEmptyAssignmentIfTopicOrPartitionDoesNotExist() STARTED

ControllerContextTest > testPartitionFullReplicaAssignmentReturnsEmptyAssignmentIfTopicOrPartitionDoesNotExist() PASSED

ControllerContextTest > testPartitionReplicaAssignmentForTopicReturnsEmptyMapIfTopicDoesNotExist() STARTED

ControllerContextTest > testPartitionReplicaAssignmentForTopicReturnsEmptyMapIfTopicDoesNotExist() PASSED

ControllerContextTest > testPreferredReplicaImbalanceMetric() STARTED

ControllerContextTest > testPreferredReplicaImbalanceMetric() PASSED

ControllerContextTest > testPartitionReplicaAssignmentForTopicReturnsExpectedReplicaAssignments() STARTED

ControllerContextTest > testPartitionReplicaAssignmentForTopicReturnsExpectedReplicaAssignments() PASSED

ControllerContextTest > testReassignTo() STARTED

ControllerContextTest > testReassignTo() PASSED

ControllerContextTest > testPartitionReplicaAssignment() STARTED

ControllerContextTest > testPartitionReplicaAssignment() PASSED

ControllerContextTest > testUpdatePartitionFullReplicaAssignmentUpdatesReplicaAssignment() STARTED

ControllerContextTest > testUpdatePartitionFullReplicaAssignmentUpdatesReplicaAssignment() PASSED

ControllerContextTest > testReassignToIdempotence() STARTED

ControllerContextTest > testReassignToIdempotence() PASSED

ControllerContextTest > testPartitionReplicaAssignmentReturnsEmptySeqIfTopicOrPartitionDoesNotExist() STARTED

ControllerContextTest > testPartitionReplicaAssignmentReturnsEmptySeqIfTopicOrPartitionDoesNotExist() PASSED

FAILURE: Build completed with 2 failures.

1: Task failed with an exception.
-----------
* What went wrong:
Execution failed for task ':tools:test'.
> There were failing tests. See the report at: file://<https://ci-builds.apache.org/job/Kafka/job/kafka-trunk-jdk11/ws/tools/build/reports/tests/test/index.html>

* Try:
Run with --stacktrace option to get the stack trace. Run with --info or --debug option to get more log output. Run with --scan to get full insights.
==============================================================================

2: Task failed with an exception.
-----------
* What went wrong:
Execution failed for task ':connect:runtime:test'.
> There were failing tests. See the report at: file://<https://ci-builds.apache.org/job/Kafka/job/kafka-trunk-jdk11/ws/connect/runtime/build/reports/tests/test/index.html>

* Try:
Run with --stacktrace option to get the stack trace. Run with --info or --debug option to get more log output. Run with --scan to get full insights.
==============================================================================

* Get more help at https://help.gradle.org

Deprecated Gradle features were used in this build, making it incompatible with Gradle 7.0.
Use '--warning-mode all' to show the individual deprecation warnings.
See https://docs.gradle.org/6.8.1/userguide/command_line_interface.html#sec:command_line_warnings

BUILD FAILED in 1h 33m 51s
251 actionable tasks: 215 executed, 36 up-to-date
Build step 'Execute shell' marked build as failure
Recording test results
Not sending mail to unregistered user github@hugo-hirsch.de