You are viewing a plain text version of this content. The canonical link for it is here.
Posted to dev@kafka.apache.org by Apache Jenkins Server <je...@builds.apache.org> on 2019/04/16 02:36:25 UTC

Build failed in Jenkins: kafka-trunk-jdk11 #437

See <https://builds.apache.org/job/kafka-trunk-jdk11/437/display/redirect?page=changes>

Changes:

[jason] KAFKA-6635; Producer close awaits pending transactions (#5971)

------------------------------------------
[...truncated 2.38 MB...]
org.apache.kafka.streams.TopologyTestDriverTest > shouldPunctuateOnStreamsTime[Eos enabled = false] STARTED

org.apache.kafka.streams.TopologyTestDriverTest > shouldPunctuateOnStreamsTime[Eos enabled = false] PASSED

org.apache.kafka.streams.TopologyTestDriverTest > shouldProcessFromSourcesThatMatchMultiplePattern[Eos enabled = false] STARTED

org.apache.kafka.streams.TopologyTestDriverTest > shouldProcessFromSourcesThatMatchMultiplePattern[Eos enabled = false] PASSED

org.apache.kafka.streams.TopologyTestDriverTest > shouldPopulateGlobalStore[Eos enabled = false] STARTED

org.apache.kafka.streams.TopologyTestDriverTest > shouldPopulateGlobalStore[Eos enabled = false] PASSED

org.apache.kafka.streams.TopologyTestDriverTest > shouldAllowPrePopulatingStatesStoresWithCachingEnabled[Eos enabled = false] STARTED

org.apache.kafka.streams.TopologyTestDriverTest > shouldAllowPrePopulatingStatesStoresWithCachingEnabled[Eos enabled = false] PASSED

org.apache.kafka.streams.TopologyTestDriverTest > shouldUseSourceSpecificDeserializers[Eos enabled = false] STARTED

org.apache.kafka.streams.TopologyTestDriverTest > shouldUseSourceSpecificDeserializers[Eos enabled = false] PASSED

org.apache.kafka.streams.TopologyTestDriverTest > shouldReturnAllStores[Eos enabled = false] STARTED

org.apache.kafka.streams.TopologyTestDriverTest > shouldReturnAllStores[Eos enabled = false] PASSED

org.apache.kafka.streams.TopologyTestDriverTest > shouldSendRecordViaCorrectSourceTopic[Eos enabled = false] STARTED

org.apache.kafka.streams.TopologyTestDriverTest > shouldSendRecordViaCorrectSourceTopic[Eos enabled = false] PASSED

org.apache.kafka.streams.TopologyTestDriverTest > shouldNotCreateStateDirectoryForStatelessTopology[Eos enabled = false] STARTED

org.apache.kafka.streams.TopologyTestDriverTest > shouldNotCreateStateDirectoryForStatelessTopology[Eos enabled = false] PASSED

org.apache.kafka.streams.TopologyTestDriverTest > shouldReturnAllStoresNames[Eos enabled = false] STARTED

org.apache.kafka.streams.TopologyTestDriverTest > shouldReturnAllStoresNames[Eos enabled = false] PASSED

org.apache.kafka.streams.TopologyTestDriverTest > shouldProcessConsumerRecordList[Eos enabled = false] STARTED

org.apache.kafka.streams.TopologyTestDriverTest > shouldProcessConsumerRecordList[Eos enabled = false] PASSED

org.apache.kafka.streams.TopologyTestDriverTest > shouldUseSinkSpecificSerializers[Eos enabled = false] STARTED

org.apache.kafka.streams.TopologyTestDriverTest > shouldUseSinkSpecificSerializers[Eos enabled = false] PASSED

org.apache.kafka.streams.TopologyTestDriverTest > shouldFlushStoreForFirstInput[Eos enabled = false] STARTED

org.apache.kafka.streams.TopologyTestDriverTest > shouldFlushStoreForFirstInput[Eos enabled = false] PASSED

org.apache.kafka.streams.TopologyTestDriverTest > shouldProcessFromSourceThatMatchPattern[Eos enabled = false] STARTED

org.apache.kafka.streams.TopologyTestDriverTest > shouldProcessFromSourceThatMatchPattern[Eos enabled = false] PASSED

org.apache.kafka.streams.TopologyTestDriverTest > shouldUpdateStoreForNewKey[Eos enabled = false] STARTED

org.apache.kafka.streams.TopologyTestDriverTest > shouldUpdateStoreForNewKey[Eos enabled = false] PASSED

org.apache.kafka.streams.TopologyTestDriverTest > shouldPunctuateOnWallClockTime[Eos enabled = false] STARTED

org.apache.kafka.streams.TopologyTestDriverTest > shouldPunctuateOnWallClockTime[Eos enabled = false] PASSED

org.apache.kafka.streams.TopologyTestDriverTest > shouldSetRecordMetadata[Eos enabled = false] STARTED

org.apache.kafka.streams.TopologyTestDriverTest > shouldSetRecordMetadata[Eos enabled = false] PASSED

org.apache.kafka.streams.TopologyTestDriverTest > shouldNotUpdateStoreForLargerValue[Eos enabled = false] STARTED

org.apache.kafka.streams.TopologyTestDriverTest > shouldNotUpdateStoreForLargerValue[Eos enabled = false] PASSED

org.apache.kafka.streams.TopologyTestDriverTest > shouldProcessRecordForTopic[Eos enabled = false] STARTED

org.apache.kafka.streams.TopologyTestDriverTest > shouldProcessRecordForTopic[Eos enabled = false] PASSED

org.apache.kafka.streams.TopologyTestDriverTest > shouldForwardRecordsFromSubtopologyToSubtopology[Eos enabled = false] STARTED

org.apache.kafka.streams.TopologyTestDriverTest > shouldForwardRecordsFromSubtopologyToSubtopology[Eos enabled = false] PASSED

org.apache.kafka.streams.TopologyTestDriverTest > shouldNotUpdateStoreForSmallerValue[Eos enabled = false] STARTED

org.apache.kafka.streams.TopologyTestDriverTest > shouldNotUpdateStoreForSmallerValue[Eos enabled = false] PASSED

org.apache.kafka.streams.TopologyTestDriverTest > shouldCreateStateDirectoryForStatefulTopology[Eos enabled = false] STARTED

org.apache.kafka.streams.TopologyTestDriverTest > shouldCreateStateDirectoryForStatefulTopology[Eos enabled = false] PASSED

org.apache.kafka.streams.TopologyTestDriverTest > shouldPunctuateIfWallClockTimeAdvances[Eos enabled = false] STARTED

org.apache.kafka.streams.TopologyTestDriverTest > shouldPunctuateIfWallClockTimeAdvances[Eos enabled = false] PASSED

org.apache.kafka.streams.MockTimeTest > shouldGetNanosAsMillis STARTED

org.apache.kafka.streams.MockTimeTest > shouldGetNanosAsMillis PASSED

org.apache.kafka.streams.MockTimeTest > shouldSetStartTime STARTED

org.apache.kafka.streams.MockTimeTest > shouldSetStartTime PASSED

org.apache.kafka.streams.MockTimeTest > shouldNotAllowNegativeSleep STARTED

org.apache.kafka.streams.MockTimeTest > shouldNotAllowNegativeSleep PASSED

org.apache.kafka.streams.MockTimeTest > shouldAdvanceTimeOnSleep STARTED

org.apache.kafka.streams.MockTimeTest > shouldAdvanceTimeOnSleep PASSED

org.apache.kafka.streams.internals.WindowStoreFacadeTest > shouldReturnIsOpen STARTED

org.apache.kafka.streams.internals.WindowStoreFacadeTest > shouldReturnIsOpen PASSED

org.apache.kafka.streams.internals.WindowStoreFacadeTest > shouldReturnName STARTED

org.apache.kafka.streams.internals.WindowStoreFacadeTest > shouldReturnName PASSED

org.apache.kafka.streams.internals.WindowStoreFacadeTest > shouldPutWithUnknownTimestamp STARTED

org.apache.kafka.streams.internals.WindowStoreFacadeTest > shouldPutWithUnknownTimestamp PASSED

org.apache.kafka.streams.internals.WindowStoreFacadeTest > shouldPutWindowStartTimestampWithUnknownTimestamp STARTED

org.apache.kafka.streams.internals.WindowStoreFacadeTest > shouldPutWindowStartTimestampWithUnknownTimestamp PASSED

org.apache.kafka.streams.internals.WindowStoreFacadeTest > shouldReturnIsPersistent STARTED

org.apache.kafka.streams.internals.WindowStoreFacadeTest > shouldReturnIsPersistent PASSED

org.apache.kafka.streams.internals.WindowStoreFacadeTest > shouldForwardClose STARTED

org.apache.kafka.streams.internals.WindowStoreFacadeTest > shouldForwardClose PASSED

org.apache.kafka.streams.internals.WindowStoreFacadeTest > shouldForwardFlush STARTED

org.apache.kafka.streams.internals.WindowStoreFacadeTest > shouldForwardFlush PASSED

org.apache.kafka.streams.internals.WindowStoreFacadeTest > shouldForwardInit STARTED

org.apache.kafka.streams.internals.WindowStoreFacadeTest > shouldForwardInit PASSED

org.apache.kafka.streams.internals.KeyValueStoreFacadeTest > shouldReturnIsOpen STARTED

org.apache.kafka.streams.internals.KeyValueStoreFacadeTest > shouldReturnIsOpen PASSED

org.apache.kafka.streams.internals.KeyValueStoreFacadeTest > shouldDeleteAndReturnPlainValue STARTED

org.apache.kafka.streams.internals.KeyValueStoreFacadeTest > shouldDeleteAndReturnPlainValue PASSED

org.apache.kafka.streams.internals.KeyValueStoreFacadeTest > shouldReturnName STARTED

org.apache.kafka.streams.internals.KeyValueStoreFacadeTest > shouldReturnName PASSED

org.apache.kafka.streams.internals.KeyValueStoreFacadeTest > shouldPutWithUnknownTimestamp STARTED

org.apache.kafka.streams.internals.KeyValueStoreFacadeTest > shouldPutWithUnknownTimestamp PASSED

org.apache.kafka.streams.internals.KeyValueStoreFacadeTest > shouldPutAllWithUnknownTimestamp STARTED

org.apache.kafka.streams.internals.KeyValueStoreFacadeTest > shouldPutAllWithUnknownTimestamp PASSED

org.apache.kafka.streams.internals.KeyValueStoreFacadeTest > shouldReturnIsPersistent STARTED

org.apache.kafka.streams.internals.KeyValueStoreFacadeTest > shouldReturnIsPersistent PASSED

org.apache.kafka.streams.internals.KeyValueStoreFacadeTest > shouldPutIfAbsentWithUnknownTimestamp STARTED

org.apache.kafka.streams.internals.KeyValueStoreFacadeTest > shouldPutIfAbsentWithUnknownTimestamp PASSED

org.apache.kafka.streams.internals.KeyValueStoreFacadeTest > shouldForwardClose STARTED

org.apache.kafka.streams.internals.KeyValueStoreFacadeTest > shouldForwardClose PASSED

org.apache.kafka.streams.internals.KeyValueStoreFacadeTest > shouldForwardFlush STARTED

org.apache.kafka.streams.internals.KeyValueStoreFacadeTest > shouldForwardFlush PASSED

org.apache.kafka.streams.internals.KeyValueStoreFacadeTest > shouldForwardInit STARTED

org.apache.kafka.streams.internals.KeyValueStoreFacadeTest > shouldForwardInit PASSED

> Task :connect:basic-auth-extension:test

org.apache.kafka.connect.rest.basic.auth.extension.JaasBasicAuthFilterTest > testSuccess STARTED
WARNING: An illegal reflective access operation has occurred
WARNING: Illegal reflective access by org.powermock.reflect.internal.WhiteboxImpl (file:/home/jenkins/.gradle/caches/modules-2/files-2.1/org.powermock/powermock-reflect/2.0.0/cd452bc345ec9f88ec5efecd41139de0cb1d4265/powermock-reflect-2.0.0.jar) to method java.lang.Object.clone()
WARNING: Please consider reporting this to the maintainers of org.powermock.reflect.internal.WhiteboxImpl
WARNING: Use --illegal-access=warn to enable warnings of further illegal reflective access operations
WARNING: All illegal access operations will be denied in a future release

org.apache.kafka.connect.rest.basic.auth.extension.JaasBasicAuthFilterTest > testSuccess PASSED

org.apache.kafka.connect.rest.basic.auth.extension.JaasBasicAuthFilterTest > testBadCredential STARTED

org.apache.kafka.connect.rest.basic.auth.extension.JaasBasicAuthFilterTest > testBadCredential PASSED

org.apache.kafka.connect.rest.basic.auth.extension.JaasBasicAuthFilterTest > testBadPassword STARTED

org.apache.kafka.connect.rest.basic.auth.extension.JaasBasicAuthFilterTest > testBadPassword PASSED

org.apache.kafka.connect.rest.basic.auth.extension.JaasBasicAuthFilterTest > testUnknownBearer STARTED

org.apache.kafka.connect.rest.basic.auth.extension.JaasBasicAuthFilterTest > testUnknownBearer PASSED

org.apache.kafka.connect.rest.basic.auth.extension.JaasBasicAuthFilterTest > testUnknownLoginModule STARTED

org.apache.kafka.connect.rest.basic.auth.extension.JaasBasicAuthFilterTest > testUnknownLoginModule PASSED

org.apache.kafka.connect.rest.basic.auth.extension.JaasBasicAuthFilterTest > testUnknownCredentialsFile STARTED

org.apache.kafka.connect.rest.basic.auth.extension.JaasBasicAuthFilterTest > testUnknownCredentialsFile PASSED

org.apache.kafka.connect.rest.basic.auth.extension.JaasBasicAuthFilterTest > testEmptyCredentialsFile STARTED

org.apache.kafka.connect.rest.basic.auth.extension.JaasBasicAuthFilterTest > testEmptyCredentialsFile PASSED

org.apache.kafka.connect.rest.basic.auth.extension.JaasBasicAuthFilterTest > testNoFileOption STARTED

org.apache.kafka.connect.rest.basic.auth.extension.JaasBasicAuthFilterTest > testNoFileOption PASSED

FAILURE: Build completed with 2 failures.

1: Task failed with an exception.
-----------
* What went wrong:
Execution failed for task ':core:test'.
> There were failing tests. See the report at: file://<https://builds.apache.org/job/kafka-trunk-jdk11/ws/core/build/reports/tests/test/index.html>

* Try:
Run with --stacktrace option to get the stack trace. Run with --info or --debug option to get more log output. Run with --scan to get full insights.
==============================================================================

2: Task failed with an exception.
-----------
* What went wrong:
Execution failed for task ':streams:test'.
> There were failing tests. See the report at: file://<https://builds.apache.org/job/kafka-trunk-jdk11/ws/streams/build/reports/tests/test/index.html>

* Try:
Run with --stacktrace option to get the stack trace. Run with --info or --debug option to get more log output. Run with --scan to get full insights.
==============================================================================

* Get more help at https://help.gradle.org

Deprecated Gradle features were used in this build, making it incompatible with Gradle 6.0.
Use '--warning-mode all' to show the individual deprecation warnings.
See https://docs.gradle.org/5.1.1/userguide/command_line_interface.html#sec:command_line_warnings

BUILD FAILED in 3h 8m 45s
173 actionable tasks: 172 executed, 1 up-to-date
Build step 'Execute shell' marked build as failure
Recording test results
Setting GRADLE_4_10_2_HOME=/home/jenkins/tools/gradle/4.10.2
Setting GRADLE_4_10_2_HOME=/home/jenkins/tools/gradle/4.10.2

Jenkins build is back to normal : kafka-trunk-jdk11 #439

Posted by Apache Jenkins Server <je...@builds.apache.org>.
See <https://builds.apache.org/job/kafka-trunk-jdk11/439/display/redirect?page=changes>


Build failed in Jenkins: kafka-trunk-jdk11 #438

Posted by Apache Jenkins Server <je...@builds.apache.org>.
See <https://builds.apache.org/job/kafka-trunk-jdk11/438/display/redirect?page=changes>

Changes:

[wangguoz] KAFKA-7778: Add KTable.suppress to Scala API (#6314)

[vahid.hashemian] KAFKA-7471: Multiple Consumer Group Management Feature (#5726)

------------------------------------------
[...truncated 2.37 MB...]
org.apache.kafka.streams.StreamsConfigTest > testGetConsumerConfigs PASSED

org.apache.kafka.streams.StreamsConfigTest > shouldOverrideNonPrefixedCustomConfigsWithPrefixedConfigs STARTED

org.apache.kafka.streams.StreamsConfigTest > shouldOverrideNonPrefixedCustomConfigsWithPrefixedConfigs PASSED

org.apache.kafka.streams.StreamsConfigTest > shouldAcceptAtLeastOnce STARTED

org.apache.kafka.streams.StreamsConfigTest > shouldAcceptAtLeastOnce PASSED

org.apache.kafka.streams.StreamsConfigTest > shouldUseCorrectDefaultsWhenNoneSpecified STARTED

org.apache.kafka.streams.StreamsConfigTest > shouldUseCorrectDefaultsWhenNoneSpecified PASSED

org.apache.kafka.streams.StreamsConfigTest > shouldAllowSettingProducerEnableIdempotenceIfEosDisabled STARTED

org.apache.kafka.streams.StreamsConfigTest > shouldAllowSettingProducerEnableIdempotenceIfEosDisabled PASSED

org.apache.kafka.streams.StreamsConfigTest > defaultSerdeShouldBeConfigured STARTED

org.apache.kafka.streams.StreamsConfigTest > defaultSerdeShouldBeConfigured PASSED

org.apache.kafka.streams.StreamsConfigTest > shouldSetDifferentDefaultsIfEosEnabled STARTED

org.apache.kafka.streams.StreamsConfigTest > shouldSetDifferentDefaultsIfEosEnabled PASSED

org.apache.kafka.streams.StreamsConfigTest > shouldNotOverrideUserConfigRetriesIfExactlyOnceEnabled STARTED

org.apache.kafka.streams.StreamsConfigTest > shouldNotOverrideUserConfigRetriesIfExactlyOnceEnabled PASSED

org.apache.kafka.streams.StreamsConfigTest > shouldSupportPrefixedConsumerConfigs STARTED

org.apache.kafka.streams.StreamsConfigTest > shouldSupportPrefixedConsumerConfigs PASSED

org.apache.kafka.streams.StreamsConfigTest > shouldOverrideStreamsDefaultConsumerConfigs STARTED

org.apache.kafka.streams.StreamsConfigTest > shouldOverrideStreamsDefaultConsumerConfigs PASSED

org.apache.kafka.streams.StreamsConfigTest > testGetProducerConfigs STARTED

org.apache.kafka.streams.StreamsConfigTest > testGetProducerConfigs PASSED

org.apache.kafka.streams.StreamsConfigTest > shouldThrowStreamsExceptionIfValueSerdeConfigFails STARTED

org.apache.kafka.streams.StreamsConfigTest > shouldThrowStreamsExceptionIfValueSerdeConfigFails PASSED

org.apache.kafka.streams.StreamsConfigTest > shouldResetToDefaultIfConsumerAutoCommitIsOverridden STARTED

org.apache.kafka.streams.StreamsConfigTest > shouldResetToDefaultIfConsumerAutoCommitIsOverridden PASSED

org.apache.kafka.streams.StreamsConfigTest > shouldThrowExceptionIfNotAtLestOnceOrExactlyOnce STARTED

org.apache.kafka.streams.StreamsConfigTest > shouldThrowExceptionIfNotAtLestOnceOrExactlyOnce PASSED

org.apache.kafka.streams.StreamsConfigTest > shouldAllowSettingConsumerIsolationLevelIfEosDisabled STARTED

org.apache.kafka.streams.StreamsConfigTest > shouldAllowSettingConsumerIsolationLevelIfEosDisabled PASSED

org.apache.kafka.streams.StreamsConfigTest > shouldSpecifyOptimizationWhenNotExplicitlyAddedToConfigs STARTED

org.apache.kafka.streams.StreamsConfigTest > shouldSpecifyOptimizationWhenNotExplicitlyAddedToConfigs PASSED

org.apache.kafka.streams.StreamsConfigTest > testGetGlobalConsumerConfigs STARTED

org.apache.kafka.streams.StreamsConfigTest > testGetGlobalConsumerConfigs PASSED

org.apache.kafka.streams.StreamsConfigTest > shouldSupportPrefixedProducerConfigs STARTED

org.apache.kafka.streams.StreamsConfigTest > shouldSupportPrefixedProducerConfigs PASSED

org.apache.kafka.streams.StreamsConfigTest > shouldSupportPrefixedPropertiesThatAreNotPartOfRestoreConsumerConfig STARTED

org.apache.kafka.streams.StreamsConfigTest > shouldSupportPrefixedPropertiesThatAreNotPartOfRestoreConsumerConfig PASSED

org.apache.kafka.streams.StreamsConfigTest > testGetRestoreConsumerConfigsWithRestoreConsumerOverridenPrefix STARTED

org.apache.kafka.streams.StreamsConfigTest > testGetRestoreConsumerConfigsWithRestoreConsumerOverridenPrefix PASSED

org.apache.kafka.streams.StreamsConfigTest > shouldThrowConfigExceptionIfMaxInFlightRequestsPerConnectionIsInvalidStringIfEosEnabled STARTED

org.apache.kafka.streams.StreamsConfigTest > shouldThrowConfigExceptionIfMaxInFlightRequestsPerConnectionIsInvalidStringIfEosEnabled PASSED

org.apache.kafka.streams.StreamsConfigTest > shouldOverrideStreamsDefaultProducerConfigs STARTED

org.apache.kafka.streams.StreamsConfigTest > shouldOverrideStreamsDefaultProducerConfigs PASSED

org.apache.kafka.streams.StreamsConfigTest > shouldSupportPrefixedPropertiesThatAreNotPartOfProducerConfig STARTED

org.apache.kafka.streams.StreamsConfigTest > shouldSupportPrefixedPropertiesThatAreNotPartOfProducerConfig PASSED

org.apache.kafka.streams.StreamsConfigTest > shouldSupportPrefixedGlobalConsumerConfigs STARTED

org.apache.kafka.streams.StreamsConfigTest > shouldSupportPrefixedGlobalConsumerConfigs PASSED

org.apache.kafka.streams.StreamsConfigTest > shouldBeSupportNonPrefixedConsumerConfigs STARTED

org.apache.kafka.streams.StreamsConfigTest > shouldBeSupportNonPrefixedConsumerConfigs PASSED

org.apache.kafka.streams.StreamsConfigTest > consumerConfigShouldContainAdminClientConfigsForRetriesAndRetryBackOffMsWithAdminPrefix STARTED

org.apache.kafka.streams.StreamsConfigTest > consumerConfigShouldContainAdminClientConfigsForRetriesAndRetryBackOffMsWithAdminPrefix PASSED

org.apache.kafka.streams.StreamsConfigTest > shouldOverrideStreamsDefaultConsumerConifgsOnRestoreConsumer STARTED

org.apache.kafka.streams.StreamsConfigTest > shouldOverrideStreamsDefaultConsumerConifgsOnRestoreConsumer PASSED

org.apache.kafka.streams.StreamsConfigTest > shouldSupportPrefixedPropertiesThatAreNotPartOfGlobalConsumerConfig STARTED

org.apache.kafka.streams.StreamsConfigTest > shouldSupportPrefixedPropertiesThatAreNotPartOfGlobalConsumerConfig PASSED

org.apache.kafka.streams.StreamsConfigTest > shouldAcceptExactlyOnce STARTED

org.apache.kafka.streams.StreamsConfigTest > shouldAcceptExactlyOnce PASSED

org.apache.kafka.streams.StreamsConfigTest > testGetGlobalConsumerConfigsWithGlobalConsumerOverridenPrefix STARTED

org.apache.kafka.streams.StreamsConfigTest > testGetGlobalConsumerConfigsWithGlobalConsumerOverridenPrefix PASSED

org.apache.kafka.streams.StreamsConfigTest > shouldThrowExceptionIfMaxInFlightRequestsGreaterThanFiveIfEosEnabled STARTED

org.apache.kafka.streams.StreamsConfigTest > shouldThrowExceptionIfMaxInFlightRequestsGreaterThanFiveIfEosEnabled PASSED

org.apache.kafka.streams.StreamsConfigTest > shouldSetInternalLeaveGroupOnCloseConfigToFalseInConsumer STARTED

org.apache.kafka.streams.StreamsConfigTest > shouldSetInternalLeaveGroupOnCloseConfigToFalseInConsumer PASSED

org.apache.kafka.streams.StreamsConfigTest > shouldSupportPrefixedPropertiesThatAreNotPartOfConsumerConfig STARTED

org.apache.kafka.streams.StreamsConfigTest > shouldSupportPrefixedPropertiesThatAreNotPartOfConsumerConfig PASSED

org.apache.kafka.streams.StreamsConfigTest > shouldForwardCustomConfigsWithNoPrefixToAllClients STARTED

org.apache.kafka.streams.StreamsConfigTest > shouldForwardCustomConfigsWithNoPrefixToAllClients PASSED

org.apache.kafka.streams.StreamsConfigTest > shouldResetToDefaultIfRestoreConsumerAutoCommitIsOverridden STARTED

org.apache.kafka.streams.StreamsConfigTest > shouldResetToDefaultIfRestoreConsumerAutoCommitIsOverridden PASSED

org.apache.kafka.streams.StreamsConfigTest > shouldSpecifyCorrectValueSerdeClassOnError STARTED

org.apache.kafka.streams.StreamsConfigTest > shouldSpecifyCorrectValueSerdeClassOnError PASSED

org.apache.kafka.streams.StreamsConfigTest > shouldAllowToSpecifyMaxInFlightRequestsPerConnectionAsStringIfEosEnabled STARTED

org.apache.kafka.streams.StreamsConfigTest > shouldAllowToSpecifyMaxInFlightRequestsPerConnectionAsStringIfEosEnabled PASSED

org.apache.kafka.streams.StreamsConfigTest > shouldResetToDefaultIfGlobalConsumerAutoCommitIsOverridden STARTED

org.apache.kafka.streams.StreamsConfigTest > shouldResetToDefaultIfGlobalConsumerAutoCommitIsOverridden PASSED

org.apache.kafka.streams.StreamsConfigTest > shouldResetToDefaultIfConsumerIsolationLevelIsOverriddenIfEosEnabled STARTED

org.apache.kafka.streams.StreamsConfigTest > shouldResetToDefaultIfConsumerIsolationLevelIsOverriddenIfEosEnabled PASSED

org.apache.kafka.streams.StreamsConfigTest > shouldBeSupportNonPrefixedGlobalConsumerConfigs STARTED

org.apache.kafka.streams.StreamsConfigTest > shouldBeSupportNonPrefixedGlobalConsumerConfigs PASSED

org.apache.kafka.streams.StreamsConfigTest > shouldSupportNonPrefixedAdminConfigs STARTED

org.apache.kafka.streams.StreamsConfigTest > shouldSupportNonPrefixedAdminConfigs PASSED

org.apache.kafka.streams.StreamsConfigTest > shouldNotOverrideUserConfigCommitIntervalMsIfExactlyOnceEnabled STARTED

org.apache.kafka.streams.StreamsConfigTest > shouldNotOverrideUserConfigCommitIntervalMsIfExactlyOnceEnabled PASSED

org.apache.kafka.streams.StreamsConfigTest > shouldSupportMultipleBootstrapServers STARTED

org.apache.kafka.streams.StreamsConfigTest > shouldSupportMultipleBootstrapServers PASSED

org.apache.kafka.streams.StreamsConfigTest > shouldSpecifyNoOptimizationWhenNotExplicitlyAddedToConfigs STARTED

org.apache.kafka.streams.StreamsConfigTest > shouldSpecifyNoOptimizationWhenNotExplicitlyAddedToConfigs PASSED

org.apache.kafka.streams.StreamsConfigTest > shouldThrowConfigExceptionWhenOptimizationConfigNotValueInRange STARTED

org.apache.kafka.streams.StreamsConfigTest > shouldThrowConfigExceptionWhenOptimizationConfigNotValueInRange PASSED

org.apache.kafka.streams.StreamsConfigTest > shouldThrowStreamsExceptionIfKeySerdeConfigFails STARTED

org.apache.kafka.streams.StreamsConfigTest > shouldThrowStreamsExceptionIfKeySerdeConfigFails PASSED

org.apache.kafka.streams.StreamsConfigTest > shouldSupportNonPrefixedProducerConfigs STARTED

org.apache.kafka.streams.StreamsConfigTest > shouldSupportNonPrefixedProducerConfigs PASSED

org.apache.kafka.streams.StreamsConfigTest > testGetRestoreConsumerConfigs STARTED

org.apache.kafka.streams.StreamsConfigTest > testGetRestoreConsumerConfigs PASSED

org.apache.kafka.streams.StreamsConfigTest > shouldThrowExceptionIfBootstrapServersIsNotSet STARTED

org.apache.kafka.streams.StreamsConfigTest > shouldThrowExceptionIfBootstrapServersIsNotSet PASSED

org.apache.kafka.streams.StreamsConfigTest > testGetMainConsumerConfigsWithMainConsumerOverridenPrefix STARTED

org.apache.kafka.streams.StreamsConfigTest > testGetMainConsumerConfigsWithMainConsumerOverridenPrefix PASSED

org.apache.kafka.streams.StreamsConfigTest > shouldBeSupportNonPrefixedRestoreConsumerConfigs STARTED

org.apache.kafka.streams.StreamsConfigTest > shouldBeSupportNonPrefixedRestoreConsumerConfigs PASSED

org.apache.kafka.streams.StreamsConfigTest > shouldSupportPrefixedRestoreConsumerConfigs STARTED

org.apache.kafka.streams.StreamsConfigTest > shouldSupportPrefixedRestoreConsumerConfigs PASSED

org.apache.kafka.streams.StreamsConfigTest > shouldThrowExceptionIfApplicationIdIsNotSet STARTED

org.apache.kafka.streams.StreamsConfigTest > shouldThrowExceptionIfApplicationIdIsNotSet PASSED

org.apache.kafka.streams.StreamsConfigTest > consumerConfigMustContainStreamPartitionAssignorConfig STARTED

org.apache.kafka.streams.StreamsConfigTest > consumerConfigMustContainStreamPartitionAssignorConfig PASSED

org.apache.kafka.streams.StreamsConfigTest > shouldSpecifyCorrectKeySerdeClassOnError STARTED

org.apache.kafka.streams.StreamsConfigTest > shouldSpecifyCorrectKeySerdeClassOnError PASSED
streams-4: SMOKE-TEST-CLIENT-CLOSED
streams-7: SMOKE-TEST-CLIENT-CLOSED
streams-0: SMOKE-TEST-CLIENT-CLOSED
streams-6: SMOKE-TEST-CLIENT-CLOSED
streams-5: SMOKE-TEST-CLIENT-CLOSED
streams-1: SMOKE-TEST-CLIENT-CLOSED
streams-3: SMOKE-TEST-CLIENT-CLOSED
streams-2: SMOKE-TEST-CLIENT-CLOSED

FAILURE: Build failed with an exception.

* What went wrong:
Execution failed for task ':core:test'.
> There were failing tests. See the report at: file://<https://builds.apache.org/job/kafka-trunk-jdk11/ws/core/build/reports/tests/test/index.html>

* Try:
Run with --stacktrace option to get the stack trace. Run with --info or --debug option to get more log output. Run with --scan to get full insights.

* Get more help at https://help.gradle.org

Deprecated Gradle features were used in this build, making it incompatible with Gradle 6.0.
Use '--warning-mode all' to show the individual deprecation warnings.
See https://docs.gradle.org/5.1.1/userguide/command_line_interface.html#sec:command_line_warnings

BUILD FAILED in 2h 33m 19s
173 actionable tasks: 172 executed, 1 up-to-date
Build step 'Execute shell' marked build as failure
Recording test results
Setting GRADLE_4_10_2_HOME=/home/jenkins/tools/gradle/4.10.2
Setting GRADLE_4_10_2_HOME=/home/jenkins/tools/gradle/4.10.2
Not sending mail to unregistered user vahid.hashemian@gmail.com
Not sending mail to unregistered user wangguoz@gmail.com