You are viewing a plain text version of this content. The canonical link for it is here.
Posted to dev@juneau.apache.org by Apache Jenkins Server <je...@builds.apache.org> on 2026/10/16 20:46:20 UTC

Build failed in Jenkins: Juneau » Juneau-Java-17 #2753

See <https://ci-builds.apache.org/job/Juneau/job/Juneau-Java-17/2753/display/redirect?page=changes>

Changes:

[James Bognar] Bind the bus websocket CSRF boundary to a trusted Forwarded/X-Forwarded host and proto with trustedHops and new boundary reason codes (J0802); and compare HC4.5 and policy redirect hops against the first origin, restoring credentials only on GET/HEAD returns, refusing userinfo in redirect Locations and legacy AbstractHttpClient instances, and stripping Proxy-Authorization on tunnelled routes (J0824)


------------------------------------------
[...truncated 1.69 MiB...]
[INFO] Compiling 6 source files with javac [debug release 17] to target/classes
[INFO] 
[INFO] --- bundle:6.2.0:manifest (bundle-manifest) @ juneau-rest-client-apache-httpclient-50 ---
[INFO] No MANIFEST.MF file found, generating manifest.
[INFO] Writing manifest: <https://ci-builds.apache.org/job/Juneau/job/Juneau-Java-17/ws/juneau-rest/juneau-rest-client-apache-httpclient-50/target/classes/META-INF/MANIFEST.MF>
[INFO] 
[INFO] --- resources:3.4.0:testResources (default-testResources) @ juneau-rest-client-apache-httpclient-50 ---
[INFO] skip non existing resourceDirectory <https://ci-builds.apache.org/job/Juneau/job/Juneau-Java-17/ws/juneau-rest/juneau-rest-client-apache-httpclient-50/src/test/resources>
[INFO] Copying 3 resources from target/maven-shared-archive-resources to target/test-classes
[INFO] 
[INFO] --- compiler:3.16.0:testCompile (default-testCompile) @ juneau-rest-client-apache-httpclient-50 ---
[INFO] Recompiling the module because of changed dependency.
[INFO] Compiling 9 source files with javac [debug release 17] to target/test-classes
[INFO] 
[INFO] --- surefire:3.5.4:test (default-test) @ juneau-rest-client-apache-httpclient-50 ---
[INFO] Using auto detected provider org.apache.maven.surefire.junitplatform.JUnitPlatformProvider
[WARNING] The system property java.util.logging.config.file is configured twice! The property appears in <argLine/> and any of <systemPropertyVariables/>, <systemProperties/> or user property.
[INFO] 
[INFO] -------------------------------------------------------
[INFO]  T E S T S
[INFO] -------------------------------------------------------
[INFO] Running org.apache.juneau.rest.client.ApacheHc5Transport_CallerClientRedirectCredentials_Test
SLF4J: Failed to load class "org.slf4j.impl.StaticLoggerBinder".
SLF4J: Defaulting to no-operation (NOP) logger implementation
SLF4J: See http://www.slf4j.org/codes.html#StaticLoggerBinder for further details.
[ERROR] Tests run: 15, Failures: 0, Errors: 1, Skipped: 0, Time elapsed: 2.227 s <<< FAILURE! -- in org.apache.juneau.rest.client.ApacheHc5Transport_CallerClientRedirectCredentials_Test
[ERROR] org.apache.juneau.rest.client.ApacheHc5Transport_CallerClientRedirectCredentials_Test.b08_crossOrigin_retriedAfter503_laxRedirectStrategy_retryStaysStripped -- Time elapsed: 1.180 s <<< ERROR!
org.apache.juneau.rest.client.TransportException: HTTP transport error: 127.0.0.1:45229 failed to respond
	at org.apache.juneau.rest.client.apachehttpclient50.ApacheHc5Transport.sendOnce(ApacheHc5Transport.java:202)
	at org.apache.juneau.rest.client.apachehttpclient50.ApacheHc5Transport.execute(ApacheHc5Transport.java:158)
	at org.apache.juneau.rest.client.RestRequest.run(RestRequest.java:621)
	at org.apache.juneau.rest.client.ApacheHc5Transport_CallerClientRedirectCredentials_Test.get(ApacheHc5Transport_CallerClientRedirectCredentials_Test.java:235)
	at org.apache.juneau.rest.client.ApacheHc5Transport_CallerClientRedirectCredentials_Test.get(ApacheHc5Transport_CallerClientRedirectCredentials_Test.java:224)
	at org.apache.juneau.rest.client.ApacheHc5Transport_CallerClientRedirectCredentials_Test.b08_crossOrigin_retriedAfter503_laxRedirectStrategy_retryStaysStripped(ApacheHc5Transport_CallerClientRedirectCredentials_Test.java:348)
Caused by: org.apache.hc.core5.http.NoHttpResponseException: 127.0.0.1:45229 failed to respond
	at org.apache.hc.core5.http.impl.io.DefaultBHttpClientConnection.receiveResponseHeader(DefaultBHttpClientConnection.java:333)
	at org.apache.hc.core5.http.impl.io.HttpRequestExecutor.execute(HttpRequestExecutor.java:197)
	at org.apache.hc.client5.http.impl.classic.InternalExecRuntime.lambda$execute$0(InternalExecRuntime.java:236)
	at org.apache.hc.client5.http.impl.io.PoolingHttpClientConnectionManager$InternalConnectionEndpoint.execute(PoolingHttpClientConnectionManager.java:851)
	at org.apache.hc.client5.http.impl.classic.InternalExecRuntime.execute(InternalExecRuntime.java:233)
	at org.apache.hc.client5.http.impl.classic.MainClientExec.execute(MainClientExec.java:120)
	at org.apache.hc.client5.http.impl.classic.ExecChainElement.execute(ExecChainElement.java:51)
	at org.apache.hc.client5.http.impl.classic.ConnectExec.execute(ConnectExec.java:192)
	at org.apache.hc.client5.http.impl.classic.ExecChainElement.execute(ExecChainElement.java:51)
	at org.apache.hc.client5.http.impl.classic.ProtocolExec.execute(ProtocolExec.java:192)
	at org.apache.hc.client5.http.impl.classic.ExecChainElement.execute(ExecChainElement.java:51)
	at org.apache.hc.client5.http.impl.classic.ContentCompressionExec.execute(ContentCompressionExec.java:138)
	at org.apache.hc.client5.http.impl.classic.ExecChainElement.execute(ExecChainElement.java:51)
	at org.apache.hc.client5.http.impl.classic.HttpRequestRetryExec.execute(HttpRequestRetryExec.java:112)
	at org.apache.hc.client5.http.impl.classic.ExecChainElement.execute(ExecChainElement.java:51)
	at org.apache.hc.client5.http.impl.classic.RedirectExec.execute(RedirectExec.java:110)
	at org.apache.hc.client5.http.impl.classic.ExecChainElement.execute(ExecChainElement.java:51)
	at org.apache.hc.client5.http.impl.classic.InternalHttpClient.doExecute(InternalHttpClient.java:186)
	at org.apache.hc.client5.http.impl.classic.CloseableHttpClient.execute(CloseableHttpClient.java:87)
	at org.apache.hc.client5.http.impl.classic.CloseableHttpClient.execute(CloseableHttpClient.java:55)
	at org.apache.hc.client5.http.classic.HttpClient.executeOpen(HttpClient.java:183)
	at org.apache.juneau.rest.client.apachehttpclient50.ApacheHc5Transport.sendOnce(ApacheHc5Transport.java:200)
	... 5 more

[INFO] Running org.apache.juneau.rest.client.ApacheHc5Transport_Edge_Test
[INFO] Tests run: 7, Failures: 0, Errors: 0, Skipped: 0, Time elapsed: 0.033 s -- in org.apache.juneau.rest.client.ApacheHc5Transport_Edge_Test
[INFO] Running org.apache.juneau.rest.client.ApacheHc5Transport_SsrfGuard_Test
[INFO] Tests run: 8, Failures: 0, Errors: 0, Skipped: 0, Time elapsed: 0.135 s -- in org.apache.juneau.rest.client.ApacheHc5Transport_SsrfGuard_Test
[INFO] Running org.apache.juneau.rest.client.ApacheHc5Transport_BuiltClientRedirectCredentials_Test
[ERROR] Tests run: 12, Failures: 0, Errors: 1, Skipped: 0, Time elapsed: 1.472 s <<< FAILURE! -- in org.apache.juneau.rest.client.ApacheHc5Transport_BuiltClientRedirectCredentials_Test
[ERROR] org.apache.juneau.rest.client.ApacheHc5Transport_BuiltClientRedirectCredentials_Test.b06_crossOrigin_retriedAfter503_retryStaysStripped -- Time elapsed: 1.024 s <<< ERROR!
org.apache.juneau.rest.client.TransportException: HTTP transport error: 127.0.0.1:35727 failed to respond
	at org.apache.juneau.rest.client.apachehttpclient50.ApacheHc5Transport.sendOnce(ApacheHc5Transport.java:202)
	at org.apache.juneau.rest.client.apachehttpclient50.ApacheHc5Transport.execute(ApacheHc5Transport.java:158)
	at org.apache.juneau.rest.client.RestRequest.run(RestRequest.java:621)
	at org.apache.juneau.rest.client.ApacheHc5Transport_BuiltClientRedirectCredentials_Test.send(ApacheHc5Transport_BuiltClientRedirectCredentials_Test.java:178)
	at org.apache.juneau.rest.client.ApacheHc5Transport_BuiltClientRedirectCredentials_Test.get(ApacheHc5Transport_BuiltClientRedirectCredentials_Test.java:185)
	at org.apache.juneau.rest.client.ApacheHc5Transport_BuiltClientRedirectCredentials_Test.b06_crossOrigin_retriedAfter503_retryStaysStripped(ApacheHc5Transport_BuiltClientRedirectCredentials_Test.java:282)
Caused by: org.apache.hc.core5.http.NoHttpResponseException: 127.0.0.1:35727 failed to respond
	at org.apache.hc.core5.http.impl.io.DefaultBHttpClientConnection.receiveResponseHeader(DefaultBHttpClientConnection.java:333)
	at org.apache.hc.core5.http.impl.io.HttpRequestExecutor.execute(HttpRequestExecutor.java:197)
	at org.apache.hc.client5.http.impl.classic.InternalExecRuntime.lambda$execute$0(InternalExecRuntime.java:236)
	at org.apache.hc.client5.http.impl.io.PoolingHttpClientConnectionManager$InternalConnectionEndpoint.execute(PoolingHttpClientConnectionManager.java:851)
	at org.apache.hc.client5.http.impl.classic.InternalExecRuntime.execute(InternalExecRuntime.java:233)
	at org.apache.hc.client5.http.impl.classic.MainClientExec.execute(MainClientExec.java:120)
	at org.apache.hc.client5.http.impl.classic.ExecChainElement.execute(ExecChainElement.java:51)
	at org.apache.hc.client5.http.impl.classic.ConnectExec.execute(ConnectExec.java:192)
	at org.apache.hc.client5.http.impl.classic.ExecChainElement.execute(ExecChainElement.java:51)
	at org.apache.hc.client5.http.impl.classic.ProtocolExec.execute(ProtocolExec.java:192)
	at org.apache.hc.client5.http.impl.classic.ExecChainElement.execute(ExecChainElement.java:51)
	at org.apache.hc.client5.http.impl.classic.ContentCompressionExec.execute(ContentCompressionExec.java:138)
	at org.apache.hc.client5.http.impl.classic.ExecChainElement.execute(ExecChainElement.java:51)
	at org.apache.hc.client5.http.impl.classic.HttpRequestRetryExec.execute(HttpRequestRetryExec.java:112)
	at org.apache.hc.client5.http.impl.classic.ExecChainElement.execute(ExecChainElement.java:51)
	at org.apache.hc.client5.http.impl.classic.RedirectExec.execute(RedirectExec.java:110)
	at org.apache.hc.client5.http.impl.classic.ExecChainElement.execute(ExecChainElement.java:51)
	at org.apache.hc.client5.http.impl.classic.InternalHttpClient.doExecute(InternalHttpClient.java:186)
	at org.apache.hc.client5.http.impl.classic.CloseableHttpClient.execute(CloseableHttpClient.java:87)
	at org.apache.hc.client5.http.impl.classic.CloseableHttpClient.execute(CloseableHttpClient.java:55)
	at org.apache.hc.client5.http.classic.HttpClient.executeOpen(HttpClient.java:183)
	at org.apache.juneau.rest.client.apachehttpclient50.ApacheHc5Transport.sendOnce(ApacheHc5Transport.java:200)
	... 5 more

[INFO] Running org.apache.juneau.rest.client.apachehttpclient50.ApacheHc5Transport_RedirectCredentials_Test
[INFO] Tests run: 6, Failures: 0, Errors: 0, Skipped: 0, Time elapsed: 0.068 s -- in org.apache.juneau.rest.client.apachehttpclient50.ApacheHc5Transport_RedirectCredentials_Test
[INFO] Running org.apache.juneau.rest.client.apachehttpclient50.CredentialGuardingContext_Test
[INFO] Tests run: 19, Failures: 0, Errors: 0, Skipped: 0, Time elapsed: 0.040 s -- in org.apache.juneau.rest.client.apachehttpclient50.CredentialGuardingContext_Test
[INFO] Running org.apache.juneau.rest.client.apachehttpclient50.PolicyPinningDnsResolver_Test
[INFO] Tests run: 3, Failures: 0, Errors: 0, Skipped: 0, Time elapsed: 0.010 s -- in org.apache.juneau.rest.client.apachehttpclient50.PolicyPinningDnsResolver_Test
[INFO] Running org.apache.juneau.rest.client.ApacheHc5Transport_Test
[INFO] Tests run: 18, Failures: 0, Errors: 0, Skipped: 0, Time elapsed: 0.152 s -- in org.apache.juneau.rest.client.ApacheHc5Transport_Test
[INFO] Running org.apache.juneau.rest.client.ApacheHc5Transport_Timeout_Test
[INFO] Tests run: 5, Failures: 0, Errors: 0, Skipped: 0, Time elapsed: 4.249 s -- in org.apache.juneau.rest.client.ApacheHc5Transport_Timeout_Test
[INFO] 
[INFO] Results:
[INFO] 
[ERROR] Errors: 
[ERROR]   ApacheHc5Transport_BuiltClientRedirectCredentials_Test.b06_crossOrigin_retriedAfter503_retryStaysStripped:282->get:185->send:178 » Transport HTTP transport error: 127.0.0.1:35727 failed to respond
[ERROR]   ApacheHc5Transport_CallerClientRedirectCredentials_Test.b08_crossOrigin_retriedAfter503_laxRedirectStrategy_retryStaysStripped:348->get:224->get:235 » Transport HTTP transport error: 127.0.0.1:45229 failed to respond
[INFO] 
[ERROR] Tests run: 93, Failures: 0, Errors: 2, Skipped: 0
[INFO] 
[INFO] 
[INFO] ------------------------------------------------------------------------
[INFO] Skipping Apache Juneau
[INFO] This project has been banned from the build due to previous failures.
[INFO] ------------------------------------------------------------------------
[INFO] ------------------------------------------------------------------------
[INFO] Reactor Summary for Apache Juneau 10.0.0-SNAPSHOT:
[INFO] 
[INFO] Apache Juneau ...................................... SUCCESS [ 25.864 s]
[INFO] Apache Juneau Bill of Materials .................... SUCCESS [  3.784 s]
[INFO] Apache Juneau Core ................................. SUCCESS [  5.860 s]
[INFO] Apache Juneau Commons .............................. SUCCESS [01:32 min]
[INFO] Apache Juneau Test Utilities ....................... SUCCESS [  5.562 s]
[INFO] Apache Juneau Testing Toolkit ...................... SUCCESS [ 14.566 s]
[INFO] Apache Juneau Marshall ............................. SUCCESS [02:26 min]
[INFO] Apache Juneau Beans ................................ SUCCESS [  4.310 s]
[INFO] Apache Juneau RFC 7807 Beans ....................... SUCCESS [  7.670 s]
[INFO] Apache Juneau Marshall Test Utilities .............. SUCCESS [  6.327 s]
[INFO] Apache Juneau REST ................................. SUCCESS [  6.975 s]
[INFO] Apache Juneau REST Common .......................... SUCCESS [ 20.563 s]
[INFO] Apache Juneau Config ............................... SUCCESS [ 14.185 s]
[INFO] Apache Juneau Common Beans ......................... SUCCESS [ 11.254 s]
[INFO] Apache Juneau HTML5 Beans .......................... SUCCESS [ 25.791 s]
[INFO] Apache Juneau JSON Schema Beans .................... SUCCESS [ 12.075 s]
[INFO] Apache Juneau Swagger 2.0 Beans .................... SUCCESS [ 12.606 s]
[INFO] Apache Juneau OpenAPI 3.0 Beans .................... SUCCESS [ 14.635 s]
[INFO] Apache Juneau REST Server .......................... SUCCESS [ 39.134 s]
[INFO] Apache Juneau REST Client .......................... SUCCESS [ 22.087 s]
[INFO] Apache Juneau REST Common (Classic) ................ SUCCESS [ 19.240 s]
[INFO] Apache Juneau REST Client (Classic) ................ SUCCESS [ 21.494 s]
[INFO] Apache Juneau REST Mock ............................ SUCCESS [ 17.838 s]
[INFO] Apache Juneau Microservices ........................ SUCCESS [  3.825 s]
[INFO] Apache Juneau Microservice ......................... SUCCESS [ 22.876 s]
[INFO] Apache Juneau REST Server Message Bus .............. SUCCESS [ 16.444 s]
[INFO] Apache Juneau REST Server Bus WebSocket ............ SUCCESS [ 16.797 s]
[INFO] Apache Juneau Microservice Jetty ................... SUCCESS [ 54.970 s]
[INFO] Apache Juneau Dependency Bundles ................... SUCCESS [  3.598 s]
[INFO] Apache Juneau Jetty Microservice Bundle ............ SUCCESS [  3.970 s]
[INFO] Apache Juneau Microservice Tomcat .................. SUCCESS [ 14.331 s]
[INFO] Apache Juneau Tomcat Microservice Bundle ........... SUCCESS [  3.819 s]
[INFO] Apache Juneau REST Server Spring Boot .............. SUCCESS [ 27.431 s]
[INFO] Apache Juneau Spring Boot Bundle ................... SUCCESS [  3.982 s]
[INFO] Apache Juneau REST Server Micrometer ............... SUCCESS [ 14.495 s]
[INFO] Apache Juneau REST Server OpenTelemetry ............ SUCCESS [ 13.963 s]
[INFO] Apache Juneau OTLP Observability Bundle ............ SUCCESS [  3.883 s]
[INFO] Apache Juneau BeanQuery SQL ........................ SUCCESS [  8.780 s]
[INFO] Apache Juneau BeanQuery Postgres ................... SUCCESS [  8.329 s]
[INFO] juneau/core/marshall-rdf ........................... SUCCESS [ 52.175 s]
[INFO] Apache Juneau REST Server RDF ...................... SUCCESS [  6.532 s]
[INFO] Apache Juneau JSON-RPC Beans ....................... SUCCESS [  8.239 s]
[INFO] Apache Juneau REST Server MCP ...................... SUCCESS [ 19.533 s]
[INFO] Apache Juneau MCP Beans (2025-06-18) ............... SUCCESS [ 10.089 s]
[INFO] Apache Juneau REST Server MCP (2025-06-18) ......... SUCCESS [ 29.872 s]
[INFO] Apache Juneau MCP Beans (2026-07-28) ............... SUCCESS [ 12.341 s]
[INFO] Apache Juneau REST Server Reactive Streams Core .... SUCCESS [ 12.230 s]
[INFO] Apache Juneau REST Auth OAuth Flow ................. SUCCESS [  8.938 s]
[INFO] Apache Juneau REST Server JWT ...................... SUCCESS [ 19.899 s]
[INFO] Apache Juneau REST Server OAuth .................... SUCCESS [ 13.125 s]
[INFO] Apache Juneau REST Server MCP (2026-07-28) ......... SUCCESS [ 51.741 s]
[INFO] Apache Juneau REST Server SAML ..................... SUCCESS [ 47.048 s]
[INFO] Apache Juneau REST Server OIDC Relying Party ....... SUCCESS [ 25.787 s]
[INFO] Apache Juneau REST Server Logging Backends ......... SUCCESS [  8.683 s]
[INFO] Apache Juneau REST Server DataTables ............... SUCCESS [ 12.694 s]
[INFO] Apache Juneau Run Report ........................... SUCCESS [  9.664 s]
[INFO] Apache Juneau REST Server Widgets .................. SUCCESS [ 20.966 s]
[INFO] Apache Juneau REST Server Console UI ............... SUCCESS [ 30.240 s]
[INFO] Apache Juneau REST Server Views .................... SUCCESS [01:29 min]
[INFO] Apache Juneau REST Server Views Markdown ........... SUCCESS [  7.666 s]
[INFO] Apache Juneau REST Server Terminal ................. SUCCESS [ 21.084 s]
[INFO] Apache Juneau REST Server View — FreeMarker ........ SUCCESS [ 19.632 s]
[INFO] Apache Juneau REST Server Console UI — FreeMarker .. SUCCESS [01:27 min]
[INFO] Apache Juneau REST Server Terminal Bus ............. SUCCESS [  9.124 s]
[INFO] Apache Juneau REST Server Reactive Streams ......... SUCCESS [ 10.183 s]
[INFO] Apache Juneau REST Server View — JSP ............... SUCCESS [ 24.131 s]
[INFO] Apache Juneau REST Server View — Thymeleaf ......... SUCCESS [ 19.388 s]
[INFO] Apache Juneau REST Server View — Mustache .......... SUCCESS [ 17.924 s]
[INFO] Apache Juneau REST Client MCP ...................... SUCCESS [  9.486 s]
[INFO] Apache Juneau REST Client MCP (2025-06-18) ......... SUCCESS [  9.033 s]
[INFO] Apache Juneau REST Client MCP (2026-07-28) ......... SUCCESS [ 11.467 s]
[INFO] Apache Juneau REST Client MCP Auth ................. SUCCESS [ 11.962 s]
[INFO] Apache Juneau NG REST Client — Apache HttpClient 4.5 Transport SUCCESS [ 14.098 s]
[INFO] Apache Juneau NG REST Client — Apache HttpClient 5.x Transport FAILURE [ 10.528 s]
[INFO] Apache Juneau NG REST Client — OkHttp Transport .... SKIPPED
[INFO] Apache Juneau NG REST Client — Jetty HttpClient Transport SKIPPED
[INFO] Apache Juneau Microservice Test Support ............ SKIPPED
[INFO] Apache Juneau Microservice Examples ................ SKIPPED
[INFO] Apache Juneau Server Config ........................ SKIPPED
[INFO] Apache Juneau Server Config Server ................. SKIPPED
[INFO] Apache Juneau Secret Store - macOS Keychain ........ SKIPPED
[INFO] Apache Juneau Run Wrapper .......................... SKIPPED
[INFO] Apache Juneau Atom Beans ........................... SKIPPED
[INFO] Apache Juneau Examples ............................. SKIPPED
[INFO] Apache Juneau Core Examples ........................ SKIPPED
[INFO] Apache Juneau MCP Examples ......................... SKIPPED
[INFO] Apache Juneau Petstore ............................. SKIPPED
[INFO] Apache Juneau Petstore Core ........................ SKIPPED
[INFO] Apache Juneau Petstore Jetty ....................... SKIPPED
[INFO] Apache Juneau Petstore Spring Boot ................. SKIPPED
[INFO] Apache Juneau HAL Beans ............................ SKIPPED
[INFO] Apache Juneau JSON:API Beans ....................... SKIPPED
[INFO] Apache Juneau JSON Patch Beans ..................... SKIPPED
[INFO] Apache Juneau Integration Tests .................... SKIPPED
[INFO] Apache Juneau Shaded Artifacts ..................... SKIPPED
[INFO] Apache Juneau Core (Shaded) ........................ SKIPPED
[INFO] Apache Juneau REST Client (Shaded) ................. SKIPPED
[INFO] Apache Juneau REST Server (Shaded) ................. SKIPPED
[INFO] Apache Juneau REST Server Spring Boot (Shaded) ..... SKIPPED
[INFO] Apache Juneau All (Shaded) ......................... SKIPPED
[INFO] Apache Juneau Distribution ......................... SKIPPED
[INFO] ------------------------------------------------------------------------
[INFO] BUILD FAILURE
[INFO] ------------------------------------------------------------------------
[INFO] Total time:  25:46 min
[INFO] Finished at: 2026-10-16T20:46:06Z
[INFO] ------------------------------------------------------------------------
[ERROR] Failed to execute goal org.apache.maven.plugins:maven-surefire-plugin:3.5.4:test (default-test) on project juneau-rest-client-apache-httpclient-50: 
[ERROR] 
[ERROR] See <https://ci-builds.apache.org/job/Juneau/job/Juneau-Java-17/ws/juneau-rest/juneau-rest-client-apache-httpclient-50/target/surefire-reports> for the individual test results.
[ERROR] See dump files (if any exist) [date].dump, [date]-jvmRun[N].dump and [date].dumpstream.
[ERROR] -> [Help 1]
[ERROR] 
[ERROR] To see the full stack trace of the errors, re-run Maven with the -e switch.
[ERROR] Re-run Maven using the -X switch to enable full debug logging.
[ERROR] 
[ERROR] For more information about the errors and possible solutions, please read the following articles:
[ERROR] [Help 1] http://cwiki.apache.org/confluence/display/MAVEN/MojoFailureException
[ERROR] 
[ERROR] After correcting the problems, you can resume the build with the command
[ERROR]   mvn <args> -rf :juneau-rest-client-apache-httpclient-50
Build step 'Invoke top-level Maven targets' marked build as failure
Recording test results
[Checks API] No suitable checks publisher found.

Jenkins build is back to normal : Juneau » Juneau-Java-17 #2754

Posted by Apache Jenkins Server <je...@builds.apache.org>.
See <https://ci-builds.apache.org/job/Juneau/job/Juneau-Java-17/2754/display/redirect?page=changes>