You are viewing a plain text version of this content. The canonical link for it is here.
Posted to builds@beam.apache.org by Apache Jenkins Server <je...@builds.apache.org> on 2018/10/31 06:46:44 UTC

Build failed in Jenkins: beam_PerformanceTests_AvroIOIT #1176

See <https://builds.apache.org/job/beam_PerformanceTests_AvroIOIT/1176/display/redirect>

------------------------------------------
[...truncated 346.05 KB...]
    	at java.io.ObjectStreamClass.initNonProxy(ObjectStreamClass.java:616)
    	at java.io.ObjectInputStream.readNonProxyDesc(ObjectInputStream.java:1630)
    	at java.io.ObjectInputStream.readClassDesc(ObjectInputStream.java:1521)
    	at java.io.ObjectInputStream.readOrdinaryObject(ObjectInputStream.java:1781)
    	at java.io.ObjectInputStream.readObject0(ObjectInputStream.java:1353)
    	at java.io.ObjectInputStream.defaultReadFields(ObjectInputStream.java:2018)
    	at java.io.ObjectInputStream.readSerialData(ObjectInputStream.java:1942)
    	at java.io.ObjectInputStream.readOrdinaryObject(ObjectInputStream.java:1808)
    	at java.io.ObjectInputStream.readObject0(ObjectInputStream.java:1353)
    	at java.io.ObjectInputStream.readObject(ObjectInputStream.java:373)
    	at org.apache.beam.sdk.util.SerializableUtils.deserializeFromByteArray(SerializableUtils.java:71)
    	... 28 more
    java.lang.RuntimeException: com.google.cloud.dataflow.worker.repackaged.com.google.common.util.concurrent.UncheckedExecutionException: java.lang.IllegalArgumentException: unable to deserialize Serialized DoFnInfo
    	at com.google.cloud.dataflow.worker.IntrinsicMapTaskExecutorFactory$1.typedApply(IntrinsicMapTaskExecutorFactory.java:192)
    	at com.google.cloud.dataflow.worker.IntrinsicMapTaskExecutorFactory$1.typedApply(IntrinsicMapTaskExecutorFactory.java:163)
    	at com.google.cloud.dataflow.worker.graph.Networks$TypeSafeNodeFunction.apply(Networks.java:63)
    	at com.google.cloud.dataflow.worker.graph.Networks$TypeSafeNodeFunction.apply(Networks.java:50)
    	at com.google.cloud.dataflow.worker.graph.Networks.replaceDirectedNetworkNodes(Networks.java:87)
    	at com.google.cloud.dataflow.worker.IntrinsicMapTaskExecutorFactory.create(IntrinsicMapTaskExecutorFactory.java:123)
    	at com.google.cloud.dataflow.worker.BatchDataflowWorker.doWork(BatchDataflowWorker.java:336)
    	at com.google.cloud.dataflow.worker.BatchDataflowWorker.getAndPerformWork(BatchDataflowWorker.java:290)
    	at com.google.cloud.dataflow.worker.DataflowBatchWorkerHarness$WorkerThread.doWork(DataflowBatchWorkerHarness.java:134)
    	at com.google.cloud.dataflow.worker.DataflowBatchWorkerHarness$WorkerThread.call(DataflowBatchWorkerHarness.java:114)
    	at com.google.cloud.dataflow.worker.DataflowBatchWorkerHarness$WorkerThread.call(DataflowBatchWorkerHarness.java:101)
    	at java.util.concurrent.FutureTask.run(FutureTask.java:266)
    	at java.util.concurrent.ThreadPoolExecutor.runWorker(ThreadPoolExecutor.java:1142)
    	at java.util.concurrent.ThreadPoolExecutor$Worker.run(ThreadPoolExecutor.java:617)
    	at java.lang.Thread.run(Thread.java:745)
    Caused by: com.google.cloud.dataflow.worker.repackaged.com.google.common.util.concurrent.UncheckedExecutionException: java.lang.IllegalArgumentException: unable to deserialize Serialized DoFnInfo
    	at com.google.cloud.dataflow.worker.repackaged.com.google.common.cache.LocalCache$Segment.get(LocalCache.java:2214)
    	at com.google.cloud.dataflow.worker.repackaged.com.google.common.cache.LocalCache.get(LocalCache.java:4053)
    	at com.google.cloud.dataflow.worker.repackaged.com.google.common.cache.LocalCache$LocalManualCache.get(LocalCache.java:4899)
    	at com.google.cloud.dataflow.worker.UserParDoFnFactory.create(UserParDoFnFactory.java:90)
    	at com.google.cloud.dataflow.worker.DefaultParDoFnFactory.create(DefaultParDoFnFactory.java:74)
    	at com.google.cloud.dataflow.worker.IntrinsicMapTaskExecutorFactory.createParDoOperation(IntrinsicMapTaskExecutorFactory.java:262)
    	at com.google.cloud.dataflow.worker.IntrinsicMapTaskExecutorFactory.access$000(IntrinsicMapTaskExecutorFactory.java:84)
    	at com.google.cloud.dataflow.worker.IntrinsicMapTaskExecutorFactory$1.typedApply(IntrinsicMapTaskExecutorFactory.java:181)
    	... 14 more
    Caused by: java.lang.IllegalArgumentException: unable to deserialize Serialized DoFnInfo
    	at org.apache.beam.sdk.util.SerializableUtils.deserializeFromByteArray(SerializableUtils.java:74)
    	at com.google.cloud.dataflow.worker.UserParDoFnFactory$UserDoFnExtractor.getDoFnInfo(UserParDoFnFactory.java:61)
    	at com.google.cloud.dataflow.worker.UserParDoFnFactory.lambda$create$0(UserParDoFnFactory.java:92)
    	at com.google.cloud.dataflow.worker.repackaged.com.google.common.cache.LocalCache$LocalManualCache$1.load(LocalCache.java:4904)
    	at com.google.cloud.dataflow.worker.repackaged.com.google.common.cache.LocalCache$LoadingValueReference.loadFuture(LocalCache.java:3628)
    	at com.google.cloud.dataflow.worker.repackaged.com.google.common.cache.LocalCache$Segment.loadSync(LocalCache.java:2336)
    	at com.google.cloud.dataflow.worker.repackaged.com.google.common.cache.LocalCache$Segment.lockedGetOrLoad(LocalCache.java:2295)
    	at com.google.cloud.dataflow.worker.repackaged.com.google.common.cache.LocalCache$Segment.get(LocalCache.java:2208)
    	... 21 more
    Caused by: java.io.InvalidClassException: org.apache.beam.sdk.values.WindowingStrategy; local class incompatible: stream classdesc serialVersionUID = -6607512772692666907, local class serialVersionUID = -3616600070988263902
    	at java.io.ObjectStreamClass.initNonProxy(ObjectStreamClass.java:616)
    	at java.io.ObjectInputStream.readNonProxyDesc(ObjectInputStream.java:1630)
    	at java.io.ObjectInputStream.readClassDesc(ObjectInputStream.java:1521)
    	at java.io.ObjectInputStream.readOrdinaryObject(ObjectInputStream.java:1781)
    	at java.io.ObjectInputStream.readObject0(ObjectInputStream.java:1353)
    	at java.io.ObjectInputStream.defaultReadFields(ObjectInputStream.java:2018)
    	at java.io.ObjectInputStream.readSerialData(ObjectInputStream.java:1942)
    	at java.io.ObjectInputStream.readOrdinaryObject(ObjectInputStream.java:1808)
    	at java.io.ObjectInputStream.readObject0(ObjectInputStream.java:1353)
    	at java.io.ObjectInputStream.readObject(ObjectInputStream.java:373)
    	at org.apache.beam.sdk.util.SerializableUtils.deserializeFromByteArray(SerializableUtils.java:71)
    	... 28 more
    java.lang.RuntimeException: com.google.cloud.dataflow.worker.repackaged.com.google.common.util.concurrent.UncheckedExecutionException: java.lang.IllegalArgumentException: unable to deserialize Serialized DoFnInfo
    	at com.google.cloud.dataflow.worker.IntrinsicMapTaskExecutorFactory$1.typedApply(IntrinsicMapTaskExecutorFactory.java:192)
    	at com.google.cloud.dataflow.worker.IntrinsicMapTaskExecutorFactory$1.typedApply(IntrinsicMapTaskExecutorFactory.java:163)
    	at com.google.cloud.dataflow.worker.graph.Networks$TypeSafeNodeFunction.apply(Networks.java:63)
    	at com.google.cloud.dataflow.worker.graph.Networks$TypeSafeNodeFunction.apply(Networks.java:50)
    	at com.google.cloud.dataflow.worker.graph.Networks.replaceDirectedNetworkNodes(Networks.java:87)
    	at com.google.cloud.dataflow.worker.IntrinsicMapTaskExecutorFactory.create(IntrinsicMapTaskExecutorFactory.java:123)
    	at com.google.cloud.dataflow.worker.BatchDataflowWorker.doWork(BatchDataflowWorker.java:336)
    	at com.google.cloud.dataflow.worker.BatchDataflowWorker.getAndPerformWork(BatchDataflowWorker.java:290)
    	at com.google.cloud.dataflow.worker.DataflowBatchWorkerHarness$WorkerThread.doWork(DataflowBatchWorkerHarness.java:134)
    	at com.google.cloud.dataflow.worker.DataflowBatchWorkerHarness$WorkerThread.call(DataflowBatchWorkerHarness.java:114)
    	at com.google.cloud.dataflow.worker.DataflowBatchWorkerHarness$WorkerThread.call(DataflowBatchWorkerHarness.java:101)
    	at java.util.concurrent.FutureTask.run(FutureTask.java:266)
    	at java.util.concurrent.ThreadPoolExecutor.runWorker(ThreadPoolExecutor.java:1142)
    	at java.util.concurrent.ThreadPoolExecutor$Worker.run(ThreadPoolExecutor.java:617)
    	at java.lang.Thread.run(Thread.java:745)
    Caused by: com.google.cloud.dataflow.worker.repackaged.com.google.common.util.concurrent.UncheckedExecutionException: java.lang.IllegalArgumentException: unable to deserialize Serialized DoFnInfo
    	at com.google.cloud.dataflow.worker.repackaged.com.google.common.cache.LocalCache$Segment.get(LocalCache.java:2214)
    	at com.google.cloud.dataflow.worker.repackaged.com.google.common.cache.LocalCache.get(LocalCache.java:4053)
    	at com.google.cloud.dataflow.worker.repackaged.com.google.common.cache.LocalCache$LocalManualCache.get(LocalCache.java:4899)
    	at com.google.cloud.dataflow.worker.UserParDoFnFactory.create(UserParDoFnFactory.java:90)
    	at com.google.cloud.dataflow.worker.DefaultParDoFnFactory.create(DefaultParDoFnFactory.java:74)
    	at com.google.cloud.dataflow.worker.IntrinsicMapTaskExecutorFactory.createParDoOperation(IntrinsicMapTaskExecutorFactory.java:262)
    	at com.google.cloud.dataflow.worker.IntrinsicMapTaskExecutorFactory.access$000(IntrinsicMapTaskExecutorFactory.java:84)
    	at com.google.cloud.dataflow.worker.IntrinsicMapTaskExecutorFactory$1.typedApply(IntrinsicMapTaskExecutorFactory.java:181)
    	... 14 more
    Caused by: java.lang.IllegalArgumentException: unable to deserialize Serialized DoFnInfo
    	at org.apache.beam.sdk.util.SerializableUtils.deserializeFromByteArray(SerializableUtils.java:74)
    	at com.google.cloud.dataflow.worker.UserParDoFnFactory$UserDoFnExtractor.getDoFnInfo(UserParDoFnFactory.java:61)
    	at com.google.cloud.dataflow.worker.UserParDoFnFactory.lambda$create$0(UserParDoFnFactory.java:92)
    	at com.google.cloud.dataflow.worker.repackaged.com.google.common.cache.LocalCache$LocalManualCache$1.load(LocalCache.java:4904)
    	at com.google.cloud.dataflow.worker.repackaged.com.google.common.cache.LocalCache$LoadingValueReference.loadFuture(LocalCache.java:3628)
    	at com.google.cloud.dataflow.worker.repackaged.com.google.common.cache.LocalCache$Segment.loadSync(LocalCache.java:2336)
    	at com.google.cloud.dataflow.worker.repackaged.com.google.common.cache.LocalCache$Segment.lockedGetOrLoad(LocalCache.java:2295)
    	at com.google.cloud.dataflow.worker.repackaged.com.google.common.cache.LocalCache$Segment.get(LocalCache.java:2208)
    	... 21 more
    Caused by: java.io.InvalidClassException: org.apache.beam.sdk.values.WindowingStrategy; local class incompatible: stream classdesc serialVersionUID = -6607512772692666907, local class serialVersionUID = -3616600070988263902
    	at java.io.ObjectStreamClass.initNonProxy(ObjectStreamClass.java:616)
    	at java.io.ObjectInputStream.readNonProxyDesc(ObjectInputStream.java:1630)
    	at java.io.ObjectInputStream.readClassDesc(ObjectInputStream.java:1521)
    	at java.io.ObjectInputStream.readOrdinaryObject(ObjectInputStream.java:1781)
    	at java.io.ObjectInputStream.readObject0(ObjectInputStream.java:1353)
    	at java.io.ObjectInputStream.defaultReadFields(ObjectInputStream.java:2018)
    	at java.io.ObjectInputStream.readSerialData(ObjectInputStream.java:1942)
    	at java.io.ObjectInputStream.readOrdinaryObject(ObjectInputStream.java:1808)
    	at java.io.ObjectInputStream.readObject0(ObjectInputStream.java:1353)
    	at java.io.ObjectInputStream.readObject(ObjectInputStream.java:373)
    	at org.apache.beam.sdk.util.SerializableUtils.deserializeFromByteArray(SerializableUtils.java:71)
    	... 28 more
    Workflow failed. Causes: S02:Generate sequence/Read(BoundedCountingSource)+Produce text lines+Produce Avro records+Write Avro records to files/Write/RewindowIntoGlobal/Window.Assign+Write Avro records to files/Write/WriteUnshardedBundlesToTempFiles/WriteUnshardedBundles+Write Avro records to files/Write/GatherTempFileResults/View.AsList/ParDo(ToIsmRecordForGlobalWindow)+Write Avro records to files/Write/WriteUnshardedBundlesToTempFiles/GroupUnwritten/Reify+Write Avro records to files/Write/WriteUnshardedBundlesToTempFiles/GroupUnwritten/Write failed., A work item was attempted 4 times without success. Each time the worker eventually lost contact with the service. The work item was attempted on: 
      avroioit0writethenreadall-10302339-9eyp-harness-xhlv,
      avroioit0writethenreadall-10302339-9eyp-harness-xhlv,
      avroioit0writethenreadall-10302339-9eyp-harness-xhlv,
      avroioit0writethenreadall-10302339-9eyp-harness-xhlv
        at org.apache.beam.runners.dataflow.TestDataflowRunner.run(TestDataflowRunner.java:134)
        at org.apache.beam.runners.dataflow.TestDataflowRunner.run(TestDataflowRunner.java:90)
        at org.apache.beam.runners.dataflow.TestDataflowRunner.run(TestDataflowRunner.java:55)
        at org.apache.beam.sdk.Pipeline.run(Pipeline.java:313)
        at org.apache.beam.sdk.testing.TestPipeline.run(TestPipeline.java:350)
        at org.apache.beam.sdk.testing.TestPipeline.run(TestPipeline.java:331)
        at org.apache.beam.sdk.io.avro.AvroIOIT.writeThenReadAll(AvroIOIT.java:128)
Finished generating test XML results (0.033 secs) into: <https://builds.apache.org/job/beam_PerformanceTests_AvroIOIT/ws/src/sdks/java/io/file-based-io-tests/build/test-results/integrationTest>
Generating HTML test report...
Finished generating test html results (0.045 secs) into: <https://builds.apache.org/job/beam_PerformanceTests_AvroIOIT/ws/src/sdks/java/io/file-based-io-tests/build/reports/tests/integrationTest>
:beam-sdks-java-io-file-based-io-tests:integrationTest (Thread[Task worker for ':' Thread 10,5,main]) completed. Took 7 mins 0.21 secs.

Deprecated Gradle features were used in this build, making it incompatible with Gradle 5.0.
Use '--warning-mode all' to show the individual deprecation warnings.
See https://docs.gradle.org/4.10.2/userguide/command_line_interface.html#sec:command_line_warnings
73 actionable tasks: 16 executed, 57 up-to-date

Publishing build scan...
https://gradle.com/s/3v52i7wq5uile

Build cache (/home/jenkins/.gradle/caches/build-cache-1) removing files not accessed on or after Wed Oct 24 06:38:08 UTC 2018.
Cache entries evicted. In-memory cache of /home/jenkins/.gradle/caches/journal-1/file-access.bin: Size{29993} MaxSize{30400}, CacheStats{hitCount=9, missCount=29608, loadSuccessCount=29609, loadExceptionCount=0, totalLoadTime=2237972653, evictionCount=1} 
Performance may suffer from in-memory cache misses. Increase max heap size of Gradle build process to reduce cache misses.
Build cache (/home/jenkins/.gradle/caches/build-cache-1) cleaned up in 3.238 secs.

STDERR: 
1 test completed, 1 failed

FAILURE: Build failed with an exception.

* What went wrong:
Execution failed for task ':beam-sdks-java-io-file-based-io-tests:integrationTest'.
> There were failing tests. See the report at: file://<https://builds.apache.org/job/beam_PerformanceTests_AvroIOIT/ws/src/sdks/java/io/file-based-io-tests/build/reports/tests/integrationTest/index.html>

* Try:
Run with --debug option to get more log output. Run with --scan to get full insights.

* Exception is:
org.gradle.api.tasks.TaskExecutionException: Execution failed for task ':beam-sdks-java-io-file-based-io-tests:integrationTest'.
	at org.gradle.api.internal.tasks.execution.ExecuteActionsTaskExecuter.executeActions(ExecuteActionsTaskExecuter.java:110)
	at org.gradle.api.internal.tasks.execution.ExecuteActionsTaskExecuter.execute(ExecuteActionsTaskExecuter.java:77)
	at org.gradle.api.internal.tasks.execution.OutputDirectoryCreatingTaskExecuter.execute(OutputDirectoryCreatingTaskExecuter.java:51)
	at org.gradle.api.internal.tasks.execution.SkipCachedTaskExecuter.execute(SkipCachedTaskExecuter.java:105)
	at org.gradle.api.internal.tasks.execution.SkipUpToDateTaskExecuter.execute(SkipUpToDateTaskExecuter.java:59)
	at org.gradle.api.internal.tasks.execution.ResolveTaskOutputCachingStateExecuter.execute(ResolveTaskOutputCachingStateExecuter.java:54)
	at org.gradle.api.internal.tasks.execution.ResolveBuildCacheKeyExecuter.execute(ResolveBuildCacheKeyExecuter.java:79)
	at org.gradle.api.internal.tasks.execution.ValidatingTaskExecuter.execute(ValidatingTaskExecuter.java:59)
	at org.gradle.api.internal.tasks.execution.SkipEmptySourceFilesTaskExecuter.execute(SkipEmptySourceFilesTaskExecuter.java:101)
	at org.gradle.api.internal.tasks.execution.FinalizeInputFilePropertiesTaskExecuter.execute(FinalizeInputFilePropertiesTaskExecuter.java:44)
	at org.gradle.api.internal.tasks.execution.CleanupStaleOutputsExecuter.execute(CleanupStaleOutputsExecuter.java:91)
	at org.gradle.api.internal.tasks.execution.ResolveTaskArtifactStateTaskExecuter.execute(ResolveTaskArtifactStateTaskExecuter.java:62)
	at org.gradle.api.internal.tasks.execution.SkipTaskWithNoActionsExecuter.execute(SkipTaskWithNoActionsExecuter.java:59)
	at org.gradle.api.internal.tasks.execution.SkipOnlyIfTaskExecuter.execute(SkipOnlyIfTaskExecuter.java:54)
	at org.gradle.api.internal.tasks.execution.ExecuteAtMostOnceTaskExecuter.execute(ExecuteAtMostOnceTaskExecuter.java:43)
	at org.gradle.api.internal.tasks.execution.CatchExceptionTaskExecuter.execute(CatchExceptionTaskExecuter.java:34)
	at org.gradle.api.internal.tasks.execution.EventFiringTaskExecuter$1.run(EventFiringTaskExecuter.java:51)
	at org.gradle.internal.operations.DefaultBuildOperationExecutor$RunnableBuildOperationWorker.execute(DefaultBuildOperationExecutor.java:300)
	at org.gradle.internal.operations.DefaultBuildOperationExecutor$RunnableBuildOperationWorker.execute(DefaultBuildOperationExecutor.java:292)
	at org.gradle.internal.operations.DefaultBuildOperationExecutor.execute(DefaultBuildOperationExecutor.java:174)
	at org.gradle.internal.operations.DefaultBuildOperationExecutor.run(DefaultBuildOperationExecutor.java:90)
	at org.gradle.internal.operations.DelegatingBuildOperationExecutor.run(DelegatingBuildOperationExecutor.java:31)
	at org.gradle.api.internal.tasks.execution.EventFiringTaskExecuter.execute(EventFiringTaskExecuter.java:46)
	at org.gradle.execution.taskgraph.LocalTaskInfoExecutor.execute(LocalTaskInfoExecutor.java:42)
	at org.gradle.execution.taskgraph.DefaultTaskExecutionGraph$BuildOperationAwareWorkItemExecutor.execute(DefaultTaskExecutionGraph.java:277)
	at org.gradle.execution.taskgraph.DefaultTaskExecutionGraph$BuildOperationAwareWorkItemExecutor.execute(DefaultTaskExecutionGraph.java:262)
	at org.gradle.execution.taskgraph.DefaultTaskPlanExecutor$ExecutorWorker$1.execute(DefaultTaskPlanExecutor.java:135)
	at org.gradle.execution.taskgraph.DefaultTaskPlanExecutor$ExecutorWorker$1.execute(DefaultTaskPlanExecutor.java:130)
	at org.gradle.execution.taskgraph.DefaultTaskPlanExecutor$ExecutorWorker.execute(DefaultTaskPlanExecutor.java:200)
	at org.gradle.execution.taskgraph.DefaultTaskPlanExecutor$ExecutorWorker.executeWithWork(DefaultTaskPlanExecutor.java:191)
	at org.gradle.execution.taskgraph.DefaultTaskPlanExecutor$ExecutorWorker.run(DefaultTaskPlanExecutor.java:130)
	at org.gradle.internal.concurrent.ExecutorPolicy$CatchAndRecordFailures.onExecute(ExecutorPolicy.java:63)
	at org.gradle.internal.concurrent.ManagedExecutorImpl$1.run(ManagedExecutorImpl.java:46)
	at org.gradle.internal.concurrent.ThreadFactoryImpl$ManagedThreadRunnable.run(ThreadFactoryImpl.java:55)
Caused by: org.gradle.api.GradleException: There were failing tests. See the report at: file://<https://builds.apache.org/job/beam_PerformanceTests_AvroIOIT/ws/src/sdks/java/io/file-based-io-tests/build/reports/tests/integrationTest/index.html>
	at org.gradle.api.tasks.testing.AbstractTestTask.handleTestFailures(AbstractTestTask.java:612)
	at org.gradle.api.tasks.testing.AbstractTestTask.executeTests(AbstractTestTask.java:484)
	at org.gradle.api.tasks.testing.Test.executeTests(Test.java:603)
	at org.gradle.internal.reflect.JavaMethod.invoke(JavaMethod.java:73)
	at org.gradle.api.internal.project.taskfactory.StandardTaskAction.doExecute(StandardTaskAction.java:46)
	at org.gradle.api.internal.project.taskfactory.StandardTaskAction.execute(StandardTaskAction.java:39)
	at org.gradle.api.internal.project.taskfactory.StandardTaskAction.execute(StandardTaskAction.java:26)
	at org.gradle.api.internal.AbstractTask$TaskActionWrapper.execute(AbstractTask.java:801)
	at org.gradle.api.internal.AbstractTask$TaskActionWrapper.execute(AbstractTask.java:768)
	at org.gradle.api.internal.tasks.execution.ExecuteActionsTaskExecuter$1.run(ExecuteActionsTaskExecuter.java:131)
	at org.gradle.internal.operations.DefaultBuildOperationExecutor$RunnableBuildOperationWorker.execute(DefaultBuildOperationExecutor.java:300)
	at org.gradle.internal.operations.DefaultBuildOperationExecutor$RunnableBuildOperationWorker.execute(DefaultBuildOperationExecutor.java:292)
	at org.gradle.internal.operations.DefaultBuildOperationExecutor.execute(DefaultBuildOperationExecutor.java:174)
	at org.gradle.internal.operations.DefaultBuildOperationExecutor.run(DefaultBuildOperationExecutor.java:90)
	at org.gradle.internal.operations.DelegatingBuildOperationExecutor.run(DelegatingBuildOperationExecutor.java:31)
	at org.gradle.api.internal.tasks.execution.ExecuteActionsTaskExecuter.executeAction(ExecuteActionsTaskExecuter.java:120)
	at org.gradle.api.internal.tasks.execution.ExecuteActionsTaskExecuter.executeActions(ExecuteActionsTaskExecuter.java:99)
	... 33 more


* Get more help at https://help.gradle.org

BUILD FAILED in 8m 35s

2018-10-31 06:46:43,028 e9676826 MainThread beam_integration_benchmark(1/1) ERROR    Error during benchmark beam_integration_benchmark
Traceback (most recent call last):
  File "<https://builds.apache.org/job/beam_PerformanceTests_AvroIOIT/ws/PerfKitBenchmarker/perfkitbenchmarker/pkb.py",> line 719, in RunBenchmark
    DoRunPhase(spec, collector, detailed_timer)
  File "<https://builds.apache.org/job/beam_PerformanceTests_AvroIOIT/ws/PerfKitBenchmarker/perfkitbenchmarker/pkb.py",> line 580, in DoRunPhase
    samples = spec.BenchmarkRun(spec)
  File "<https://builds.apache.org/job/beam_PerformanceTests_AvroIOIT/ws/PerfKitBenchmarker/perfkitbenchmarker/linux_benchmarks/beam_integration_benchmark.py",> line 160, in Run
    job_type=job_type)
  File "<https://builds.apache.org/job/beam_PerformanceTests_AvroIOIT/ws/PerfKitBenchmarker/perfkitbenchmarker/providers/gcp/gcp_dpb_dataflow.py",> line 90, in SubmitJob
    assert retcode == 0, "Integration Test Failed."
AssertionError: Integration Test Failed.
2018-10-31 06:46:43,030 e9676826 MainThread beam_integration_benchmark(1/1) INFO     Cleaning up benchmark beam_integration_benchmark
2018-10-31 06:46:43,031 e9676826 MainThread beam_integration_benchmark(1/1) ERROR    Exception running benchmark
Traceback (most recent call last):
  File "<https://builds.apache.org/job/beam_PerformanceTests_AvroIOIT/ws/PerfKitBenchmarker/perfkitbenchmarker/pkb.py",> line 860, in RunBenchmarkTask
    RunBenchmark(spec, collector)
  File "<https://builds.apache.org/job/beam_PerformanceTests_AvroIOIT/ws/PerfKitBenchmarker/perfkitbenchmarker/pkb.py",> line 719, in RunBenchmark
    DoRunPhase(spec, collector, detailed_timer)
  File "<https://builds.apache.org/job/beam_PerformanceTests_AvroIOIT/ws/PerfKitBenchmarker/perfkitbenchmarker/pkb.py",> line 580, in DoRunPhase
    samples = spec.BenchmarkRun(spec)
  File "<https://builds.apache.org/job/beam_PerformanceTests_AvroIOIT/ws/PerfKitBenchmarker/perfkitbenchmarker/linux_benchmarks/beam_integration_benchmark.py",> line 160, in Run
    job_type=job_type)
  File "<https://builds.apache.org/job/beam_PerformanceTests_AvroIOIT/ws/PerfKitBenchmarker/perfkitbenchmarker/providers/gcp/gcp_dpb_dataflow.py",> line 90, in SubmitJob
    assert retcode == 0, "Integration Test Failed."
AssertionError: Integration Test Failed.
2018-10-31 06:46:43,032 e9676826 MainThread beam_integration_benchmark(1/1) ERROR    Benchmark 1/1 beam_integration_benchmark (UID: beam_integration_benchmark0) failed. Execution will continue.
2018-10-31 06:46:43,050 e9676826 MainThread INFO     Benchmark run statuses:
---------------------------------------------------------------------------------
Name                        UID                          Status  Failed Substatus
---------------------------------------------------------------------------------
beam_integration_benchmark  beam_integration_benchmark0  FAILED                  
---------------------------------------------------------------------------------
Success rate: 0.00% (0/1)
2018-10-31 06:46:43,051 e9676826 MainThread INFO     Complete logs can be found at: <https://builds.apache.org/job/beam_PerformanceTests_AvroIOIT/ws/runs/e9676826/pkb.log>
2018-10-31 06:46:43,051 e9676826 MainThread INFO     Completion statuses can be found at: <https://builds.apache.org/job/beam_PerformanceTests_AvroIOIT/ws/runs/e9676826/completion_statuses.json>
Build step 'Execute shell' marked build as failure

---------------------------------------------------------------------
To unsubscribe, e-mail: builds-unsubscribe@beam.apache.org
For additional commands, e-mail: builds-help@beam.apache.org


Jenkins build is back to normal : beam_PerformanceTests_AvroIOIT #1178

Posted by Apache Jenkins Server <je...@builds.apache.org>.
See <https://builds.apache.org/job/beam_PerformanceTests_AvroIOIT/1178/display/redirect?page=changes>


---------------------------------------------------------------------
To unsubscribe, e-mail: builds-unsubscribe@beam.apache.org
For additional commands, e-mail: builds-help@beam.apache.org


Build failed in Jenkins: beam_PerformanceTests_AvroIOIT #1177

Posted by Apache Jenkins Server <je...@builds.apache.org>.
See <https://builds.apache.org/job/beam_PerformanceTests_AvroIOIT/1177/display/redirect>

------------------------------------------
[...truncated 347.07 KB...]
    	at com.google.cloud.dataflow.worker.repackaged.com.google.common.cache.LocalCache$Segment.lockedGetOrLoad(LocalCache.java:2295)
    	at com.google.cloud.dataflow.worker.repackaged.com.google.common.cache.LocalCache$Segment.get(LocalCache.java:2208)
    	... 21 more
    Caused by: java.io.InvalidClassException: org.apache.beam.sdk.values.WindowingStrategy; local class incompatible: stream classdesc serialVersionUID = -6607512772692666907, local class serialVersionUID = -3616600070988263902
    	at java.io.ObjectStreamClass.initNonProxy(ObjectStreamClass.java:616)
    	at java.io.ObjectInputStream.readNonProxyDesc(ObjectInputStream.java:1630)
    	at java.io.ObjectInputStream.readClassDesc(ObjectInputStream.java:1521)
    	at java.io.ObjectInputStream.readOrdinaryObject(ObjectInputStream.java:1781)
    	at java.io.ObjectInputStream.readObject0(ObjectInputStream.java:1353)
    	at java.io.ObjectInputStream.defaultReadFields(ObjectInputStream.java:2018)
    	at java.io.ObjectInputStream.readSerialData(ObjectInputStream.java:1942)
    	at java.io.ObjectInputStream.readOrdinaryObject(ObjectInputStream.java:1808)
    	at java.io.ObjectInputStream.readObject0(ObjectInputStream.java:1353)
    	at java.io.ObjectInputStream.readObject(ObjectInputStream.java:373)
    	at org.apache.beam.sdk.util.SerializableUtils.deserializeFromByteArray(SerializableUtils.java:71)
    	... 28 more
    java.lang.RuntimeException: com.google.cloud.dataflow.worker.repackaged.com.google.common.util.concurrent.UncheckedExecutionException: java.lang.IllegalArgumentException: unable to deserialize Serialized DoFnInfo
    	at com.google.cloud.dataflow.worker.IntrinsicMapTaskExecutorFactory$1.typedApply(IntrinsicMapTaskExecutorFactory.java:192)
    	at com.google.cloud.dataflow.worker.IntrinsicMapTaskExecutorFactory$1.typedApply(IntrinsicMapTaskExecutorFactory.java:163)
    	at com.google.cloud.dataflow.worker.graph.Networks$TypeSafeNodeFunction.apply(Networks.java:63)
    	at com.google.cloud.dataflow.worker.graph.Networks$TypeSafeNodeFunction.apply(Networks.java:50)
    	at com.google.cloud.dataflow.worker.graph.Networks.replaceDirectedNetworkNodes(Networks.java:87)
    	at com.google.cloud.dataflow.worker.IntrinsicMapTaskExecutorFactory.create(IntrinsicMapTaskExecutorFactory.java:123)
    	at com.google.cloud.dataflow.worker.BatchDataflowWorker.doWork(BatchDataflowWorker.java:336)
    	at com.google.cloud.dataflow.worker.BatchDataflowWorker.getAndPerformWork(BatchDataflowWorker.java:290)
    	at com.google.cloud.dataflow.worker.DataflowBatchWorkerHarness$WorkerThread.doWork(DataflowBatchWorkerHarness.java:134)
    	at com.google.cloud.dataflow.worker.DataflowBatchWorkerHarness$WorkerThread.call(DataflowBatchWorkerHarness.java:114)
    	at com.google.cloud.dataflow.worker.DataflowBatchWorkerHarness$WorkerThread.call(DataflowBatchWorkerHarness.java:101)
    	at java.util.concurrent.FutureTask.run(FutureTask.java:266)
    	at java.util.concurrent.ThreadPoolExecutor.runWorker(ThreadPoolExecutor.java:1142)
    	at java.util.concurrent.ThreadPoolExecutor$Worker.run(ThreadPoolExecutor.java:617)
    	at java.lang.Thread.run(Thread.java:745)
    Caused by: com.google.cloud.dataflow.worker.repackaged.com.google.common.util.concurrent.UncheckedExecutionException: java.lang.IllegalArgumentException: unable to deserialize Serialized DoFnInfo
    	at com.google.cloud.dataflow.worker.repackaged.com.google.common.cache.LocalCache$Segment.get(LocalCache.java:2214)
    	at com.google.cloud.dataflow.worker.repackaged.com.google.common.cache.LocalCache.get(LocalCache.java:4053)
    	at com.google.cloud.dataflow.worker.repackaged.com.google.common.cache.LocalCache$LocalManualCache.get(LocalCache.java:4899)
    	at com.google.cloud.dataflow.worker.UserParDoFnFactory.create(UserParDoFnFactory.java:90)
    	at com.google.cloud.dataflow.worker.DefaultParDoFnFactory.create(DefaultParDoFnFactory.java:74)
    	at com.google.cloud.dataflow.worker.IntrinsicMapTaskExecutorFactory.createParDoOperation(IntrinsicMapTaskExecutorFactory.java:262)
    	at com.google.cloud.dataflow.worker.IntrinsicMapTaskExecutorFactory.access$000(IntrinsicMapTaskExecutorFactory.java:84)
    	at com.google.cloud.dataflow.worker.IntrinsicMapTaskExecutorFactory$1.typedApply(IntrinsicMapTaskExecutorFactory.java:181)
    	... 14 more
    Caused by: java.lang.IllegalArgumentException: unable to deserialize Serialized DoFnInfo
    	at org.apache.beam.sdk.util.SerializableUtils.deserializeFromByteArray(SerializableUtils.java:74)
    	at com.google.cloud.dataflow.worker.UserParDoFnFactory$UserDoFnExtractor.getDoFnInfo(UserParDoFnFactory.java:61)
    	at com.google.cloud.dataflow.worker.UserParDoFnFactory.lambda$create$0(UserParDoFnFactory.java:92)
    	at com.google.cloud.dataflow.worker.repackaged.com.google.common.cache.LocalCache$LocalManualCache$1.load(LocalCache.java:4904)
    	at com.google.cloud.dataflow.worker.repackaged.com.google.common.cache.LocalCache$LoadingValueReference.loadFuture(LocalCache.java:3628)
    	at com.google.cloud.dataflow.worker.repackaged.com.google.common.cache.LocalCache$Segment.loadSync(LocalCache.java:2336)
    	at com.google.cloud.dataflow.worker.repackaged.com.google.common.cache.LocalCache$Segment.lockedGetOrLoad(LocalCache.java:2295)
    	at com.google.cloud.dataflow.worker.repackaged.com.google.common.cache.LocalCache$Segment.get(LocalCache.java:2208)
    	... 21 more
    Caused by: java.io.InvalidClassException: org.apache.beam.sdk.values.WindowingStrategy; local class incompatible: stream classdesc serialVersionUID = -6607512772692666907, local class serialVersionUID = -3616600070988263902
    	at java.io.ObjectStreamClass.initNonProxy(ObjectStreamClass.java:616)
    	at java.io.ObjectInputStream.readNonProxyDesc(ObjectInputStream.java:1630)
    	at java.io.ObjectInputStream.readClassDesc(ObjectInputStream.java:1521)
    	at java.io.ObjectInputStream.readOrdinaryObject(ObjectInputStream.java:1781)
    	at java.io.ObjectInputStream.readObject0(ObjectInputStream.java:1353)
    	at java.io.ObjectInputStream.defaultReadFields(ObjectInputStream.java:2018)
    	at java.io.ObjectInputStream.readSerialData(ObjectInputStream.java:1942)
    	at java.io.ObjectInputStream.readOrdinaryObject(ObjectInputStream.java:1808)
    	at java.io.ObjectInputStream.readObject0(ObjectInputStream.java:1353)
    	at java.io.ObjectInputStream.readObject(ObjectInputStream.java:373)
    	at org.apache.beam.sdk.util.SerializableUtils.deserializeFromByteArray(SerializableUtils.java:71)
    	... 28 more
    java.lang.RuntimeException: com.google.cloud.dataflow.worker.repackaged.com.google.common.util.concurrent.UncheckedExecutionException: java.lang.IllegalArgumentException: unable to deserialize Serialized DoFnInfo
    	at com.google.cloud.dataflow.worker.IntrinsicMapTaskExecutorFactory$1.typedApply(IntrinsicMapTaskExecutorFactory.java:192)
    	at com.google.cloud.dataflow.worker.IntrinsicMapTaskExecutorFactory$1.typedApply(IntrinsicMapTaskExecutorFactory.java:163)
    	at com.google.cloud.dataflow.worker.graph.Networks$TypeSafeNodeFunction.apply(Networks.java:63)
    	at com.google.cloud.dataflow.worker.graph.Networks$TypeSafeNodeFunction.apply(Networks.java:50)
    	at com.google.cloud.dataflow.worker.graph.Networks.replaceDirectedNetworkNodes(Networks.java:87)
    	at com.google.cloud.dataflow.worker.IntrinsicMapTaskExecutorFactory.create(IntrinsicMapTaskExecutorFactory.java:123)
    	at com.google.cloud.dataflow.worker.BatchDataflowWorker.doWork(BatchDataflowWorker.java:336)
    	at com.google.cloud.dataflow.worker.BatchDataflowWorker.getAndPerformWork(BatchDataflowWorker.java:290)
    	at com.google.cloud.dataflow.worker.DataflowBatchWorkerHarness$WorkerThread.doWork(DataflowBatchWorkerHarness.java:134)
    	at com.google.cloud.dataflow.worker.DataflowBatchWorkerHarness$WorkerThread.call(DataflowBatchWorkerHarness.java:114)
    	at com.google.cloud.dataflow.worker.DataflowBatchWorkerHarness$WorkerThread.call(DataflowBatchWorkerHarness.java:101)
    	at java.util.concurrent.FutureTask.run(FutureTask.java:266)
    	at java.util.concurrent.ThreadPoolExecutor.runWorker(ThreadPoolExecutor.java:1142)
    	at java.util.concurrent.ThreadPoolExecutor$Worker.run(ThreadPoolExecutor.java:617)
    	at java.lang.Thread.run(Thread.java:745)
    Caused by: com.google.cloud.dataflow.worker.repackaged.com.google.common.util.concurrent.UncheckedExecutionException: java.lang.IllegalArgumentException: unable to deserialize Serialized DoFnInfo
    	at com.google.cloud.dataflow.worker.repackaged.com.google.common.cache.LocalCache$Segment.get(LocalCache.java:2214)
    	at com.google.cloud.dataflow.worker.repackaged.com.google.common.cache.LocalCache.get(LocalCache.java:4053)
    	at com.google.cloud.dataflow.worker.repackaged.com.google.common.cache.LocalCache$LocalManualCache.get(LocalCache.java:4899)
    	at com.google.cloud.dataflow.worker.UserParDoFnFactory.create(UserParDoFnFactory.java:90)
    	at com.google.cloud.dataflow.worker.DefaultParDoFnFactory.create(DefaultParDoFnFactory.java:74)
    	at com.google.cloud.dataflow.worker.IntrinsicMapTaskExecutorFactory.createParDoOperation(IntrinsicMapTaskExecutorFactory.java:262)
    	at com.google.cloud.dataflow.worker.IntrinsicMapTaskExecutorFactory.access$000(IntrinsicMapTaskExecutorFactory.java:84)
    	at com.google.cloud.dataflow.worker.IntrinsicMapTaskExecutorFactory$1.typedApply(IntrinsicMapTaskExecutorFactory.java:181)
    	... 14 more
    Caused by: java.lang.IllegalArgumentException: unable to deserialize Serialized DoFnInfo
    	at org.apache.beam.sdk.util.SerializableUtils.deserializeFromByteArray(SerializableUtils.java:74)
    	at com.google.cloud.dataflow.worker.UserParDoFnFactory$UserDoFnExtractor.getDoFnInfo(UserParDoFnFactory.java:61)
    	at com.google.cloud.dataflow.worker.UserParDoFnFactory.lambda$create$0(UserParDoFnFactory.java:92)
    	at com.google.cloud.dataflow.worker.repackaged.com.google.common.cache.LocalCache$LocalManualCache$1.load(LocalCache.java:4904)
    	at com.google.cloud.dataflow.worker.repackaged.com.google.common.cache.LocalCache$LoadingValueReference.loadFuture(LocalCache.java:3628)
    	at com.google.cloud.dataflow.worker.repackaged.com.google.common.cache.LocalCache$Segment.loadSync(LocalCache.java:2336)
    	at com.google.cloud.dataflow.worker.repackaged.com.google.common.cache.LocalCache$Segment.lockedGetOrLoad(LocalCache.java:2295)
    	at com.google.cloud.dataflow.worker.repackaged.com.google.common.cache.LocalCache$Segment.get(LocalCache.java:2208)
    	... 21 more
    Caused by: java.io.InvalidClassException: org.apache.beam.sdk.values.WindowingStrategy; local class incompatible: stream classdesc serialVersionUID = -6607512772692666907, local class serialVersionUID = -3616600070988263902
    	at java.io.ObjectStreamClass.initNonProxy(ObjectStreamClass.java:616)
    	at java.io.ObjectInputStream.readNonProxyDesc(ObjectInputStream.java:1630)
    	at java.io.ObjectInputStream.readClassDesc(ObjectInputStream.java:1521)
    	at java.io.ObjectInputStream.readOrdinaryObject(ObjectInputStream.java:1781)
    	at java.io.ObjectInputStream.readObject0(ObjectInputStream.java:1353)
    	at java.io.ObjectInputStream.defaultReadFields(ObjectInputStream.java:2018)
    	at java.io.ObjectInputStream.readSerialData(ObjectInputStream.java:1942)
    	at java.io.ObjectInputStream.readOrdinaryObject(ObjectInputStream.java:1808)
    	at java.io.ObjectInputStream.readObject0(ObjectInputStream.java:1353)
    	at java.io.ObjectInputStream.readObject(ObjectInputStream.java:373)
    	at org.apache.beam.sdk.util.SerializableUtils.deserializeFromByteArray(SerializableUtils.java:71)
    	... 28 more
    Workflow failed. Causes: S02:Generate sequence/Read(BoundedCountingSource)+Produce text lines+Produce Avro records+Write Avro records to files/Write/RewindowIntoGlobal/Window.Assign+Write Avro records to files/Write/WriteUnshardedBundlesToTempFiles/WriteUnshardedBundles+Write Avro records to files/Write/GatherTempFileResults/View.AsList/ParDo(ToIsmRecordForGlobalWindow)+Write Avro records to files/Write/WriteUnshardedBundlesToTempFiles/GroupUnwritten/Reify+Write Avro records to files/Write/WriteUnshardedBundlesToTempFiles/GroupUnwritten/Write failed., A work item was attempted 4 times without success. Each time the worker eventually lost contact with the service. The work item was attempted on: 
      avroioit0writethenreadall-10310540-nwza-harness-kz4r,
      avroioit0writethenreadall-10310540-nwza-harness-kz4r,
      avroioit0writethenreadall-10310540-nwza-harness-kz4r,
      avroioit0writethenreadall-10310540-nwza-harness-kz4r
        at org.apache.beam.runners.dataflow.TestDataflowRunner.run(TestDataflowRunner.java:134)
        at org.apache.beam.runners.dataflow.TestDataflowRunner.run(TestDataflowRunner.java:90)
        at org.apache.beam.runners.dataflow.TestDataflowRunner.run(TestDataflowRunner.java:55)
        at org.apache.beam.sdk.Pipeline.run(Pipeline.java:313)
        at org.apache.beam.sdk.testing.TestPipeline.run(TestPipeline.java:350)
        at org.apache.beam.sdk.testing.TestPipeline.run(TestPipeline.java:331)
        at org.apache.beam.sdk.io.avro.AvroIOIT.writeThenReadAll(AvroIOIT.java:128)
Finished generating test XML results (0.034 secs) into: <https://builds.apache.org/job/beam_PerformanceTests_AvroIOIT/ws/src/sdks/java/io/file-based-io-tests/build/test-results/integrationTest>
Generating HTML test report...
Finished generating test html results (0.041 secs) into: <https://builds.apache.org/job/beam_PerformanceTests_AvroIOIT/ws/src/sdks/java/io/file-based-io-tests/build/reports/tests/integrationTest>
:beam-sdks-java-io-file-based-io-tests:integrationTest (Thread[Task worker for ':' Thread 11,5,main]) completed. Took 6 mins 28.681 secs.

Deprecated Gradle features were used in this build, making it incompatible with Gradle 5.0.
Use '--warning-mode all' to show the individual deprecation warnings.
See https://docs.gradle.org/4.10.2/userguide/command_line_interface.html#sec:command_line_warnings
73 actionable tasks: 16 executed, 57 up-to-date

Publishing build scan...
https://gradle.com/s/22m4apoqepcj6


STDERR: 
1 test completed, 1 failed

FAILURE: Build failed with an exception.

* What went wrong:
Execution failed for task ':beam-sdks-java-io-file-based-io-tests:integrationTest'.
> There were failing tests. See the report at: file://<https://builds.apache.org/job/beam_PerformanceTests_AvroIOIT/ws/src/sdks/java/io/file-based-io-tests/build/reports/tests/integrationTest/index.html>

* Try:
Run with --debug option to get more log output. Run with --scan to get full insights.

* Exception is:
org.gradle.api.tasks.TaskExecutionException: Execution failed for task ':beam-sdks-java-io-file-based-io-tests:integrationTest'.
	at org.gradle.api.internal.tasks.execution.ExecuteActionsTaskExecuter.executeActions(ExecuteActionsTaskExecuter.java:110)
	at org.gradle.api.internal.tasks.execution.ExecuteActionsTaskExecuter.execute(ExecuteActionsTaskExecuter.java:77)
	at org.gradle.api.internal.tasks.execution.OutputDirectoryCreatingTaskExecuter.execute(OutputDirectoryCreatingTaskExecuter.java:51)
	at org.gradle.api.internal.tasks.execution.SkipCachedTaskExecuter.execute(SkipCachedTaskExecuter.java:105)
	at org.gradle.api.internal.tasks.execution.SkipUpToDateTaskExecuter.execute(SkipUpToDateTaskExecuter.java:59)
	at org.gradle.api.internal.tasks.execution.ResolveTaskOutputCachingStateExecuter.execute(ResolveTaskOutputCachingStateExecuter.java:54)
	at org.gradle.api.internal.tasks.execution.ResolveBuildCacheKeyExecuter.execute(ResolveBuildCacheKeyExecuter.java:79)
	at org.gradle.api.internal.tasks.execution.ValidatingTaskExecuter.execute(ValidatingTaskExecuter.java:59)
	at org.gradle.api.internal.tasks.execution.SkipEmptySourceFilesTaskExecuter.execute(SkipEmptySourceFilesTaskExecuter.java:101)
	at org.gradle.api.internal.tasks.execution.FinalizeInputFilePropertiesTaskExecuter.execute(FinalizeInputFilePropertiesTaskExecuter.java:44)
	at org.gradle.api.internal.tasks.execution.CleanupStaleOutputsExecuter.execute(CleanupStaleOutputsExecuter.java:91)
	at org.gradle.api.internal.tasks.execution.ResolveTaskArtifactStateTaskExecuter.execute(ResolveTaskArtifactStateTaskExecuter.java:62)
	at org.gradle.api.internal.tasks.execution.SkipTaskWithNoActionsExecuter.execute(SkipTaskWithNoActionsExecuter.java:59)
	at org.gradle.api.internal.tasks.execution.SkipOnlyIfTaskExecuter.execute(SkipOnlyIfTaskExecuter.java:54)
	at org.gradle.api.internal.tasks.execution.ExecuteAtMostOnceTaskExecuter.execute(ExecuteAtMostOnceTaskExecuter.java:43)
	at org.gradle.api.internal.tasks.execution.CatchExceptionTaskExecuter.execute(CatchExceptionTaskExecuter.java:34)
	at org.gradle.api.internal.tasks.execution.EventFiringTaskExecuter$1.run(EventFiringTaskExecuter.java:51)
	at org.gradle.internal.operations.DefaultBuildOperationExecutor$RunnableBuildOperationWorker.execute(DefaultBuildOperationExecutor.java:300)
	at org.gradle.internal.operations.DefaultBuildOperationExecutor$RunnableBuildOperationWorker.execute(DefaultBuildOperationExecutor.java:292)
	at org.gradle.internal.operations.DefaultBuildOperationExecutor.execute(DefaultBuildOperationExecutor.java:174)
	at org.gradle.internal.operations.DefaultBuildOperationExecutor.run(DefaultBuildOperationExecutor.java:90)
	at org.gradle.internal.operations.DelegatingBuildOperationExecutor.run(DelegatingBuildOperationExecutor.java:31)
	at org.gradle.api.internal.tasks.execution.EventFiringTaskExecuter.execute(EventFiringTaskExecuter.java:46)
	at org.gradle.execution.taskgraph.LocalTaskInfoExecutor.execute(LocalTaskInfoExecutor.java:42)
	at org.gradle.execution.taskgraph.DefaultTaskExecutionGraph$BuildOperationAwareWorkItemExecutor.execute(DefaultTaskExecutionGraph.java:277)
	at org.gradle.execution.taskgraph.DefaultTaskExecutionGraph$BuildOperationAwareWorkItemExecutor.execute(DefaultTaskExecutionGraph.java:262)
	at org.gradle.execution.taskgraph.DefaultTaskPlanExecutor$ExecutorWorker$1.execute(DefaultTaskPlanExecutor.java:135)
	at org.gradle.execution.taskgraph.DefaultTaskPlanExecutor$ExecutorWorker$1.execute(DefaultTaskPlanExecutor.java:130)
	at org.gradle.execution.taskgraph.DefaultTaskPlanExecutor$ExecutorWorker.execute(DefaultTaskPlanExecutor.java:200)
	at org.gradle.execution.taskgraph.DefaultTaskPlanExecutor$ExecutorWorker.executeWithWork(DefaultTaskPlanExecutor.java:191)
	at org.gradle.execution.taskgraph.DefaultTaskPlanExecutor$ExecutorWorker.run(DefaultTaskPlanExecutor.java:130)
	at org.gradle.internal.concurrent.ExecutorPolicy$CatchAndRecordFailures.onExecute(ExecutorPolicy.java:63)
	at org.gradle.internal.concurrent.ManagedExecutorImpl$1.run(ManagedExecutorImpl.java:46)
	at org.gradle.internal.concurrent.ThreadFactoryImpl$ManagedThreadRunnable.run(ThreadFactoryImpl.java:55)
Caused by: org.gradle.api.GradleException: There were failing tests. See the report at: file://<https://builds.apache.org/job/beam_PerformanceTests_AvroIOIT/ws/src/sdks/java/io/file-based-io-tests/build/reports/tests/integrationTest/index.html>
	at org.gradle.api.tasks.testing.AbstractTestTask.handleTestFailures(AbstractTestTask.java:612)
	at org.gradle.api.tasks.testing.AbstractTestTask.executeTests(AbstractTestTask.java:484)
	at org.gradle.api.tasks.testing.Test.executeTests(Test.java:603)
	at org.gradle.internal.reflect.JavaMethod.invoke(JavaMethod.java:73)
	at org.gradle.api.internal.project.taskfactory.StandardTaskAction.doExecute(StandardTaskAction.java:46)
	at org.gradle.api.internal.project.taskfactory.StandardTaskAction.execute(StandardTaskAction.java:39)
	at org.gradle.api.internal.project.taskfactory.StandardTaskAction.execute(StandardTaskAction.java:26)
	at org.gradle.api.internal.AbstractTask$TaskActionWrapper.execute(AbstractTask.java:801)
	at org.gradle.api.internal.AbstractTask$TaskActionWrapper.execute(AbstractTask.java:768)
	at org.gradle.api.internal.tasks.execution.ExecuteActionsTaskExecuter$1.run(ExecuteActionsTaskExecuter.java:131)
	at org.gradle.internal.operations.DefaultBuildOperationExecutor$RunnableBuildOperationWorker.execute(DefaultBuildOperationExecutor.java:300)
	at org.gradle.internal.operations.DefaultBuildOperationExecutor$RunnableBuildOperationWorker.execute(DefaultBuildOperationExecutor.java:292)
	at org.gradle.internal.operations.DefaultBuildOperationExecutor.execute(DefaultBuildOperationExecutor.java:174)
	at org.gradle.internal.operations.DefaultBuildOperationExecutor.run(DefaultBuildOperationExecutor.java:90)
	at org.gradle.internal.operations.DelegatingBuildOperationExecutor.run(DelegatingBuildOperationExecutor.java:31)
	at org.gradle.api.internal.tasks.execution.ExecuteActionsTaskExecuter.executeAction(ExecuteActionsTaskExecuter.java:120)
	at org.gradle.api.internal.tasks.execution.ExecuteActionsTaskExecuter.executeActions(ExecuteActionsTaskExecuter.java:99)
	... 33 more


* Get more help at https://help.gradle.org

BUILD FAILED in 8m 6s

2018-10-31 12:46:12,195 2e23d3dc MainThread beam_integration_benchmark(1/1) ERROR    Error during benchmark beam_integration_benchmark
Traceback (most recent call last):
  File "<https://builds.apache.org/job/beam_PerformanceTests_AvroIOIT/ws/PerfKitBenchmarker/perfkitbenchmarker/pkb.py",> line 719, in RunBenchmark
    DoRunPhase(spec, collector, detailed_timer)
  File "<https://builds.apache.org/job/beam_PerformanceTests_AvroIOIT/ws/PerfKitBenchmarker/perfkitbenchmarker/pkb.py",> line 580, in DoRunPhase
    samples = spec.BenchmarkRun(spec)
  File "<https://builds.apache.org/job/beam_PerformanceTests_AvroIOIT/ws/PerfKitBenchmarker/perfkitbenchmarker/linux_benchmarks/beam_integration_benchmark.py",> line 160, in Run
    job_type=job_type)
  File "<https://builds.apache.org/job/beam_PerformanceTests_AvroIOIT/ws/PerfKitBenchmarker/perfkitbenchmarker/providers/gcp/gcp_dpb_dataflow.py",> line 90, in SubmitJob
    assert retcode == 0, "Integration Test Failed."
AssertionError: Integration Test Failed.
2018-10-31 12:46:12,197 2e23d3dc MainThread beam_integration_benchmark(1/1) INFO     Cleaning up benchmark beam_integration_benchmark
2018-10-31 12:46:12,199 2e23d3dc MainThread beam_integration_benchmark(1/1) ERROR    Exception running benchmark
Traceback (most recent call last):
  File "<https://builds.apache.org/job/beam_PerformanceTests_AvroIOIT/ws/PerfKitBenchmarker/perfkitbenchmarker/pkb.py",> line 860, in RunBenchmarkTask
    RunBenchmark(spec, collector)
  File "<https://builds.apache.org/job/beam_PerformanceTests_AvroIOIT/ws/PerfKitBenchmarker/perfkitbenchmarker/pkb.py",> line 719, in RunBenchmark
    DoRunPhase(spec, collector, detailed_timer)
  File "<https://builds.apache.org/job/beam_PerformanceTests_AvroIOIT/ws/PerfKitBenchmarker/perfkitbenchmarker/pkb.py",> line 580, in DoRunPhase
    samples = spec.BenchmarkRun(spec)
  File "<https://builds.apache.org/job/beam_PerformanceTests_AvroIOIT/ws/PerfKitBenchmarker/perfkitbenchmarker/linux_benchmarks/beam_integration_benchmark.py",> line 160, in Run
    job_type=job_type)
  File "<https://builds.apache.org/job/beam_PerformanceTests_AvroIOIT/ws/PerfKitBenchmarker/perfkitbenchmarker/providers/gcp/gcp_dpb_dataflow.py",> line 90, in SubmitJob
    assert retcode == 0, "Integration Test Failed."
AssertionError: Integration Test Failed.
2018-10-31 12:46:12,200 2e23d3dc MainThread beam_integration_benchmark(1/1) ERROR    Benchmark 1/1 beam_integration_benchmark (UID: beam_integration_benchmark0) failed. Execution will continue.
2018-10-31 12:46:12,212 2e23d3dc MainThread INFO     Benchmark run statuses:
---------------------------------------------------------------------------------
Name                        UID                          Status  Failed Substatus
---------------------------------------------------------------------------------
beam_integration_benchmark  beam_integration_benchmark0  FAILED                  
---------------------------------------------------------------------------------
Success rate: 0.00% (0/1)
2018-10-31 12:46:12,213 2e23d3dc MainThread INFO     Complete logs can be found at: <https://builds.apache.org/job/beam_PerformanceTests_AvroIOIT/ws/runs/2e23d3dc/pkb.log>
2018-10-31 12:46:12,213 2e23d3dc MainThread INFO     Completion statuses can be found at: <https://builds.apache.org/job/beam_PerformanceTests_AvroIOIT/ws/runs/2e23d3dc/completion_statuses.json>
Build step 'Execute shell' marked build as failure

---------------------------------------------------------------------
To unsubscribe, e-mail: builds-unsubscribe@beam.apache.org
For additional commands, e-mail: builds-help@beam.apache.org