You are viewing a plain text version of this content. The canonical link for it is here.
Posted to dev@kafka.apache.org by Apache Jenkins Server <je...@builds.apache.org> on 2019/09/29 06:57:01 UTC

Build failed in Jenkins: kafka-trunk-jdk11 #841

See <https://builds.apache.org/job/kafka-trunk-jdk11/841/display/redirect?page=changes>

Changes:

[ismael] MINOR: Don't generate unnecessary strings for debug logging in

------------------------------------------
[...truncated 5.35 MB...]

org.apache.kafka.streams.TopologyTestDriverTest > shouldReturnAllStores[Eos enabled = false] PASSED

org.apache.kafka.streams.TopologyTestDriverTest > shouldSendRecordViaCorrectSourceTopic[Eos enabled = false] STARTED

org.apache.kafka.streams.TopologyTestDriverTest > shouldSendRecordViaCorrectSourceTopic[Eos enabled = false] PASSED

org.apache.kafka.streams.TopologyTestDriverTest > shouldNotCreateStateDirectoryForStatelessTopology[Eos enabled = false] STARTED

org.apache.kafka.streams.TopologyTestDriverTest > shouldNotCreateStateDirectoryForStatelessTopology[Eos enabled = false] PASSED

org.apache.kafka.streams.TopologyTestDriverTest > shouldReturnAllStoresNames[Eos enabled = false] STARTED

org.apache.kafka.streams.TopologyTestDriverTest > shouldReturnAllStoresNames[Eos enabled = false] PASSED

org.apache.kafka.streams.TopologyTestDriverTest > shouldProcessConsumerRecordList[Eos enabled = false] STARTED

org.apache.kafka.streams.TopologyTestDriverTest > shouldProcessConsumerRecordList[Eos enabled = false] PASSED

org.apache.kafka.streams.TopologyTestDriverTest > shouldUseSinkSpecificSerializers[Eos enabled = false] STARTED

org.apache.kafka.streams.TopologyTestDriverTest > shouldUseSinkSpecificSerializers[Eos enabled = false] PASSED

org.apache.kafka.streams.TopologyTestDriverTest > shouldFlushStoreForFirstInput[Eos enabled = false] STARTED

org.apache.kafka.streams.TopologyTestDriverTest > shouldFlushStoreForFirstInput[Eos enabled = false] PASSED

org.apache.kafka.streams.TopologyTestDriverTest > shouldProcessFromSourceThatMatchPattern[Eos enabled = false] STARTED

org.apache.kafka.streams.TopologyTestDriverTest > shouldProcessFromSourceThatMatchPattern[Eos enabled = false] PASSED

org.apache.kafka.streams.TopologyTestDriverTest > shouldUpdateStoreForNewKey[Eos enabled = false] STARTED

org.apache.kafka.streams.TopologyTestDriverTest > shouldUpdateStoreForNewKey[Eos enabled = false] PASSED

org.apache.kafka.streams.TopologyTestDriverTest > shouldPunctuateOnWallClockTime[Eos enabled = false] STARTED

org.apache.kafka.streams.TopologyTestDriverTest > shouldPunctuateOnWallClockTime[Eos enabled = false] PASSED

org.apache.kafka.streams.TopologyTestDriverTest > shouldSetRecordMetadata[Eos enabled = false] STARTED

org.apache.kafka.streams.TopologyTestDriverTest > shouldSetRecordMetadata[Eos enabled = false] PASSED

org.apache.kafka.streams.TopologyTestDriverTest > shouldNotUpdateStoreForLargerValue[Eos enabled = false] STARTED

org.apache.kafka.streams.TopologyTestDriverTest > shouldNotUpdateStoreForLargerValue[Eos enabled = false] PASSED

org.apache.kafka.streams.TopologyTestDriverTest > shouldReturnCorrectInMemoryStoreTypeOnly[Eos enabled = false] STARTED

org.apache.kafka.streams.TopologyTestDriverTest > shouldReturnCorrectInMemoryStoreTypeOnly[Eos enabled = false] PASSED

org.apache.kafka.streams.TopologyTestDriverTest > shouldProcessRecordForTopic[Eos enabled = false] STARTED

org.apache.kafka.streams.TopologyTestDriverTest > shouldProcessRecordForTopic[Eos enabled = false] PASSED

org.apache.kafka.streams.TopologyTestDriverTest > shouldForwardRecordsFromSubtopologyToSubtopology[Eos enabled = false] STARTED

org.apache.kafka.streams.TopologyTestDriverTest > shouldForwardRecordsFromSubtopologyToSubtopology[Eos enabled = false] PASSED

org.apache.kafka.streams.TopologyTestDriverTest > shouldNotUpdateStoreForSmallerValue[Eos enabled = false] STARTED

org.apache.kafka.streams.TopologyTestDriverTest > shouldNotUpdateStoreForSmallerValue[Eos enabled = false] PASSED

org.apache.kafka.streams.TopologyTestDriverTest > shouldCreateStateDirectoryForStatefulTopology[Eos enabled = false] STARTED

org.apache.kafka.streams.TopologyTestDriverTest > shouldCreateStateDirectoryForStatefulTopology[Eos enabled = false] PASSED

org.apache.kafka.streams.TopologyTestDriverTest > shouldPunctuateIfWallClockTimeAdvances[Eos enabled = false] STARTED

org.apache.kafka.streams.TopologyTestDriverTest > shouldPunctuateIfWallClockTimeAdvances[Eos enabled = false] PASSED

org.apache.kafka.streams.MockProcessorContextTest > shouldStoreAndReturnStateStores STARTED

org.apache.kafka.streams.MockProcessorContextTest > shouldStoreAndReturnStateStores PASSED

org.apache.kafka.streams.MockProcessorContextTest > shouldCaptureOutputRecordsUsingTo STARTED

org.apache.kafka.streams.MockProcessorContextTest > shouldCaptureOutputRecordsUsingTo PASSED

org.apache.kafka.streams.MockProcessorContextTest > shouldCaptureOutputRecords STARTED

org.apache.kafka.streams.MockProcessorContextTest > shouldCaptureOutputRecords PASSED

org.apache.kafka.streams.MockProcessorContextTest > fullConstructorShouldSetAllExpectedAttributes STARTED

org.apache.kafka.streams.MockProcessorContextTest > fullConstructorShouldSetAllExpectedAttributes PASSED

org.apache.kafka.streams.MockProcessorContextTest > shouldCaptureCommitsAndAllowReset STARTED

org.apache.kafka.streams.MockProcessorContextTest > shouldCaptureCommitsAndAllowReset PASSED

org.apache.kafka.streams.MockProcessorContextTest > shouldThrowIfForwardedWithDeprecatedChildName STARTED

org.apache.kafka.streams.MockProcessorContextTest > shouldThrowIfForwardedWithDeprecatedChildName PASSED

org.apache.kafka.streams.MockProcessorContextTest > shouldThrowIfForwardedWithDeprecatedChildIndex STARTED

org.apache.kafka.streams.MockProcessorContextTest > shouldThrowIfForwardedWithDeprecatedChildIndex PASSED

org.apache.kafka.streams.MockProcessorContextTest > shouldCaptureApplicationAndRecordMetadata STARTED

org.apache.kafka.streams.MockProcessorContextTest > shouldCaptureApplicationAndRecordMetadata PASSED

org.apache.kafka.streams.MockProcessorContextTest > shouldCaptureRecordsOutputToChildByName STARTED

org.apache.kafka.streams.MockProcessorContextTest > shouldCaptureRecordsOutputToChildByName PASSED

org.apache.kafka.streams.MockProcessorContextTest > shouldCapturePunctuator STARTED

org.apache.kafka.streams.MockProcessorContextTest > shouldCapturePunctuator PASSED

org.apache.kafka.streams.internals.KeyValueStoreFacadeTest > shouldReturnIsOpen STARTED

org.apache.kafka.streams.internals.KeyValueStoreFacadeTest > shouldReturnIsOpen PASSED

org.apache.kafka.streams.internals.KeyValueStoreFacadeTest > shouldDeleteAndReturnPlainValue STARTED

org.apache.kafka.streams.internals.KeyValueStoreFacadeTest > shouldDeleteAndReturnPlainValue PASSED

org.apache.kafka.streams.internals.KeyValueStoreFacadeTest > shouldReturnName STARTED

org.apache.kafka.streams.internals.KeyValueStoreFacadeTest > shouldReturnName PASSED

org.apache.kafka.streams.internals.KeyValueStoreFacadeTest > shouldPutWithUnknownTimestamp STARTED

org.apache.kafka.streams.internals.KeyValueStoreFacadeTest > shouldPutWithUnknownTimestamp PASSED

org.apache.kafka.streams.internals.KeyValueStoreFacadeTest > shouldPutAllWithUnknownTimestamp STARTED

org.apache.kafka.streams.internals.KeyValueStoreFacadeTest > shouldPutAllWithUnknownTimestamp PASSED

org.apache.kafka.streams.internals.KeyValueStoreFacadeTest > shouldReturnIsPersistent STARTED

org.apache.kafka.streams.internals.KeyValueStoreFacadeTest > shouldReturnIsPersistent PASSED

org.apache.kafka.streams.internals.KeyValueStoreFacadeTest > shouldPutIfAbsentWithUnknownTimestamp STARTED

org.apache.kafka.streams.internals.KeyValueStoreFacadeTest > shouldPutIfAbsentWithUnknownTimestamp PASSED

org.apache.kafka.streams.internals.KeyValueStoreFacadeTest > shouldForwardClose STARTED

org.apache.kafka.streams.internals.KeyValueStoreFacadeTest > shouldForwardClose PASSED

org.apache.kafka.streams.internals.KeyValueStoreFacadeTest > shouldForwardFlush STARTED

org.apache.kafka.streams.internals.KeyValueStoreFacadeTest > shouldForwardFlush PASSED

org.apache.kafka.streams.internals.KeyValueStoreFacadeTest > shouldForwardInit STARTED

org.apache.kafka.streams.internals.KeyValueStoreFacadeTest > shouldForwardInit PASSED

org.apache.kafka.streams.internals.WindowStoreFacadeTest > shouldReturnIsOpen STARTED

org.apache.kafka.streams.internals.WindowStoreFacadeTest > shouldReturnIsOpen PASSED

org.apache.kafka.streams.internals.WindowStoreFacadeTest > shouldReturnName STARTED

org.apache.kafka.streams.internals.WindowStoreFacadeTest > shouldReturnName PASSED

org.apache.kafka.streams.internals.WindowStoreFacadeTest > shouldPutWithUnknownTimestamp STARTED

org.apache.kafka.streams.internals.WindowStoreFacadeTest > shouldPutWithUnknownTimestamp PASSED

org.apache.kafka.streams.internals.WindowStoreFacadeTest > shouldPutWindowStartTimestampWithUnknownTimestamp STARTED

org.apache.kafka.streams.internals.WindowStoreFacadeTest > shouldPutWindowStartTimestampWithUnknownTimestamp PASSED

org.apache.kafka.streams.internals.WindowStoreFacadeTest > shouldReturnIsPersistent STARTED

org.apache.kafka.streams.internals.WindowStoreFacadeTest > shouldReturnIsPersistent PASSED

org.apache.kafka.streams.internals.WindowStoreFacadeTest > shouldForwardClose STARTED

org.apache.kafka.streams.internals.WindowStoreFacadeTest > shouldForwardClose PASSED

org.apache.kafka.streams.internals.WindowStoreFacadeTest > shouldForwardFlush STARTED

org.apache.kafka.streams.internals.WindowStoreFacadeTest > shouldForwardFlush PASSED

org.apache.kafka.streams.internals.WindowStoreFacadeTest > shouldForwardInit STARTED

org.apache.kafka.streams.internals.WindowStoreFacadeTest > shouldForwardInit PASSED

org.apache.kafka.streams.MockTimeTest > shouldGetNanosAsMillis STARTED

org.apache.kafka.streams.MockTimeTest > shouldGetNanosAsMillis PASSED

org.apache.kafka.streams.MockTimeTest > shouldSetStartTime STARTED

org.apache.kafka.streams.MockTimeTest > shouldSetStartTime PASSED

org.apache.kafka.streams.MockTimeTest > shouldNotAllowNegativeSleep STARTED

org.apache.kafka.streams.MockTimeTest > shouldNotAllowNegativeSleep PASSED

org.apache.kafka.streams.MockTimeTest > shouldAdvanceTimeOnSleep STARTED

org.apache.kafka.streams.MockTimeTest > shouldAdvanceTimeOnSleep PASSED

> Task :streams:upgrade-system-tests-21:processTestResources NO-SOURCE
> Task :streams:upgrade-system-tests-21:testClasses
> Task :streams:upgrade-system-tests-21:checkstyleTest
> Task :streams:upgrade-system-tests-21:spotbugsMain NO-SOURCE
> Task :streams:upgrade-system-tests-21:test
> Task :streams:upgrade-system-tests-22:compileJava NO-SOURCE
> Task :streams:upgrade-system-tests-22:processResources NO-SOURCE
> Task :streams:upgrade-system-tests-22:classes UP-TO-DATE
> Task :streams:upgrade-system-tests-22:checkstyleMain NO-SOURCE
> Task :streams:upgrade-system-tests-22:compileTestJava
> Task :streams:upgrade-system-tests-22:processTestResources NO-SOURCE
> Task :streams:upgrade-system-tests-22:testClasses
> Task :streams:upgrade-system-tests-22:checkstyleTest
> Task :streams:upgrade-system-tests-22:spotbugsMain NO-SOURCE
> Task :streams:upgrade-system-tests-22:test
> Task :streams:upgrade-system-tests-23:compileJava NO-SOURCE
> Task :streams:upgrade-system-tests-23:processResources NO-SOURCE
> Task :streams:upgrade-system-tests-23:classes UP-TO-DATE
> Task :streams:upgrade-system-tests-23:checkstyleMain NO-SOURCE
> Task :streams:upgrade-system-tests-23:compileTestJava
> Task :streams:upgrade-system-tests-23:processTestResources NO-SOURCE
> Task :streams:upgrade-system-tests-23:testClasses
> Task :streams:upgrade-system-tests-23:checkstyleTest
> Task :streams:upgrade-system-tests-23:spotbugsMain NO-SOURCE
> Task :streams:upgrade-system-tests-23:test

FAILURE: Build failed with an exception.

* What went wrong:
Execution failed for task ':core:test'.
> There were failing tests. See the report at: file://<https://builds.apache.org/job/kafka-trunk-jdk11/ws/core/build/reports/tests/test/index.html>

* Try:
Run with --stacktrace option to get the stack trace. Run with --info or --debug option to get more log output. Run with --scan to get full insights.

* Get more help at https://help.gradle.org

Deprecated Gradle features were used in this build, making it incompatible with Gradle 6.0.
Use '--warning-mode all' to show the individual deprecation warnings.
See https://docs.gradle.org/5.6.2/userguide/command_line_interface.html#sec:command_line_warnings

BUILD FAILED in 3h 12m 19s
184 actionable tasks: 180 executed, 4 up-to-date
Build step 'Execute shell' marked build as failure
Recording test results
ERROR: No tool found matching GRADLE_4_10_2_HOME
Setting GRADLE_4_10_3_HOME=/home/jenkins/tools/gradle/4.10.3
ERROR: No tool found matching GRADLE_4_10_2_HOME
Setting GRADLE_4_10_3_HOME=/home/jenkins/tools/gradle/4.10.3
Not sending mail to unregistered user ismael@juma.me.uk

Jenkins build is back to normal : kafka-trunk-jdk11 #847

Posted by Apache Jenkins Server <je...@builds.apache.org>.
See <https://builds.apache.org/job/kafka-trunk-jdk11/847/display/redirect?page=changes>


Build failed in Jenkins: kafka-trunk-jdk11 #846

Posted by Apache Jenkins Server <je...@builds.apache.org>.
See <https://builds.apache.org/job/kafka-trunk-jdk11/846/display/redirect?page=changes>

Changes:

[github] MINOR: Mark RocksDBStoreTest as integration test (#7412)

[mumrah] KAFKA-8896: Check group state before completing delayed heartbeat


------------------------------------------
[...truncated 2.44 MB...]
org.apache.kafka.streams.integration.TableTableJoinIntegrationTest > testInnerInner[caching enabled = true] STARTED
ERROR: No tool found matching GRADLE_4_10_2_HOME
ERROR: Could not install GRADLE_4_10_3_HOME
java.lang.NullPointerException
	at hudson.plugins.toolenv.ToolEnvBuildWrapper$1.buildEnvVars(ToolEnvBuildWrapper.java:46)
	at hudson.model.AbstractBuild.getEnvironment(AbstractBuild.java:873)
	at hudson.plugins.git.GitSCM.getParamExpandedRepos(GitSCM.java:484)
	at hudson.plugins.git.GitSCM.compareRemoteRevisionWithImpl(GitSCM.java:693)
	at hudson.plugins.git.GitSCM.compareRemoteRevisionWith(GitSCM.java:658)
	at hudson.scm.SCM.compareRemoteRevisionWith(SCM.java:400)
	at hudson.scm.SCM.poll(SCM.java:417)
	at hudson.model.AbstractProject._poll(AbstractProject.java:1390)
	at hudson.model.AbstractProject.poll(AbstractProject.java:1293)
	at hudson.triggers.SCMTrigger$Runner.runPolling(SCMTrigger.java:603)
	at hudson.triggers.SCMTrigger$Runner.run(SCMTrigger.java:649)
	at hudson.util.SequentialExecutionQueue$QueueEntry.run(SequentialExecutionQueue.java:119)
	at java.util.concurrent.Executors$RunnableAdapter.call(Executors.java:511)
	at java.util.concurrent.FutureTask.run(FutureTask.java:266)
	at java.util.concurrent.ThreadPoolExecutor.runWorker(ThreadPoolExecutor.java:1149)
	at java.util.concurrent.ThreadPoolExecutor$Worker.run(ThreadPoolExecutor.java:624)
	at java.lang.Thread.run(Thread.java:748)

org.apache.kafka.streams.integration.TableTableJoinIntegrationTest > testInnerInner[caching enabled = true] PASSED

org.apache.kafka.streams.integration.TableTableJoinIntegrationTest > testInnerOuter[caching enabled = true] STARTED

org.apache.kafka.streams.integration.TableTableJoinIntegrationTest > testInnerOuter[caching enabled = true] PASSED

org.apache.kafka.streams.integration.TableTableJoinIntegrationTest > testInnerLeft[caching enabled = true] STARTED

org.apache.kafka.streams.integration.TableTableJoinIntegrationTest > testInnerLeft[caching enabled = true] PASSED

org.apache.kafka.streams.integration.TableTableJoinIntegrationTest > testOuterInner[caching enabled = true] STARTED

org.apache.kafka.streams.integration.TableTableJoinIntegrationTest > testOuterInner[caching enabled = true] PASSED

org.apache.kafka.streams.integration.TableTableJoinIntegrationTest > testOuterOuter[caching enabled = true] STARTED

org.apache.kafka.streams.integration.TableTableJoinIntegrationTest > testOuterOuter[caching enabled = true] PASSED

org.apache.kafka.streams.integration.TableTableJoinIntegrationTest > testLeftInner[caching enabled = false] STARTED

org.apache.kafka.streams.integration.TableTableJoinIntegrationTest > testLeftInner[caching enabled = false] PASSED

org.apache.kafka.streams.integration.TableTableJoinIntegrationTest > testLeftOuter[caching enabled = false] STARTED

org.apache.kafka.streams.integration.TableTableJoinIntegrationTest > testLeftOuter[caching enabled = false] PASSED

org.apache.kafka.streams.integration.TableTableJoinIntegrationTest > testLeftLeft[caching enabled = false] STARTED

org.apache.kafka.streams.integration.TableTableJoinIntegrationTest > testLeftLeft[caching enabled = false] PASSED

org.apache.kafka.streams.integration.TableTableJoinIntegrationTest > testOuterLeft[caching enabled = false] STARTED

org.apache.kafka.streams.integration.TableTableJoinIntegrationTest > testOuterLeft[caching enabled = false] PASSED

org.apache.kafka.streams.integration.TableTableJoinIntegrationTest > testInner[caching enabled = false] STARTED

org.apache.kafka.streams.integration.TableTableJoinIntegrationTest > testInner[caching enabled = false] PASSED

org.apache.kafka.streams.integration.TableTableJoinIntegrationTest > testOuter[caching enabled = false] STARTED

org.apache.kafka.streams.integration.TableTableJoinIntegrationTest > testOuter[caching enabled = false] PASSED

org.apache.kafka.streams.integration.TableTableJoinIntegrationTest > testLeft[caching enabled = false] STARTED

org.apache.kafka.streams.integration.TableTableJoinIntegrationTest > testLeft[caching enabled = false] PASSED

org.apache.kafka.streams.integration.TableTableJoinIntegrationTest > testInnerInner[caching enabled = false] STARTED

org.apache.kafka.streams.integration.TableTableJoinIntegrationTest > testInnerInner[caching enabled = false] PASSED

org.apache.kafka.streams.integration.TableTableJoinIntegrationTest > testInnerOuter[caching enabled = false] STARTED

org.apache.kafka.streams.integration.TableTableJoinIntegrationTest > testInnerOuter[caching enabled = false] PASSED

org.apache.kafka.streams.integration.TableTableJoinIntegrationTest > testInnerLeft[caching enabled = false] STARTED

org.apache.kafka.streams.integration.TableTableJoinIntegrationTest > testInnerLeft[caching enabled = false] PASSED

org.apache.kafka.streams.integration.TableTableJoinIntegrationTest > testOuterInner[caching enabled = false] STARTED

org.apache.kafka.streams.integration.TableTableJoinIntegrationTest > testOuterInner[caching enabled = false] PASSED

org.apache.kafka.streams.integration.TableTableJoinIntegrationTest > testOuterOuter[caching enabled = false] STARTED

org.apache.kafka.streams.integration.TableTableJoinIntegrationTest > testOuterOuter[caching enabled = false] PASSED

org.apache.kafka.streams.integration.InternalTopicIntegrationTest > shouldCompactTopicsForKeyValueStoreChangelogs STARTED

org.apache.kafka.streams.integration.InternalTopicIntegrationTest > shouldCompactTopicsForKeyValueStoreChangelogs PASSED

org.apache.kafka.streams.integration.InternalTopicIntegrationTest > shouldCompactAndDeleteTopicsForWindowStoreChangelogs STARTED

org.apache.kafka.streams.integration.InternalTopicIntegrationTest > shouldCompactAndDeleteTopicsForWindowStoreChangelogs PASSED

org.apache.kafka.streams.integration.OptimizedKTableIntegrationTest > standbyShouldNotPerformRestoreAtStartup STARTED

org.apache.kafka.streams.integration.OptimizedKTableIntegrationTest > standbyShouldNotPerformRestoreAtStartup PASSED

org.apache.kafka.streams.integration.OptimizedKTableIntegrationTest > shouldApplyUpdatesToStandbyStore STARTED

org.apache.kafka.streams.integration.OptimizedKTableIntegrationTest > shouldApplyUpdatesToStandbyStore PASSED

org.apache.kafka.streams.integration.KStreamTransformIntegrationTest > shouldFlatTransform STARTED

org.apache.kafka.streams.integration.KStreamTransformIntegrationTest > shouldFlatTransform PASSED

org.apache.kafka.streams.integration.KStreamTransformIntegrationTest > shouldFlatTransformValuesWithValueTransformerWithoutKey STARTED

org.apache.kafka.streams.integration.KStreamTransformIntegrationTest > shouldFlatTransformValuesWithValueTransformerWithoutKey PASSED

org.apache.kafka.streams.integration.KStreamTransformIntegrationTest > shouldFlatTransformValuesWithKey STARTED

org.apache.kafka.streams.integration.KStreamTransformIntegrationTest > shouldFlatTransformValuesWithKey PASSED

org.apache.kafka.streams.integration.KStreamTransformIntegrationTest > shouldTransform STARTED

org.apache.kafka.streams.integration.KStreamTransformIntegrationTest > shouldTransform PASSED

org.apache.kafka.streams.integration.KStreamTransformIntegrationTest > shouldTransformValuesWithValueTransformerWithKey STARTED

org.apache.kafka.streams.integration.KStreamTransformIntegrationTest > shouldTransformValuesWithValueTransformerWithKey PASSED

org.apache.kafka.streams.integration.KStreamTransformIntegrationTest > shouldTransformValuesWithValueTransformerWithoutKey STARTED

org.apache.kafka.streams.integration.KStreamTransformIntegrationTest > shouldTransformValuesWithValueTransformerWithoutKey PASSED

org.apache.kafka.streams.integration.QueryableStateIntegrationTest > shouldBeAbleToQueryMapValuesState STARTED

org.apache.kafka.streams.integration.QueryableStateIntegrationTest > shouldBeAbleToQueryMapValuesState PASSED

org.apache.kafka.streams.integration.QueryableStateIntegrationTest > shouldNotMakeStoreAvailableUntilAllStoresAvailable STARTED

org.apache.kafka.streams.integration.QueryableStateIntegrationTest > shouldNotMakeStoreAvailableUntilAllStoresAvailable PASSED

org.apache.kafka.streams.integration.QueryableStateIntegrationTest > queryOnRebalance STARTED

org.apache.kafka.streams.integration.QueryableStateIntegrationTest > queryOnRebalance PASSED

org.apache.kafka.streams.integration.QueryableStateIntegrationTest > concurrentAccesses STARTED

org.apache.kafka.streams.integration.QueryableStateIntegrationTest > concurrentAccesses PASSED

org.apache.kafka.streams.integration.QueryableStateIntegrationTest > shouldAllowToQueryAfterThreadDied STARTED

org.apache.kafka.streams.integration.QueryableStateIntegrationTest > shouldAllowToQueryAfterThreadDied PASSED

org.apache.kafka.streams.integration.QueryableStateIntegrationTest > shouldBeAbleToQueryStateWithZeroSizedCache STARTED

org.apache.kafka.streams.integration.QueryableStateIntegrationTest > shouldBeAbleToQueryStateWithZeroSizedCache PASSED

org.apache.kafka.streams.integration.QueryableStateIntegrationTest > shouldBeAbleToQueryMapValuesAfterFilterState STARTED

org.apache.kafka.streams.integration.QueryableStateIntegrationTest > shouldBeAbleToQueryMapValuesAfterFilterState PASSED

org.apache.kafka.streams.integration.QueryableStateIntegrationTest > shouldBeAbleToQueryFilterState STARTED

org.apache.kafka.streams.integration.QueryableStateIntegrationTest > shouldBeAbleToQueryFilterState PASSED

org.apache.kafka.streams.integration.QueryableStateIntegrationTest > shouldBeAbleToQueryStateWithNonZeroSizedCache STARTED

org.apache.kafka.streams.integration.QueryableStateIntegrationTest > shouldBeAbleToQueryStateWithNonZeroSizedCache PASSED

org.apache.kafka.streams.integration.KStreamAggregationDedupIntegrationTest > shouldReduce STARTED

org.apache.kafka.streams.integration.KStreamAggregationDedupIntegrationTest > shouldReduce PASSED

org.apache.kafka.streams.integration.KStreamAggregationDedupIntegrationTest > shouldGroupByKey STARTED

org.apache.kafka.streams.integration.KStreamAggregationDedupIntegrationTest > shouldGroupByKey PASSED

org.apache.kafka.streams.integration.KStreamAggregationDedupIntegrationTest > shouldReduceWindowed STARTED

org.apache.kafka.streams.integration.KStreamAggregationDedupIntegrationTest > shouldReduceWindowed PASSED

org.apache.kafka.streams.integration.PurgeRepartitionTopicIntegrationTest > shouldRestoreState STARTED

org.apache.kafka.streams.integration.PurgeRepartitionTopicIntegrationTest > shouldRestoreState PASSED
FATAL: command execution failed
java.io.EOFException
	at java.io.ObjectInputStream$PeekInputStream.readFully(ObjectInputStream.java:2681)
	at java.io.ObjectInputStream$BlockDataInputStream.readShort(ObjectInputStream.java:3156)
	at java.io.ObjectInputStream.readStreamHeader(ObjectInputStream.java:862)
	at java.io.ObjectInputStream.<init>(ObjectInputStream.java:358)
	at hudson.remoting.ObjectInputStreamEx.<init>(ObjectInputStreamEx.java:49)
	at hudson.remoting.Command.readFrom(Command.java:140)
	at hudson.remoting.Command.readFrom(Command.java:126)
	at hudson.remoting.AbstractSynchronousByteArrayCommandTransport.read(AbstractSynchronousByteArrayCommandTransport.java:36)
	at hudson.remoting.SynchronousCommandTransport$ReaderThread.run(SynchronousCommandTransport.java:63)
Caused: java.io.IOException: Unexpected termination of the channel
	at hudson.remoting.SynchronousCommandTransport$ReaderThread.run(SynchronousCommandTransport.java:77)
Caused: hudson.remoting.ChannelClosedException: Channel "unknown": Remote call on H30 failed. The channel is closing down or has closed down
	at hudson.remoting.Channel.call(Channel.java:950)
	at hudson.remoting.RemoteInvocationHandler.invoke(RemoteInvocationHandler.java:283)
	at com.sun.proxy.$Proxy144.isAlive(Unknown Source)
	at hudson.Launcher$RemoteLauncher$ProcImpl.isAlive(Launcher.java:1150)
	at hudson.Launcher$RemoteLauncher$ProcImpl.join(Launcher.java:1142)
	at hudson.tasks.CommandInterpreter.join(CommandInterpreter.java:155)
	at hudson.tasks.CommandInterpreter.perform(CommandInterpreter.java:109)
	at hudson.tasks.CommandInterpreter.perform(CommandInterpreter.java:66)
	at hudson.tasks.BuildStepMonitor$1.perform(BuildStepMonitor.java:20)
	at hudson.model.AbstractBuild$AbstractBuildExecution.perform(AbstractBuild.java:741)
	at hudson.model.Build$BuildExecution.build(Build.java:206)
	at hudson.model.Build$BuildExecution.doRun(Build.java:163)
	at hudson.model.AbstractBuild$AbstractBuildExecution.run(AbstractBuild.java:504)
	at hudson.model.Run.execute(Run.java:1815)
	at hudson.model.FreeStyleBuild.run(FreeStyleBuild.java:43)
	at hudson.model.ResourceController.execute(ResourceController.java:97)
	at hudson.model.Executor.run(Executor.java:429)
FATAL: Unable to delete script file /tmp/jenkins589902899664273646.sh
java.io.EOFException
	at java.io.ObjectInputStream$PeekInputStream.readFully(ObjectInputStream.java:2681)
	at java.io.ObjectInputStream$BlockDataInputStream.readShort(ObjectInputStream.java:3156)
	at java.io.ObjectInputStream.readStreamHeader(ObjectInputStream.java:862)
	at java.io.ObjectInputStream.<init>(ObjectInputStream.java:358)
	at hudson.remoting.ObjectInputStreamEx.<init>(ObjectInputStreamEx.java:49)
	at hudson.remoting.Command.readFrom(Command.java:140)
	at hudson.remoting.Command.readFrom(Command.java:126)
	at hudson.remoting.AbstractSynchronousByteArrayCommandTransport.read(AbstractSynchronousByteArrayCommandTransport.java:36)
	at hudson.remoting.SynchronousCommandTransport$ReaderThread.run(SynchronousCommandTransport.java:63)
Caused: java.io.IOException: Unexpected termination of the channel
	at hudson.remoting.SynchronousCommandTransport$ReaderThread.run(SynchronousCommandTransport.java:77)
Caused: hudson.remoting.ChannelClosedException: Channel "unknown": Remote call on H30 failed. The channel is closing down or has closed down
	at hudson.remoting.Channel.call(Channel.java:950)
	at hudson.FilePath.act(FilePath.java:1072)
	at hudson.FilePath.act(FilePath.java:1061)
	at hudson.FilePath.delete(FilePath.java:1542)
	at hudson.tasks.CommandInterpreter.perform(CommandInterpreter.java:123)
	at hudson.tasks.CommandInterpreter.perform(CommandInterpreter.java:66)
	at hudson.tasks.BuildStepMonitor$1.perform(BuildStepMonitor.java:20)
	at hudson.model.AbstractBuild$AbstractBuildExecution.perform(AbstractBuild.java:741)
	at hudson.model.Build$BuildExecution.build(Build.java:206)
	at hudson.model.Build$BuildExecution.doRun(Build.java:163)
	at hudson.model.AbstractBuild$AbstractBuildExecution.run(AbstractBuild.java:504)
	at hudson.model.Run.execute(Run.java:1815)
	at hudson.model.FreeStyleBuild.run(FreeStyleBuild.java:43)
	at hudson.model.ResourceController.execute(ResourceController.java:97)
	at hudson.model.Executor.run(Executor.java:429)
Build step 'Execute shell' marked build as failure
ERROR: Step ?Publish JUnit test result report? failed: no workspace for kafka-trunk-jdk11 #846
ERROR: H30 is offline; cannot locate JDK 11 (latest)
ERROR: No tool found matching GRADLE_4_10_2_HOME
ERROR: H30 is offline; cannot locate Gradle 4.10.3
Setting GRADLE_4_10_3_HOME=/home/jenkins/tools/gradle/4.10.3
Not sending mail to unregistered user ismael@juma.me.uk
Not sending mail to unregistered user wangguoz@gmail.com
Not sending mail to unregistered user noreply@github.com
Not sending mail to unregistered user mumrah@gmail.com

Build failed in Jenkins: kafka-trunk-jdk11 #845

Posted by Apache Jenkins Server <je...@builds.apache.org>.
See <https://builds.apache.org/job/kafka-trunk-jdk11/845/display/redirect?page=changes>

Changes:

[wangguoz] MINOR: Adjust logic of conditions to set number of partitions in step

[wangguoz] KAFKA-8609: Add rebalance-latency-total (#7401)

[wangguoz] KAFKA-8927: Deprecate PartitionGrouper interface (#7376)

[wangguoz] KAFKA-8729, pt 2: Add error_records and error_message to


------------------------------------------
[...truncated 2.65 MB...]
org.apache.kafka.streams.TopologyTestDriverTest > shouldReturnAllStores[Eos enabled = false] STARTED

org.apache.kafka.streams.TopologyTestDriverTest > shouldReturnAllStores[Eos enabled = false] PASSED

org.apache.kafka.streams.TopologyTestDriverTest > shouldSendRecordViaCorrectSourceTopic[Eos enabled = false] STARTED

org.apache.kafka.streams.TopologyTestDriverTest > shouldSendRecordViaCorrectSourceTopic[Eos enabled = false] PASSED

org.apache.kafka.streams.TopologyTestDriverTest > shouldNotCreateStateDirectoryForStatelessTopology[Eos enabled = false] STARTED

org.apache.kafka.streams.TopologyTestDriverTest > shouldNotCreateStateDirectoryForStatelessTopology[Eos enabled = false] PASSED

org.apache.kafka.streams.TopologyTestDriverTest > shouldReturnAllStoresNames[Eos enabled = false] STARTED

org.apache.kafka.streams.TopologyTestDriverTest > shouldReturnAllStoresNames[Eos enabled = false] PASSED

org.apache.kafka.streams.TopologyTestDriverTest > shouldProcessConsumerRecordList[Eos enabled = false] STARTED

org.apache.kafka.streams.TopologyTestDriverTest > shouldProcessConsumerRecordList[Eos enabled = false] PASSED

org.apache.kafka.streams.TopologyTestDriverTest > shouldUseSinkSpecificSerializers[Eos enabled = false] STARTED

org.apache.kafka.streams.TopologyTestDriverTest > shouldUseSinkSpecificSerializers[Eos enabled = false] PASSED

org.apache.kafka.streams.TopologyTestDriverTest > shouldFlushStoreForFirstInput[Eos enabled = false] STARTED

org.apache.kafka.streams.TopologyTestDriverTest > shouldFlushStoreForFirstInput[Eos enabled = false] PASSED

org.apache.kafka.streams.TopologyTestDriverTest > shouldProcessFromSourceThatMatchPattern[Eos enabled = false] STARTED

org.apache.kafka.streams.TopologyTestDriverTest > shouldProcessFromSourceThatMatchPattern[Eos enabled = false] PASSED

org.apache.kafka.streams.TopologyTestDriverTest > shouldUpdateStoreForNewKey[Eos enabled = false] STARTED

org.apache.kafka.streams.TopologyTestDriverTest > shouldUpdateStoreForNewKey[Eos enabled = false] PASSED

org.apache.kafka.streams.TopologyTestDriverTest > shouldPunctuateOnWallClockTime[Eos enabled = false] STARTED

org.apache.kafka.streams.TopologyTestDriverTest > shouldPunctuateOnWallClockTime[Eos enabled = false] PASSED

org.apache.kafka.streams.TopologyTestDriverTest > shouldSetRecordMetadata[Eos enabled = false] STARTED

org.apache.kafka.streams.TopologyTestDriverTest > shouldSetRecordMetadata[Eos enabled = false] PASSED

org.apache.kafka.streams.TopologyTestDriverTest > shouldNotUpdateStoreForLargerValue[Eos enabled = false] STARTED

org.apache.kafka.streams.TopologyTestDriverTest > shouldNotUpdateStoreForLargerValue[Eos enabled = false] PASSED

org.apache.kafka.streams.TopologyTestDriverTest > shouldReturnCorrectInMemoryStoreTypeOnly[Eos enabled = false] STARTED

org.apache.kafka.streams.TopologyTestDriverTest > shouldReturnCorrectInMemoryStoreTypeOnly[Eos enabled = false] PASSED

org.apache.kafka.streams.TopologyTestDriverTest > shouldProcessRecordForTopic[Eos enabled = false] STARTED

org.apache.kafka.streams.TopologyTestDriverTest > shouldProcessRecordForTopic[Eos enabled = false] PASSED

org.apache.kafka.streams.TopologyTestDriverTest > shouldForwardRecordsFromSubtopologyToSubtopology[Eos enabled = false] STARTED

org.apache.kafka.streams.TopologyTestDriverTest > shouldForwardRecordsFromSubtopologyToSubtopology[Eos enabled = false] PASSED

org.apache.kafka.streams.TopologyTestDriverTest > shouldNotUpdateStoreForSmallerValue[Eos enabled = false] STARTED

org.apache.kafka.streams.TopologyTestDriverTest > shouldNotUpdateStoreForSmallerValue[Eos enabled = false] PASSED

org.apache.kafka.streams.TopologyTestDriverTest > shouldCreateStateDirectoryForStatefulTopology[Eos enabled = false] STARTED

org.apache.kafka.streams.TopologyTestDriverTest > shouldCreateStateDirectoryForStatefulTopology[Eos enabled = false] PASSED

org.apache.kafka.streams.TopologyTestDriverTest > shouldPunctuateIfWallClockTimeAdvances[Eos enabled = false] STARTED

org.apache.kafka.streams.TopologyTestDriverTest > shouldPunctuateIfWallClockTimeAdvances[Eos enabled = false] PASSED

org.apache.kafka.streams.MockProcessorContextTest > shouldStoreAndReturnStateStores STARTED

org.apache.kafka.streams.MockProcessorContextTest > shouldStoreAndReturnStateStores PASSED

org.apache.kafka.streams.MockProcessorContextTest > shouldCaptureOutputRecordsUsingTo STARTED

org.apache.kafka.streams.MockProcessorContextTest > shouldCaptureOutputRecordsUsingTo PASSED

org.apache.kafka.streams.MockProcessorContextTest > shouldCaptureOutputRecords STARTED

org.apache.kafka.streams.MockProcessorContextTest > shouldCaptureOutputRecords PASSED

org.apache.kafka.streams.MockProcessorContextTest > fullConstructorShouldSetAllExpectedAttributes STARTED

org.apache.kafka.streams.MockProcessorContextTest > fullConstructorShouldSetAllExpectedAttributes PASSED

org.apache.kafka.streams.MockProcessorContextTest > shouldCaptureCommitsAndAllowReset STARTED

org.apache.kafka.streams.MockProcessorContextTest > shouldCaptureCommitsAndAllowReset PASSED

org.apache.kafka.streams.MockProcessorContextTest > shouldThrowIfForwardedWithDeprecatedChildName STARTED

org.apache.kafka.streams.MockProcessorContextTest > shouldThrowIfForwardedWithDeprecatedChildName PASSED

org.apache.kafka.streams.MockProcessorContextTest > shouldThrowIfForwardedWithDeprecatedChildIndex STARTED

org.apache.kafka.streams.MockProcessorContextTest > shouldThrowIfForwardedWithDeprecatedChildIndex PASSED

org.apache.kafka.streams.MockProcessorContextTest > shouldCaptureApplicationAndRecordMetadata STARTED

org.apache.kafka.streams.MockProcessorContextTest > shouldCaptureApplicationAndRecordMetadata PASSED

org.apache.kafka.streams.MockProcessorContextTest > shouldCaptureRecordsOutputToChildByName STARTED

org.apache.kafka.streams.MockProcessorContextTest > shouldCaptureRecordsOutputToChildByName PASSED

org.apache.kafka.streams.MockProcessorContextTest > shouldCapturePunctuator STARTED

org.apache.kafka.streams.MockProcessorContextTest > shouldCapturePunctuator PASSED

org.apache.kafka.streams.internals.KeyValueStoreFacadeTest > shouldReturnIsOpen STARTED

org.apache.kafka.streams.internals.KeyValueStoreFacadeTest > shouldReturnIsOpen PASSED

org.apache.kafka.streams.internals.KeyValueStoreFacadeTest > shouldDeleteAndReturnPlainValue STARTED

org.apache.kafka.streams.internals.KeyValueStoreFacadeTest > shouldDeleteAndReturnPlainValue PASSED

org.apache.kafka.streams.internals.KeyValueStoreFacadeTest > shouldReturnName STARTED

org.apache.kafka.streams.internals.KeyValueStoreFacadeTest > shouldReturnName PASSED

org.apache.kafka.streams.internals.KeyValueStoreFacadeTest > shouldPutWithUnknownTimestamp STARTED

org.apache.kafka.streams.internals.KeyValueStoreFacadeTest > shouldPutWithUnknownTimestamp PASSED

org.apache.kafka.streams.internals.KeyValueStoreFacadeTest > shouldPutAllWithUnknownTimestamp STARTED

org.apache.kafka.streams.internals.KeyValueStoreFacadeTest > shouldPutAllWithUnknownTimestamp PASSED

org.apache.kafka.streams.internals.KeyValueStoreFacadeTest > shouldReturnIsPersistent STARTED

org.apache.kafka.streams.internals.KeyValueStoreFacadeTest > shouldReturnIsPersistent PASSED

org.apache.kafka.streams.internals.KeyValueStoreFacadeTest > shouldPutIfAbsentWithUnknownTimestamp STARTED

org.apache.kafka.streams.internals.KeyValueStoreFacadeTest > shouldPutIfAbsentWithUnknownTimestamp PASSED

org.apache.kafka.streams.internals.KeyValueStoreFacadeTest > shouldForwardClose STARTED

org.apache.kafka.streams.internals.KeyValueStoreFacadeTest > shouldForwardClose PASSED

org.apache.kafka.streams.internals.KeyValueStoreFacadeTest > shouldForwardFlush STARTED

org.apache.kafka.streams.internals.KeyValueStoreFacadeTest > shouldForwardFlush PASSED

org.apache.kafka.streams.internals.KeyValueStoreFacadeTest > shouldForwardInit STARTED

org.apache.kafka.streams.internals.KeyValueStoreFacadeTest > shouldForwardInit PASSED

org.apache.kafka.streams.internals.WindowStoreFacadeTest > shouldReturnIsOpen STARTED

org.apache.kafka.streams.internals.WindowStoreFacadeTest > shouldReturnIsOpen PASSED

org.apache.kafka.streams.internals.WindowStoreFacadeTest > shouldReturnName STARTED

org.apache.kafka.streams.internals.WindowStoreFacadeTest > shouldReturnName PASSED

org.apache.kafka.streams.internals.WindowStoreFacadeTest > shouldPutWithUnknownTimestamp STARTED

org.apache.kafka.streams.internals.WindowStoreFacadeTest > shouldPutWithUnknownTimestamp PASSED

org.apache.kafka.streams.internals.WindowStoreFacadeTest > shouldPutWindowStartTimestampWithUnknownTimestamp STARTED

org.apache.kafka.streams.internals.WindowStoreFacadeTest > shouldPutWindowStartTimestampWithUnknownTimestamp PASSED

org.apache.kafka.streams.internals.WindowStoreFacadeTest > shouldReturnIsPersistent STARTED

org.apache.kafka.streams.internals.WindowStoreFacadeTest > shouldReturnIsPersistent PASSED

org.apache.kafka.streams.internals.WindowStoreFacadeTest > shouldForwardClose STARTED

org.apache.kafka.streams.internals.WindowStoreFacadeTest > shouldForwardClose PASSED

org.apache.kafka.streams.internals.WindowStoreFacadeTest > shouldForwardFlush STARTED

org.apache.kafka.streams.internals.WindowStoreFacadeTest > shouldForwardFlush PASSED

org.apache.kafka.streams.internals.WindowStoreFacadeTest > shouldForwardInit STARTED

org.apache.kafka.streams.internals.WindowStoreFacadeTest > shouldForwardInit PASSED

org.apache.kafka.streams.MockTimeTest > shouldGetNanosAsMillis STARTED

org.apache.kafka.streams.MockTimeTest > shouldGetNanosAsMillis PASSED

org.apache.kafka.streams.MockTimeTest > shouldSetStartTime STARTED

org.apache.kafka.streams.MockTimeTest > shouldSetStartTime PASSED

org.apache.kafka.streams.MockTimeTest > shouldNotAllowNegativeSleep STARTED

org.apache.kafka.streams.MockTimeTest > shouldNotAllowNegativeSleep PASSED

org.apache.kafka.streams.MockTimeTest > shouldAdvanceTimeOnSleep STARTED

org.apache.kafka.streams.MockTimeTest > shouldAdvanceTimeOnSleep PASSED

> Task :streams:upgrade-system-tests-21:spotbugsMain NO-SOURCE
> Task :streams:upgrade-system-tests-21:test
> Task :streams:upgrade-system-tests-22:compileJava NO-SOURCE
> Task :streams:upgrade-system-tests-22:processResources NO-SOURCE
> Task :streams:upgrade-system-tests-22:classes UP-TO-DATE
> Task :streams:upgrade-system-tests-22:checkstyleMain NO-SOURCE
> Task :streams:upgrade-system-tests-22:compileTestJava
> Task :streams:upgrade-system-tests-22:processTestResources NO-SOURCE
> Task :streams:upgrade-system-tests-22:testClasses
> Task :streams:upgrade-system-tests-22:checkstyleTest
> Task :streams:upgrade-system-tests-22:spotbugsMain NO-SOURCE
> Task :streams:upgrade-system-tests-22:test
> Task :streams:upgrade-system-tests-23:compileJava NO-SOURCE
> Task :streams:upgrade-system-tests-23:processResources NO-SOURCE
> Task :streams:upgrade-system-tests-23:classes UP-TO-DATE
> Task :streams:upgrade-system-tests-23:checkstyleMain NO-SOURCE
> Task :streams:upgrade-system-tests-23:compileTestJava
> Task :streams:upgrade-system-tests-23:processTestResources NO-SOURCE
> Task :streams:upgrade-system-tests-23:testClasses
> Task :streams:upgrade-system-tests-23:checkstyleTest
> Task :streams:upgrade-system-tests-23:spotbugsMain NO-SOURCE
> Task :streams:upgrade-system-tests-23:test

FAILURE: Build failed with an exception.

* What went wrong:
Execution failed for task ':core:test'.
> There were failing tests. See the report at: file://<https://builds.apache.org/job/kafka-trunk-jdk11/ws/core/build/reports/tests/test/index.html>

* Try:
Run with --stacktrace option to get the stack trace. Run with --info or --debug option to get more log output. Run with --scan to get full insights.

* Get more help at https://help.gradle.org

Deprecated Gradle features were used in this build, making it incompatible with Gradle 6.0.
Use '--warning-mode all' to show the individual deprecation warnings.
See https://docs.gradle.org/5.6.2/userguide/command_line_interface.html#sec:command_line_warnings

BUILD FAILED in 3h 39m 25s
184 actionable tasks: 157 executed, 27 up-to-date
Build step 'Execute shell' marked build as failure
Recording test results
ERROR: No tool found matching GRADLE_4_10_2_HOME
Setting GRADLE_4_10_3_HOME=/home/jenkins/tools/gradle/4.10.3
ERROR: No tool found matching GRADLE_4_10_2_HOME
Setting GRADLE_4_10_3_HOME=/home/jenkins/tools/gradle/4.10.3
Not sending mail to unregistered user ismael@juma.me.uk
Not sending mail to unregistered user wangguoz@gmail.com
Not sending mail to unregistered user noreply@github.com

Build failed in Jenkins: kafka-trunk-jdk11 #844

Posted by Apache Jenkins Server <je...@builds.apache.org>.
See <https://builds.apache.org/job/kafka-trunk-jdk11/844/display/redirect?page=changes>

Changes:

[bbejeck] KAFKA-8911: Using proper WindowSerdes constructors in their implicit


------------------------------------------
[...truncated 2.66 MB...]
org.apache.kafka.streams.TopologyTestDriverTest > shouldReturnAllStoresNames[Eos enabled = true] STARTED

org.apache.kafka.streams.TopologyTestDriverTest > shouldReturnAllStoresNames[Eos enabled = true] PASSED

org.apache.kafka.streams.TopologyTestDriverTest > shouldProcessConsumerRecordList[Eos enabled = true] STARTED

org.apache.kafka.streams.TopologyTestDriverTest > shouldProcessConsumerRecordList[Eos enabled = true] PASSED

org.apache.kafka.streams.TopologyTestDriverTest > shouldUseSinkSpecificSerializers[Eos enabled = true] STARTED

org.apache.kafka.streams.TopologyTestDriverTest > shouldUseSinkSpecificSerializers[Eos enabled = true] PASSED

org.apache.kafka.streams.TopologyTestDriverTest > shouldFlushStoreForFirstInput[Eos enabled = true] STARTED

org.apache.kafka.streams.TopologyTestDriverTest > shouldFlushStoreForFirstInput[Eos enabled = true] PASSED

org.apache.kafka.streams.TopologyTestDriverTest > shouldProcessFromSourceThatMatchPattern[Eos enabled = true] STARTED

org.apache.kafka.streams.TopologyTestDriverTest > shouldProcessFromSourceThatMatchPattern[Eos enabled = true] PASSED

org.apache.kafka.streams.TopologyTestDriverTest > shouldUpdateStoreForNewKey[Eos enabled = true] STARTED

org.apache.kafka.streams.TopologyTestDriverTest > shouldUpdateStoreForNewKey[Eos enabled = true] PASSED

org.apache.kafka.streams.TopologyTestDriverTest > shouldPunctuateOnWallClockTime[Eos enabled = true] STARTED

org.apache.kafka.streams.TopologyTestDriverTest > shouldPunctuateOnWallClockTime[Eos enabled = true] PASSED

org.apache.kafka.streams.TopologyTestDriverTest > shouldSetRecordMetadata[Eos enabled = true] STARTED

org.apache.kafka.streams.TopologyTestDriverTest > shouldSetRecordMetadata[Eos enabled = true] PASSED

org.apache.kafka.streams.TopologyTestDriverTest > shouldNotUpdateStoreForLargerValue[Eos enabled = true] STARTED

org.apache.kafka.streams.TopologyTestDriverTest > shouldNotUpdateStoreForLargerValue[Eos enabled = true] PASSED

org.apache.kafka.streams.TopologyTestDriverTest > shouldReturnCorrectInMemoryStoreTypeOnly[Eos enabled = true] STARTED

org.apache.kafka.streams.TopologyTestDriverTest > shouldReturnCorrectInMemoryStoreTypeOnly[Eos enabled = true] PASSED

org.apache.kafka.streams.TopologyTestDriverTest > shouldProcessRecordForTopic[Eos enabled = true] STARTED

org.apache.kafka.streams.TopologyTestDriverTest > shouldProcessRecordForTopic[Eos enabled = true] PASSED

org.apache.kafka.streams.TopologyTestDriverTest > shouldForwardRecordsFromSubtopologyToSubtopology[Eos enabled = true] STARTED

org.apache.kafka.streams.TopologyTestDriverTest > shouldForwardRecordsFromSubtopologyToSubtopology[Eos enabled = true] PASSED

org.apache.kafka.streams.TopologyTestDriverTest > shouldNotUpdateStoreForSmallerValue[Eos enabled = true] STARTED

org.apache.kafka.streams.TopologyTestDriverTest > shouldNotUpdateStoreForSmallerValue[Eos enabled = true] PASSED

org.apache.kafka.streams.TopologyTestDriverTest > shouldCreateStateDirectoryForStatefulTopology[Eos enabled = true] STARTED

org.apache.kafka.streams.TopologyTestDriverTest > shouldCreateStateDirectoryForStatefulTopology[Eos enabled = true] PASSED

org.apache.kafka.streams.TopologyTestDriverTest > shouldPunctuateIfWallClockTimeAdvances[Eos enabled = true] STARTED

org.apache.kafka.streams.TopologyTestDriverTest > shouldPunctuateIfWallClockTimeAdvances[Eos enabled = true] PASSED

org.apache.kafka.streams.TopologyTestDriverTest > shouldCloseProcessor[Eos enabled = false] STARTED

org.apache.kafka.streams.TopologyTestDriverTest > shouldCloseProcessor[Eos enabled = false] PASSED

org.apache.kafka.streams.TopologyTestDriverTest > shouldFeedStoreFromGlobalKTable[Eos enabled = false] STARTED

org.apache.kafka.streams.TopologyTestDriverTest > shouldFeedStoreFromGlobalKTable[Eos enabled = false] PASSED

org.apache.kafka.streams.TopologyTestDriverTest > shouldCleanUpPersistentStateStoresOnClose[Eos enabled = false] STARTED

org.apache.kafka.streams.TopologyTestDriverTest > shouldCleanUpPersistentStateStoresOnClose[Eos enabled = false] PASSED

org.apache.kafka.streams.TopologyTestDriverTest > shouldThrowPatternNotValidForTopicNameException[Eos enabled = false] STARTED

org.apache.kafka.streams.TopologyTestDriverTest > shouldThrowPatternNotValidForTopicNameException[Eos enabled = false] PASSED

org.apache.kafka.streams.TopologyTestDriverTest > shouldPunctuateIfEvenTimeAdvances[Eos enabled = false] STARTED

org.apache.kafka.streams.TopologyTestDriverTest > shouldPunctuateIfEvenTimeAdvances[Eos enabled = false] PASSED

org.apache.kafka.streams.TopologyTestDriverTest > shouldInitProcessor[Eos enabled = false] STARTED

org.apache.kafka.streams.TopologyTestDriverTest > shouldInitProcessor[Eos enabled = false] PASSED

org.apache.kafka.streams.TopologyTestDriverTest > shouldThrowForUnknownTopic[Eos enabled = false] STARTED

org.apache.kafka.streams.TopologyTestDriverTest > shouldThrowForUnknownTopic[Eos enabled = false] PASSED

org.apache.kafka.streams.TopologyTestDriverTest > shouldPunctuateOnStreamsTime[Eos enabled = false] STARTED

org.apache.kafka.streams.TopologyTestDriverTest > shouldPunctuateOnStreamsTime[Eos enabled = false] PASSED

org.apache.kafka.streams.TopologyTestDriverTest > shouldThrowIfInMemoryBuiltInStoreIsAccessedWithUntypedMethod[Eos enabled = false] STARTED

org.apache.kafka.streams.TopologyTestDriverTest > shouldThrowIfInMemoryBuiltInStoreIsAccessedWithUntypedMethod[Eos enabled = false] PASSED

org.apache.kafka.streams.TopologyTestDriverTest > shouldProcessFromSourcesThatMatchMultiplePattern[Eos enabled = false] STARTED

org.apache.kafka.streams.TopologyTestDriverTest > shouldProcessFromSourcesThatMatchMultiplePattern[Eos enabled = false] PASSED

org.apache.kafka.streams.TopologyTestDriverTest > shouldPopulateGlobalStore[Eos enabled = false] STARTED

org.apache.kafka.streams.TopologyTestDriverTest > shouldPopulateGlobalStore[Eos enabled = false] PASSED

org.apache.kafka.streams.TopologyTestDriverTest > shouldThrowIfPersistentBuiltInStoreIsAccessedWithUntypedMethod[Eos enabled = false] STARTED

org.apache.kafka.streams.TopologyTestDriverTest > shouldThrowIfPersistentBuiltInStoreIsAccessedWithUntypedMethod[Eos enabled = false] PASSED

org.apache.kafka.streams.TopologyTestDriverTest > shouldAllowPrePopulatingStatesStoresWithCachingEnabled[Eos enabled = false] STARTED

org.apache.kafka.streams.TopologyTestDriverTest > shouldAllowPrePopulatingStatesStoresWithCachingEnabled[Eos enabled = false] PASSED

org.apache.kafka.streams.TopologyTestDriverTest > shouldReturnCorrectPersistentStoreTypeOnly[Eos enabled = false] STARTED

org.apache.kafka.streams.TopologyTestDriverTest > shouldReturnCorrectPersistentStoreTypeOnly[Eos enabled = false] PASSED

org.apache.kafka.streams.TopologyTestDriverTest > shouldUseSourceSpecificDeserializers[Eos enabled = false] STARTED

org.apache.kafka.streams.TopologyTestDriverTest > shouldUseSourceSpecificDeserializers[Eos enabled = false] PASSED

org.apache.kafka.streams.TopologyTestDriverTest > shouldReturnAllStores[Eos enabled = false] STARTED

org.apache.kafka.streams.TopologyTestDriverTest > shouldReturnAllStores[Eos enabled = false] PASSED

org.apache.kafka.streams.TopologyTestDriverTest > shouldSendRecordViaCorrectSourceTopic[Eos enabled = false] STARTED

org.apache.kafka.streams.TopologyTestDriverTest > shouldSendRecordViaCorrectSourceTopic[Eos enabled = false] PASSED

org.apache.kafka.streams.TopologyTestDriverTest > shouldNotCreateStateDirectoryForStatelessTopology[Eos enabled = false] STARTED

org.apache.kafka.streams.TopologyTestDriverTest > shouldNotCreateStateDirectoryForStatelessTopology[Eos enabled = false] PASSED

org.apache.kafka.streams.TopologyTestDriverTest > shouldReturnAllStoresNames[Eos enabled = false] STARTED

org.apache.kafka.streams.TopologyTestDriverTest > shouldReturnAllStoresNames[Eos enabled = false] PASSED

org.apache.kafka.streams.TopologyTestDriverTest > shouldProcessConsumerRecordList[Eos enabled = false] STARTED

org.apache.kafka.streams.TopologyTestDriverTest > shouldProcessConsumerRecordList[Eos enabled = false] PASSED

org.apache.kafka.streams.TopologyTestDriverTest > shouldUseSinkSpecificSerializers[Eos enabled = false] STARTED

org.apache.kafka.streams.TopologyTestDriverTest > shouldUseSinkSpecificSerializers[Eos enabled = false] PASSED

org.apache.kafka.streams.TopologyTestDriverTest > shouldFlushStoreForFirstInput[Eos enabled = false] STARTED

org.apache.kafka.streams.TopologyTestDriverTest > shouldFlushStoreForFirstInput[Eos enabled = false] PASSED

org.apache.kafka.streams.TopologyTestDriverTest > shouldProcessFromSourceThatMatchPattern[Eos enabled = false] STARTED

org.apache.kafka.streams.TopologyTestDriverTest > shouldProcessFromSourceThatMatchPattern[Eos enabled = false] PASSED

org.apache.kafka.streams.TopologyTestDriverTest > shouldUpdateStoreForNewKey[Eos enabled = false] STARTED

org.apache.kafka.streams.TopologyTestDriverTest > shouldUpdateStoreForNewKey[Eos enabled = false] PASSED

org.apache.kafka.streams.TopologyTestDriverTest > shouldPunctuateOnWallClockTime[Eos enabled = false] STARTED

org.apache.kafka.streams.TopologyTestDriverTest > shouldPunctuateOnWallClockTime[Eos enabled = false] PASSED

org.apache.kafka.streams.TopologyTestDriverTest > shouldSetRecordMetadata[Eos enabled = false] STARTED

org.apache.kafka.streams.TopologyTestDriverTest > shouldSetRecordMetadata[Eos enabled = false] PASSED

org.apache.kafka.streams.TopologyTestDriverTest > shouldNotUpdateStoreForLargerValue[Eos enabled = false] STARTED

org.apache.kafka.streams.TopologyTestDriverTest > shouldNotUpdateStoreForLargerValue[Eos enabled = false] PASSED

org.apache.kafka.streams.TopologyTestDriverTest > shouldReturnCorrectInMemoryStoreTypeOnly[Eos enabled = false] STARTED

org.apache.kafka.streams.TopologyTestDriverTest > shouldReturnCorrectInMemoryStoreTypeOnly[Eos enabled = false] PASSED

org.apache.kafka.streams.TopologyTestDriverTest > shouldProcessRecordForTopic[Eos enabled = false] STARTED

org.apache.kafka.streams.TopologyTestDriverTest > shouldProcessRecordForTopic[Eos enabled = false] PASSED

org.apache.kafka.streams.TopologyTestDriverTest > shouldForwardRecordsFromSubtopologyToSubtopology[Eos enabled = false] STARTED

org.apache.kafka.streams.TopologyTestDriverTest > shouldForwardRecordsFromSubtopologyToSubtopology[Eos enabled = false] PASSED

org.apache.kafka.streams.TopologyTestDriverTest > shouldNotUpdateStoreForSmallerValue[Eos enabled = false] STARTED

org.apache.kafka.streams.TopologyTestDriverTest > shouldNotUpdateStoreForSmallerValue[Eos enabled = false] PASSED

org.apache.kafka.streams.TopologyTestDriverTest > shouldCreateStateDirectoryForStatefulTopology[Eos enabled = false] STARTED

org.apache.kafka.streams.TopologyTestDriverTest > shouldCreateStateDirectoryForStatefulTopology[Eos enabled = false] PASSED

org.apache.kafka.streams.TopologyTestDriverTest > shouldPunctuateIfWallClockTimeAdvances[Eos enabled = false] STARTED

org.apache.kafka.streams.TopologyTestDriverTest > shouldPunctuateIfWallClockTimeAdvances[Eos enabled = false] PASSED

org.apache.kafka.streams.MockTimeTest > shouldGetNanosAsMillis STARTED

org.apache.kafka.streams.MockTimeTest > shouldGetNanosAsMillis PASSED

org.apache.kafka.streams.MockTimeTest > shouldSetStartTime STARTED

org.apache.kafka.streams.MockTimeTest > shouldSetStartTime PASSED

org.apache.kafka.streams.MockTimeTest > shouldNotAllowNegativeSleep STARTED

org.apache.kafka.streams.MockTimeTest > shouldNotAllowNegativeSleep PASSED

org.apache.kafka.streams.MockTimeTest > shouldAdvanceTimeOnSleep STARTED

org.apache.kafka.streams.MockTimeTest > shouldAdvanceTimeOnSleep PASSED

> Task :streams:upgrade-system-tests-22:processTestResources NO-SOURCE
> Task :streams:upgrade-system-tests-22:testClasses
> Task :streams:upgrade-system-tests-22:checkstyleTest
> Task :streams:upgrade-system-tests-22:spotbugsMain NO-SOURCE
> Task :streams:upgrade-system-tests-22:test
> Task :streams:upgrade-system-tests-23:compileJava NO-SOURCE
> Task :streams:upgrade-system-tests-23:processResources NO-SOURCE
> Task :streams:upgrade-system-tests-23:classes UP-TO-DATE
> Task :streams:upgrade-system-tests-23:checkstyleMain NO-SOURCE
> Task :streams:upgrade-system-tests-23:compileTestJava
> Task :streams:upgrade-system-tests-23:processTestResources NO-SOURCE
> Task :streams:upgrade-system-tests-23:testClasses
> Task :streams:upgrade-system-tests-23:checkstyleTest
> Task :streams:upgrade-system-tests-23:spotbugsMain NO-SOURCE
> Task :streams:upgrade-system-tests-23:test

FAILURE: Build failed with an exception.

* What went wrong:
Execution failed for task ':clients:test'.
> There were failing tests. See the report at: file://<https://builds.apache.org/job/kafka-trunk-jdk11/ws/clients/build/reports/tests/test/index.html>

* Try:
Run with --stacktrace option to get the stack trace. Run with --info or --debug option to get more log output. Run with --scan to get full insights.

* Get more help at https://help.gradle.org

Deprecated Gradle features were used in this build, making it incompatible with Gradle 6.0.
Use '--warning-mode all' to show the individual deprecation warnings.
See https://docs.gradle.org/5.6.2/userguide/command_line_interface.html#sec:command_line_warnings

BUILD FAILED in 3h 11m 39s
184 actionable tasks: 157 executed, 27 up-to-date
Build step 'Execute shell' marked build as failure
Recording test results
ERROR: No tool found matching GRADLE_4_10_2_HOME
Setting GRADLE_4_10_3_HOME=/home/jenkins/tools/gradle/4.10.3
ERROR: No tool found matching GRADLE_4_10_2_HOME
Setting GRADLE_4_10_3_HOME=/home/jenkins/tools/gradle/4.10.3
Not sending mail to unregistered user ismael@juma.me.uk
Not sending mail to unregistered user noreply@github.com

Build failed in Jenkins: kafka-trunk-jdk11 #843

Posted by Apache Jenkins Server <je...@builds.apache.org>.
See <https://builds.apache.org/job/kafka-trunk-jdk11/843/display/redirect?page=changes>

Changes:

[github] MINOR: Update Jackson to 2.10.0 (#7411)


------------------------------------------
[...truncated 1.35 MB...]

org.apache.kafka.message.EntityTypeTest > testVerifyTypeMismatches STARTED

org.apache.kafka.message.EntityTypeTest > testVerifyTypeMismatches PASSED

org.apache.kafka.message.EntityTypeTest > testVerifyTypeMatches STARTED

org.apache.kafka.message.EntityTypeTest > testVerifyTypeMatches PASSED

org.apache.kafka.message.EntityTypeTest > testUnknownEntityType STARTED

org.apache.kafka.message.EntityTypeTest > testUnknownEntityType PASSED

org.apache.kafka.message.StructRegistryTest > testDuplicateCommonStructError STARTED

org.apache.kafka.message.StructRegistryTest > testDuplicateCommonStructError PASSED

org.apache.kafka.message.StructRegistryTest > testReSpecifiedCommonStructError STARTED

org.apache.kafka.message.StructRegistryTest > testReSpecifiedCommonStructError PASSED

org.apache.kafka.message.StructRegistryTest > testCommonStructs STARTED

org.apache.kafka.message.StructRegistryTest > testCommonStructs PASSED

org.apache.kafka.message.MessageGeneratorTest > testToSnakeCase STARTED

org.apache.kafka.message.MessageGeneratorTest > testToSnakeCase PASSED

org.apache.kafka.message.MessageGeneratorTest > testCapitalizeFirst STARTED

org.apache.kafka.message.MessageGeneratorTest > testCapitalizeFirst PASSED

org.apache.kafka.message.MessageGeneratorTest > testLowerCaseFirst STARTED

org.apache.kafka.message.MessageGeneratorTest > testLowerCaseFirst PASSED

org.apache.kafka.message.MessageGeneratorTest > testFirstIsCapitalized STARTED

org.apache.kafka.message.MessageGeneratorTest > testFirstIsCapitalized PASSED

org.apache.kafka.message.MessageGeneratorTest > stripSuffixTest STARTED

org.apache.kafka.message.MessageGeneratorTest > stripSuffixTest PASSED

org.apache.kafka.message.VersionsTest > testIntersections STARTED

org.apache.kafka.message.VersionsTest > testIntersections PASSED

org.apache.kafka.message.VersionsTest > testSubtract STARTED

org.apache.kafka.message.VersionsTest > testSubtract PASSED

org.apache.kafka.message.VersionsTest > testRoundTrips STARTED

org.apache.kafka.message.VersionsTest > testRoundTrips PASSED

org.apache.kafka.message.VersionsTest > testVersionsParse STARTED

org.apache.kafka.message.VersionsTest > testVersionsParse PASSED

org.apache.kafka.message.VersionsTest > testContains STARTED

org.apache.kafka.message.VersionsTest > testContains PASSED

> Task :jmh-benchmarks:test NO-SOURCE

> Task :log4j-appender:test

org.apache.kafka.log4jappender.KafkaLog4jAppenderTest > testLog4jAppendsWithSyncSendWithoutIgnoringExceptionsShouldNotThrowException STARTED

org.apache.kafka.log4jappender.KafkaLog4jAppenderTest > testLog4jAppendsWithSyncSendWithoutIgnoringExceptionsShouldNotThrowException PASSED

org.apache.kafka.log4jappender.KafkaLog4jAppenderTest > testLog4jAppendsWithRealProducerConfigWithSyncSendAndNotIgnoringExceptionsShouldThrowException STARTED

org.apache.kafka.log4jappender.KafkaLog4jAppenderTest > testLog4jAppendsWithRealProducerConfigWithSyncSendAndNotIgnoringExceptionsShouldThrowException PASSED

org.apache.kafka.log4jappender.KafkaLog4jAppenderTest > testLog4jAppends STARTED

org.apache.kafka.log4jappender.KafkaLog4jAppenderTest > testLog4jAppends PASSED

org.apache.kafka.log4jappender.KafkaLog4jAppenderTest > testSetSaslMechanism STARTED

org.apache.kafka.log4jappender.KafkaLog4jAppenderTest > testSetSaslMechanism PASSED

org.apache.kafka.log4jappender.KafkaLog4jAppenderTest > testJaasConfigNotSet STARTED

org.apache.kafka.log4jappender.KafkaLog4jAppenderTest > testJaasConfigNotSet PASSED

org.apache.kafka.log4jappender.KafkaLog4jAppenderTest > testKafkaLog4jConfigs STARTED

org.apache.kafka.log4jappender.KafkaLog4jAppenderTest > testKafkaLog4jConfigs PASSED

org.apache.kafka.log4jappender.KafkaLog4jAppenderTest > testLog4jAppendsWithSyncSendAndSimulateProducerFailShouldThrowException STARTED

> Task :core:spotbugsMain

> Task :log4j-appender:test

org.apache.kafka.log4jappender.KafkaLog4jAppenderTest > testLog4jAppendsWithSyncSendAndSimulateProducerFailShouldThrowException PASSED

org.apache.kafka.log4jappender.KafkaLog4jAppenderTest > testLog4jAppendsWithRealProducerConfigWithSyncSendShouldNotThrowException STARTED

org.apache.kafka.log4jappender.KafkaLog4jAppenderTest > testLog4jAppendsWithRealProducerConfigWithSyncSendShouldNotThrowException PASSED

org.apache.kafka.log4jappender.KafkaLog4jAppenderTest > testSaslMechanismNotSet STARTED

org.apache.kafka.log4jappender.KafkaLog4jAppenderTest > testSaslMechanismNotSet PASSED

org.apache.kafka.log4jappender.KafkaLog4jAppenderTest > testSetJaasConfig STARTED

org.apache.kafka.log4jappender.KafkaLog4jAppenderTest > testSetJaasConfig PASSED

> Task :streams:test-utils:compileJava
> Task :streams:test-utils:processResources NO-SOURCE
> Task :streams:test-utils:classes
> Task :streams:test-utils:copyDependantLibs
> Task :streams:test-utils:jar
> Task :streams:compileTestJava
> Task :streams:processTestResources
> Task :streams:testClasses
FATAL: command execution failed
java.io.IOException
	at hudson.remoting.Channel.close(Channel.java:1449)
	at hudson.remoting.Channel.close(Channel.java:1405)
	at hudson.slaves.SlaveComputer.closeChannel(SlaveComputer.java:847)
	at hudson.slaves.SlaveComputer.kill(SlaveComputer.java:814)
	at hudson.model.AbstractCIBase.killComputer(AbstractCIBase.java:89)
	at jenkins.model.Jenkins.access$2100(Jenkins.java:312)
	at jenkins.model.Jenkins$19.run(Jenkins.java:3464)
	at hudson.model.Queue._withLock(Queue.java:1379)
	at hudson.model.Queue.withLock(Queue.java:1256)
	at jenkins.model.Jenkins._cleanUpDisconnectComputers(Jenkins.java:3458)
	at jenkins.model.Jenkins.cleanUp(Jenkins.java:3336)
	at hudson.WebAppMain.contextDestroyed(WebAppMain.java:379)
	at org.apache.catalina.core.StandardContext.listenerStop(StandardContext.java:4732)
	at org.apache.catalina.core.StandardContext.stopInternal(StandardContext.java:5396)
	at org.apache.catalina.util.LifecycleBase.stop(LifecycleBase.java:257)
	at org.apache.catalina.core.ContainerBase$StopChild.call(ContainerBase.java:1400)
	at org.apache.catalina.core.ContainerBase$StopChild.call(ContainerBase.java:1389)
	at java.util.concurrent.FutureTask.run(FutureTask.java:266)
	at org.apache.tomcat.util.threads.InlineExecutorService.execute(InlineExecutorService.java:75)
	at java.util.concurrent.AbstractExecutorService.submit(AbstractExecutorService.java:134)
	at org.apache.catalina.core.ContainerBase.stopInternal(ContainerBase.java:976)
	at org.apache.catalina.util.LifecycleBase.stop(LifecycleBase.java:257)
	at org.apache.catalina.core.ContainerBase$StopChild.call(ContainerBase.java:1400)
	at org.apache.catalina.core.ContainerBase$StopChild.call(ContainerBase.java:1389)
	at java.util.concurrent.FutureTask.run(FutureTask.java:266)
	at org.apache.tomcat.util.threads.InlineExecutorService.execute(InlineExecutorService.java:75)
	at java.util.concurrent.AbstractExecutorService.submit(AbstractExecutorService.java:134)
	at org.apache.catalina.core.ContainerBase.stopInternal(ContainerBase.java:976)
	at org.apache.catalina.util.LifecycleBase.stop(LifecycleBase.java:257)
	at org.apache.catalina.core.StandardService.stopInternal(StandardService.java:473)
	at org.apache.catalina.util.LifecycleBase.stop(LifecycleBase.java:257)
	at org.apache.catalina.core.StandardServer.stopInternal(StandardServer.java:994)
	at org.apache.catalina.util.LifecycleBase.stop(LifecycleBase.java:257)
	at org.apache.catalina.startup.Catalina.stop(Catalina.java:706)
	at org.apache.catalina.startup.Catalina.start(Catalina.java:668)
	at sun.reflect.NativeMethodAccessorImpl.invoke0(Native Method)
	at sun.reflect.NativeMethodAccessorImpl.invoke(NativeMethodAccessorImpl.java:62)
	at sun.reflect.DelegatingMethodAccessorImpl.invoke(DelegatingMethodAccessorImpl.java:43)
	at java.lang.reflect.Method.invoke(Method.java:498)
	at org.apache.catalina.startup.Bootstrap.start(Bootstrap.java:344)
	at org.apache.catalina.startup.Bootstrap.main(Bootstrap.java:475)
Caused: hudson.remoting.ChannelClosedException: Channel "unknown": Remote call on H32 failed. The channel is closing down or has closed down
	at hudson.remoting.Channel.call(Channel.java:950)
	at hudson.remoting.RemoteInvocationHandler.invoke(RemoteInvocationHandler.java:283)
	at com.sun.proxy.$Proxy144.isAlive(Unknown Source)
	at hudson.Launcher$RemoteLauncher$ProcImpl.isAlive(Launcher.java:1150)
	at hudson.Launcher$RemoteLauncher$ProcImpl.join(Launcher.java:1142)
	at hudson.tasks.CommandInterpreter.join(CommandInterpreter.java:155)
	at hudson.tasks.CommandInterpreter.perform(CommandInterpreter.java:109)
	at hudson.tasks.CommandInterpreter.perform(CommandInterpreter.java:66)
	at hudson.tasks.BuildStepMonitor$1.perform(BuildStepMonitor.java:20)
	at hudson.model.AbstractBuild$AbstractBuildExecution.perform(AbstractBuild.java:741)
	at hudson.model.Build$BuildExecution.build(Build.java:206)
	at hudson.model.Build$BuildExecution.doRun(Build.java:163)
	at hudson.model.AbstractBuild$AbstractBuildExecution.run(AbstractBuild.java:504)
	at hudson.model.Run.execute(Run.java:1815)
	at hudson.model.FreeStyleBuild.run(FreeStyleBuild.java:43)
	at hudson.model.ResourceController.execute(ResourceController.java:97)
	at hudson.model.Executor.run(Executor.java:429)
FATAL: Unable to delete script file /tmp/jenkins60858751317685958.sh
java.io.IOException
	at hudson.remoting.Channel.close(Channel.java:1449)
	at hudson.remoting.Channel.close(Channel.java:1405)
	at hudson.slaves.SlaveComputer.closeChannel(SlaveComputer.java:847)
	at hudson.slaves.SlaveComputer.kill(SlaveComputer.java:814)
	at hudson.model.AbstractCIBase.killComputer(AbstractCIBase.java:89)
	at jenkins.model.Jenkins.access$2100(Jenkins.java:312)
	at jenkins.model.Jenkins$19.run(Jenkins.java:3464)
	at hudson.model.Queue._withLock(Queue.java:1379)
	at hudson.model.Queue.withLock(Queue.java:1256)
	at jenkins.model.Jenkins._cleanUpDisconnectComputers(Jenkins.java:3458)
	at jenkins.model.Jenkins.cleanUp(Jenkins.java:3336)
	at hudson.WebAppMain.contextDestroyed(WebAppMain.java:379)
	at org.apache.catalina.core.StandardContext.listenerStop(StandardContext.java:4732)
	at org.apache.catalina.core.StandardContext.stopInternal(StandardContext.java:5396)
	at org.apache.catalina.util.LifecycleBase.stop(LifecycleBase.java:257)
	at org.apache.catalina.core.ContainerBase$StopChild.call(ContainerBase.java:1400)
	at org.apache.catalina.core.ContainerBase$StopChild.call(ContainerBase.java:1389)
	at java.util.concurrent.FutureTask.run(FutureTask.java:266)
	at org.apache.tomcat.util.threads.InlineExecutorService.execute(InlineExecutorService.java:75)
	at java.util.concurrent.AbstractExecutorService.submit(AbstractExecutorService.java:134)
	at org.apache.catalina.core.ContainerBase.stopInternal(ContainerBase.java:976)
	at org.apache.catalina.util.LifecycleBase.stop(LifecycleBase.java:257)
	at org.apache.catalina.core.ContainerBase$StopChild.call(ContainerBase.java:1400)
	at org.apache.catalina.core.ContainerBase$StopChild.call(ContainerBase.java:1389)
	at java.util.concurrent.FutureTask.run(FutureTask.java:266)
	at org.apache.tomcat.util.threads.InlineExecutorService.execute(InlineExecutorService.java:75)
	at java.util.concurrent.AbstractExecutorService.submit(AbstractExecutorService.java:134)
	at org.apache.catalina.core.ContainerBase.stopInternal(ContainerBase.java:976)
	at org.apache.catalina.util.LifecycleBase.stop(LifecycleBase.java:257)
	at org.apache.catalina.core.StandardService.stopInternal(StandardService.java:473)
	at org.apache.catalina.util.LifecycleBase.stop(LifecycleBase.java:257)
	at org.apache.catalina.core.StandardServer.stopInternal(StandardServer.java:994)
	at org.apache.catalina.util.LifecycleBase.stop(LifecycleBase.java:257)
	at org.apache.catalina.startup.Catalina.stop(Catalina.java:706)
	at org.apache.catalina.startup.Catalina.start(Catalina.java:668)
	at sun.reflect.NativeMethodAccessorImpl.invoke0(Native Method)
	at sun.reflect.NativeMethodAccessorImpl.invoke(NativeMethodAccessorImpl.java:62)
	at sun.reflect.DelegatingMethodAccessorImpl.invoke(DelegatingMethodAccessorImpl.java:43)
	at java.lang.reflect.Method.invoke(Method.java:498)
	at org.apache.catalina.startup.Bootstrap.start(Bootstrap.java:344)
	at org.apache.catalina.startup.Bootstrap.main(Bootstrap.java:475)
Caused: hudson.remoting.ChannelClosedException: Channel "unknown": Remote call on H32 failed. The channel is closing down or has closed down
	at hudson.remoting.Channel.call(Channel.java:950)
	at hudson.FilePath.act(FilePath.java:1072)
	at hudson.FilePath.act(FilePath.java:1061)
	at hudson.FilePath.delete(FilePath.java:1542)
	at hudson.tasks.CommandInterpreter.perform(CommandInterpreter.java:123)
	at hudson.tasks.CommandInterpreter.perform(CommandInterpreter.java:66)
	at hudson.tasks.BuildStepMonitor$1.perform(BuildStepMonitor.java:20)
	at hudson.model.AbstractBuild$AbstractBuildExecution.perform(AbstractBuild.java:741)
	at hudson.model.Build$BuildExecution.build(Build.java:206)
	at hudson.model.Build$BuildExecution.doRun(Build.java:163)
	at hudson.model.AbstractBuild$AbstractBuildExecution.run(AbstractBuild.java:504)
	at hudson.model.Run.execute(Run.java:1815)
	at hudson.model.FreeStyleBuild.run(FreeStyleBuild.java:43)
	at hudson.model.ResourceController.execute(ResourceController.java:97)
	at hudson.model.Executor.run(Executor.java:429)
Build step 'Execute shell' marked build as failure
ERROR: Step ?Publish JUnit test result report? failed: no workspace for kafka-trunk-jdk11 #843
ERROR: H32 is offline; cannot locate JDK 11 (latest)
ERROR: No tool found matching GRADLE_4_10_2_HOME
ERROR: H32 is offline; cannot locate Gradle 4.10.3
Setting GRADLE_4_10_3_HOME=/home/jenkins/tools/gradle/4.10.3
Not sending mail to unregistered user noreply@github.com
Not sending mail to unregistered user ismael@juma.me.uk

Build failed in Jenkins: kafka-trunk-jdk11 #842

Posted by Apache Jenkins Server <je...@builds.apache.org>.
See <https://builds.apache.org/job/kafka-trunk-jdk11/842/display/redirect?page=changes>

Changes:

[github] KAFKA-8471: Replace control requests/responses with automated protocol

[github] MINOR: Add missing `+` in LogSegment.toString (#7408)

------------------------------------------
[...truncated 2.64 MB...]
org.apache.kafka.streams.test.OutputVerifierTest > shouldFailIfValueIsDifferentWithNullReverseForCompareValueTimestampWithProducerRecord PASSED

> Task :streams:streams-scala:test

org.apache.kafka.streams.scala.StreamToTableJoinScalaIntegrationTestImplicitSerdes > testShouldCountClicksPerRegionWithNamedRepartitionTopic STARTED

org.apache.kafka.streams.scala.StreamToTableJoinScalaIntegrationTestImplicitSerdes > testShouldCountClicksPerRegionWithNamedRepartitionTopic PASSED

org.apache.kafka.streams.scala.StreamToTableJoinScalaIntegrationTestImplicitSerdes > testShouldCountClicksPerRegionJava STARTED

org.apache.kafka.streams.scala.StreamToTableJoinScalaIntegrationTestImplicitSerdes > testShouldCountClicksPerRegionJava PASSED

org.apache.kafka.streams.scala.StreamToTableJoinScalaIntegrationTestImplicitSerdes > testShouldCountClicksPerRegion STARTED

org.apache.kafka.streams.scala.StreamToTableJoinScalaIntegrationTestImplicitSerdes > testShouldCountClicksPerRegion PASSED

org.apache.kafka.streams.scala.kstream.SuppressedTest > Suppressed.untilWindowCloses should produce the correct suppression STARTED

org.apache.kafka.streams.scala.kstream.SuppressedTest > Suppressed.untilWindowCloses should produce the correct suppression PASSED

org.apache.kafka.streams.scala.kstream.SuppressedTest > Suppressed.untilTimeLimit should produce the correct suppression STARTED

org.apache.kafka.streams.scala.kstream.SuppressedTest > Suppressed.untilTimeLimit should produce the correct suppression PASSED

org.apache.kafka.streams.scala.kstream.SuppressedTest > BufferConfig.maxRecords should produce the correct buffer config STARTED

org.apache.kafka.streams.scala.kstream.SuppressedTest > BufferConfig.maxRecords should produce the correct buffer config PASSED

org.apache.kafka.streams.scala.kstream.SuppressedTest > BufferConfig.maxBytes should produce the correct buffer config STARTED

org.apache.kafka.streams.scala.kstream.SuppressedTest > BufferConfig.maxBytes should produce the correct buffer config PASSED

org.apache.kafka.streams.scala.kstream.SuppressedTest > BufferConfig.unbounded should produce the correct buffer config STARTED

org.apache.kafka.streams.scala.kstream.SuppressedTest > BufferConfig.unbounded should produce the correct buffer config PASSED

org.apache.kafka.streams.scala.kstream.SuppressedTest > BufferConfig should support very long chains of factory methods STARTED

org.apache.kafka.streams.scala.kstream.SuppressedTest > BufferConfig should support very long chains of factory methods PASSED

org.apache.kafka.streams.scala.kstream.ConsumedTest > Create a Consumed should create a Consumed with Serdes STARTED

org.apache.kafka.streams.scala.kstream.ConsumedTest > Create a Consumed should create a Consumed with Serdes PASSED

org.apache.kafka.streams.scala.kstream.ConsumedTest > Create a Consumed with timestampExtractor and resetPolicy should create a Consumed with Serdes, timestampExtractor and resetPolicy STARTED

org.apache.kafka.streams.scala.kstream.ConsumedTest > Create a Consumed with timestampExtractor and resetPolicy should create a Consumed with Serdes, timestampExtractor and resetPolicy PASSED

org.apache.kafka.streams.scala.kstream.ConsumedTest > Create a Consumed with timestampExtractor should create a Consumed with Serdes and timestampExtractor STARTED

org.apache.kafka.streams.scala.kstream.ConsumedTest > Create a Consumed with timestampExtractor should create a Consumed with Serdes and timestampExtractor PASSED

org.apache.kafka.streams.scala.kstream.ConsumedTest > Create a Consumed with resetPolicy should create a Consumed with Serdes and resetPolicy STARTED

org.apache.kafka.streams.scala.kstream.ConsumedTest > Create a Consumed with resetPolicy should create a Consumed with Serdes and resetPolicy PASSED

org.apache.kafka.streams.scala.kstream.ProducedTest > Create a Produced should create a Produced with Serdes STARTED

org.apache.kafka.streams.scala.kstream.ProducedTest > Create a Produced should create a Produced with Serdes PASSED

org.apache.kafka.streams.scala.kstream.ProducedTest > Create a Produced with timestampExtractor and resetPolicy should create a Consumed with Serdes, timestampExtractor and resetPolicy STARTED

org.apache.kafka.streams.scala.kstream.ProducedTest > Create a Produced with timestampExtractor and resetPolicy should create a Consumed with Serdes, timestampExtractor and resetPolicy PASSED

org.apache.kafka.streams.scala.kstream.GroupedTest > Create a Grouped should create a Grouped with Serdes STARTED

org.apache.kafka.streams.scala.kstream.GroupedTest > Create a Grouped should create a Grouped with Serdes PASSED

org.apache.kafka.streams.scala.kstream.GroupedTest > Create a Grouped with repartition topic name should create a Grouped with Serdes, and repartition topic name STARTED

org.apache.kafka.streams.scala.kstream.GroupedTest > Create a Grouped with repartition topic name should create a Grouped with Serdes, and repartition topic name PASSED

org.apache.kafka.streams.scala.kstream.JoinedTest > Create a Joined should create a Joined with Serdes STARTED

org.apache.kafka.streams.scala.kstream.JoinedTest > Create a Joined should create a Joined with Serdes PASSED

org.apache.kafka.streams.scala.kstream.JoinedTest > Create a Joined should create a Joined with Serdes and repartition topic name STARTED

org.apache.kafka.streams.scala.kstream.JoinedTest > Create a Joined should create a Joined with Serdes and repartition topic name PASSED

org.apache.kafka.streams.scala.kstream.KTableTest > filter a KTable should filter records satisfying the predicate STARTED

org.apache.kafka.streams.scala.kstream.KTableTest > filter a KTable should filter records satisfying the predicate PASSED

org.apache.kafka.streams.scala.kstream.KTableTest > filterNot a KTable should filter records not satisfying the predicate STARTED

org.apache.kafka.streams.scala.kstream.KTableTest > filterNot a KTable should filter records not satisfying the predicate PASSED

org.apache.kafka.streams.scala.kstream.KTableTest > join 2 KTables should join correctly records STARTED

org.apache.kafka.streams.scala.kstream.KTableTest > join 2 KTables should join correctly records PASSED

org.apache.kafka.streams.scala.kstream.KTableTest > join 2 KTables with a Materialized should join correctly records and state store STARTED

org.apache.kafka.streams.scala.kstream.KTableTest > join 2 KTables with a Materialized should join correctly records and state store PASSED

org.apache.kafka.streams.scala.kstream.KTableTest > windowed KTable#suppress should correctly suppress results using Suppressed.untilTimeLimit STARTED

org.apache.kafka.streams.scala.kstream.KTableTest > windowed KTable#suppress should correctly suppress results using Suppressed.untilTimeLimit PASSED

org.apache.kafka.streams.scala.kstream.KTableTest > windowed KTable#suppress should correctly suppress results using Suppressed.untilWindowCloses STARTED

org.apache.kafka.streams.scala.kstream.KTableTest > windowed KTable#suppress should correctly suppress results using Suppressed.untilWindowCloses PASSED

org.apache.kafka.streams.scala.kstream.KTableTest > session windowed KTable#suppress should correctly suppress results using Suppressed.untilWindowCloses STARTED

org.apache.kafka.streams.scala.kstream.KTableTest > session windowed KTable#suppress should correctly suppress results using Suppressed.untilWindowCloses PASSED

org.apache.kafka.streams.scala.kstream.KTableTest > non-windowed KTable#suppress should correctly suppress results using Suppressed.untilTimeLimit STARTED

org.apache.kafka.streams.scala.kstream.KTableTest > non-windowed KTable#suppress should correctly suppress results using Suppressed.untilTimeLimit PASSED

org.apache.kafka.streams.scala.kstream.MaterializedTest > Create a Materialized should create a Materialized with Serdes STARTED

org.apache.kafka.streams.scala.kstream.MaterializedTest > Create a Materialized should create a Materialized with Serdes PASSED

org.apache.kafka.streams.scala.kstream.MaterializedTest > Create a Materialize with a store name should create a Materialized with Serdes and a store name STARTED

org.apache.kafka.streams.scala.kstream.MaterializedTest > Create a Materialize with a store name should create a Materialized with Serdes and a store name PASSED

org.apache.kafka.streams.scala.kstream.MaterializedTest > Create a Materialize with a window store supplier should create a Materialized with Serdes and a store supplier STARTED

org.apache.kafka.streams.scala.kstream.MaterializedTest > Create a Materialize with a window store supplier should create a Materialized with Serdes and a store supplier PASSED

org.apache.kafka.streams.scala.kstream.MaterializedTest > Create a Materialize with a key value store supplier should create a Materialized with Serdes and a store supplier STARTED

org.apache.kafka.streams.scala.kstream.MaterializedTest > Create a Materialize with a key value store supplier should create a Materialized with Serdes and a store supplier PASSED

org.apache.kafka.streams.scala.kstream.MaterializedTest > Create a Materialize with a session store supplier should create a Materialized with Serdes and a store supplier STARTED

org.apache.kafka.streams.scala.kstream.MaterializedTest > Create a Materialize with a session store supplier should create a Materialized with Serdes and a store supplier PASSED

org.apache.kafka.streams.scala.kstream.KStreamTest > filter a KStream should filter records satisfying the predicate STARTED

org.apache.kafka.streams.scala.kstream.KStreamTest > filter a KStream should filter records satisfying the predicate PASSED

org.apache.kafka.streams.scala.kstream.KStreamTest > filterNot a KStream should filter records not satisfying the predicate STARTED

org.apache.kafka.streams.scala.kstream.KStreamTest > filterNot a KStream should filter records not satisfying the predicate PASSED

org.apache.kafka.streams.scala.kstream.KStreamTest > foreach a KStream should run foreach actions on records STARTED

org.apache.kafka.streams.scala.kstream.KStreamTest > foreach a KStream should run foreach actions on records PASSED

org.apache.kafka.streams.scala.kstream.KStreamTest > peek a KStream should run peek actions on records STARTED

org.apache.kafka.streams.scala.kstream.KStreamTest > peek a KStream should run peek actions on records PASSED

org.apache.kafka.streams.scala.kstream.KStreamTest > selectKey a KStream should select a new key STARTED

org.apache.kafka.streams.scala.kstream.KStreamTest > selectKey a KStream should select a new key PASSED

org.apache.kafka.streams.scala.kstream.KStreamTest > join 2 KStreams should join correctly records STARTED

org.apache.kafka.streams.scala.kstream.KStreamTest > join 2 KStreams should join correctly records PASSED

org.apache.kafka.streams.scala.WordCountTest > testShouldCountWordsMaterialized STARTED

org.apache.kafka.streams.scala.WordCountTest > testShouldCountWordsMaterialized PASSED

org.apache.kafka.streams.scala.WordCountTest > testShouldCountWordsJava STARTED

org.apache.kafka.streams.scala.WordCountTest > testShouldCountWordsJava PASSED

org.apache.kafka.streams.scala.WordCountTest > testShouldCountWords STARTED

org.apache.kafka.streams.scala.WordCountTest > testShouldCountWords PASSED

org.apache.kafka.streams.scala.TopologyTest > shouldBuildIdenticalTopologyInJavaNScalaJoin STARTED

org.apache.kafka.streams.scala.TopologyTest > shouldBuildIdenticalTopologyInJavaNScalaJoin PASSED

org.apache.kafka.streams.scala.TopologyTest > shouldBuildIdenticalTopologyInJavaNScalaSimple STARTED

org.apache.kafka.streams.scala.TopologyTest > shouldBuildIdenticalTopologyInJavaNScalaSimple PASSED

org.apache.kafka.streams.scala.TopologyTest > shouldBuildIdenticalTopologyInJavaNScalaAggregate STARTED

org.apache.kafka.streams.scala.TopologyTest > shouldBuildIdenticalTopologyInJavaNScalaAggregate PASSED

org.apache.kafka.streams.scala.TopologyTest > shouldBuildIdenticalTopologyInJavaNScalaProperties STARTED

org.apache.kafka.streams.scala.TopologyTest > shouldBuildIdenticalTopologyInJavaNScalaProperties PASSED

org.apache.kafka.streams.scala.TopologyTest > shouldBuildIdenticalTopologyInJavaNScalaTransform STARTED

org.apache.kafka.streams.scala.TopologyTest > shouldBuildIdenticalTopologyInJavaNScalaTransform PASSED

> Task :streams:upgrade-system-tests-20:processTestResources NO-SOURCE
> Task :streams:upgrade-system-tests-20:testClasses
> Task :streams:upgrade-system-tests-20:checkstyleTest
> Task :streams:upgrade-system-tests-20:spotbugsMain NO-SOURCE
> Task :streams:upgrade-system-tests-20:test
> Task :streams:upgrade-system-tests-21:compileJava NO-SOURCE
> Task :streams:upgrade-system-tests-21:processResources NO-SOURCE
> Task :streams:upgrade-system-tests-21:classes UP-TO-DATE
> Task :streams:upgrade-system-tests-21:checkstyleMain NO-SOURCE
> Task :streams:upgrade-system-tests-21:compileTestJava
> Task :streams:upgrade-system-tests-21:processTestResources NO-SOURCE
> Task :streams:upgrade-system-tests-21:testClasses
> Task :streams:upgrade-system-tests-21:checkstyleTest
> Task :streams:upgrade-system-tests-21:spotbugsMain NO-SOURCE
> Task :streams:upgrade-system-tests-21:test
> Task :streams:upgrade-system-tests-22:compileJava NO-SOURCE
> Task :streams:upgrade-system-tests-22:processResources NO-SOURCE
> Task :streams:upgrade-system-tests-22:classes UP-TO-DATE
> Task :streams:upgrade-system-tests-22:checkstyleMain NO-SOURCE
> Task :streams:upgrade-system-tests-22:compileTestJava
> Task :streams:upgrade-system-tests-22:processTestResources NO-SOURCE
> Task :streams:upgrade-system-tests-22:testClasses
> Task :streams:upgrade-system-tests-22:checkstyleTest
> Task :streams:upgrade-system-tests-22:spotbugsMain NO-SOURCE
> Task :streams:upgrade-system-tests-22:test
> Task :streams:upgrade-system-tests-23:compileJava NO-SOURCE
> Task :streams:upgrade-system-tests-23:processResources NO-SOURCE
> Task :streams:upgrade-system-tests-23:classes UP-TO-DATE
> Task :streams:upgrade-system-tests-23:checkstyleMain NO-SOURCE
> Task :streams:upgrade-system-tests-23:compileTestJava
> Task :streams:upgrade-system-tests-23:processTestResources NO-SOURCE
> Task :streams:upgrade-system-tests-23:testClasses
> Task :streams:upgrade-system-tests-23:checkstyleTest
> Task :streams:upgrade-system-tests-23:spotbugsMain NO-SOURCE
> Task :streams:upgrade-system-tests-23:test

FAILURE: Build failed with an exception.

* What went wrong:
Execution failed for task ':core:test'.
> There were failing tests. See the report at: file://<https://builds.apache.org/job/kafka-trunk-jdk11/ws/core/build/reports/tests/test/index.html>

* Try:
Run with --stacktrace option to get the stack trace. Run with --info or --debug option to get more log output. Run with --scan to get full insights.

* Get more help at https://help.gradle.org

Deprecated Gradle features were used in this build, making it incompatible with Gradle 6.0.
Use '--warning-mode all' to show the individual deprecation warnings.
See https://docs.gradle.org/5.6.2/userguide/command_line_interface.html#sec:command_line_warnings

BUILD FAILED in 3h 12m 57s
184 actionable tasks: 157 executed, 27 up-to-date
Build step 'Execute shell' marked build as failure
Recording test results
ERROR: No tool found matching GRADLE_4_10_2_HOME
Setting GRADLE_4_10_3_HOME=/home/jenkins/tools/gradle/4.10.3
ERROR: No tool found matching GRADLE_4_10_2_HOME
Setting GRADLE_4_10_3_HOME=/home/jenkins/tools/gradle/4.10.3
Not sending mail to unregistered user noreply@github.com
Not sending mail to unregistered user ismael@juma.me.uk