You are viewing a plain text version of this content. The canonical link for it is here.
Posted to dev@kafka.apache.org by Apache Jenkins Server <je...@builds.apache.org> on 2018/08/04 02:22:12 UTC
Build failed in Jenkins: kafka-trunk-jdk8 #2860
See <https://builds.apache.org/job/kafka-trunk-jdk8/2860/display/redirect?page=changes>
Changes:
[mjsax] MINOR: Require final variables in Streams (#5452)
------------------------------------------
[...truncated 2.47 MB...]
org.apache.kafka.streams.TopologyTest > multipleSourcesWithProcessorsShouldHaveDistinctSubtopologies STARTED
org.apache.kafka.streams.TopologyTest > multipleSourcesWithProcessorsShouldHaveDistinctSubtopologies PASSED
org.apache.kafka.streams.TopologyTest > shouldThrowOnUnassignedStateStoreAccess STARTED
org.apache.kafka.streams.TopologyTest > shouldThrowOnUnassignedStateStoreAccess PASSED
org.apache.kafka.streams.TopologyTest > shouldNotAllowNullProcessorNameWhenConnectingProcessorAndStateStores STARTED
org.apache.kafka.streams.TopologyTest > shouldNotAllowNullProcessorNameWhenConnectingProcessorAndStateStores PASSED
org.apache.kafka.streams.TopologyTest > kTableAnonymousMaterializedMapValuesShouldPreserveTopologyStructure STARTED
org.apache.kafka.streams.TopologyTest > kTableAnonymousMaterializedMapValuesShouldPreserveTopologyStructure PASSED
org.apache.kafka.streams.TopologyTest > sessionWindowZeroArgCountShouldPreserveTopologyStructure STARTED
org.apache.kafka.streams.TopologyTest > sessionWindowZeroArgCountShouldPreserveTopologyStructure PASSED
org.apache.kafka.streams.TopologyTest > tableAnonymousMaterializedCountShouldPreserveTopologyStructure STARTED
org.apache.kafka.streams.TopologyTest > tableAnonymousMaterializedCountShouldPreserveTopologyStructure PASSED
org.apache.kafka.streams.TopologyTest > shouldDescribeGlobalStoreTopology STARTED
org.apache.kafka.streams.TopologyTest > shouldDescribeGlobalStoreTopology PASSED
org.apache.kafka.streams.TopologyTest > kTableNonMaterializedMapValuesShouldPreserveTopologyStructure STARTED
org.apache.kafka.streams.TopologyTest > kTableNonMaterializedMapValuesShouldPreserveTopologyStructure PASSED
org.apache.kafka.streams.TopologyTest > kGroupedStreamAnonymousMaterializedCountShouldPreserveTopologyStructure STARTED
org.apache.kafka.streams.TopologyTest > kGroupedStreamAnonymousMaterializedCountShouldPreserveTopologyStructure PASSED
org.apache.kafka.streams.TopologyTest > shouldDescribeMultipleGlobalStoreTopology STARTED
org.apache.kafka.streams.TopologyTest > shouldDescribeMultipleGlobalStoreTopology PASSED
org.apache.kafka.streams.TopologyTest > shouldNotAllowToAddSinkWithSameName STARTED
org.apache.kafka.streams.TopologyTest > shouldNotAllowToAddSinkWithSameName PASSED
org.apache.kafka.streams.TopologyTest > shouldNotAllowToAddSinkWithNullParents STARTED
org.apache.kafka.streams.TopologyTest > shouldNotAllowToAddSinkWithNullParents PASSED
org.apache.kafka.streams.TopologyTest > shouldNotAllowNullProcessorSupplierWhenAddingProcessor STARTED
org.apache.kafka.streams.TopologyTest > shouldNotAllowNullProcessorSupplierWhenAddingProcessor PASSED
org.apache.kafka.streams.TopologyTest > timeWindowAnonymousMaterializedCountShouldPreserveTopologyStructure STARTED
org.apache.kafka.streams.TopologyTest > timeWindowAnonymousMaterializedCountShouldPreserveTopologyStructure PASSED
org.apache.kafka.streams.TopologyTest > shouldFailIfSinkIsParent STARTED
org.apache.kafka.streams.TopologyTest > shouldFailIfSinkIsParent PASSED
org.apache.kafka.streams.TopologyTest > shouldNotAllowToAddSourcesWithSameName STARTED
org.apache.kafka.streams.TopologyTest > shouldNotAllowToAddSourcesWithSameName PASSED
org.apache.kafka.streams.TopologyTest > sourceAndProcessorWithMultipleStatesShouldHaveSingleSubtopology STARTED
org.apache.kafka.streams.TopologyTest > sourceAndProcessorWithMultipleStatesShouldHaveSingleSubtopology PASSED
org.apache.kafka.streams.TopologyTest > shouldDescribeEmptyTopology STARTED
org.apache.kafka.streams.TopologyTest > shouldDescribeEmptyTopology PASSED
org.apache.kafka.streams.TopologyTest > shouldFailIfSinkIsItsOwnParent STARTED
org.apache.kafka.streams.TopologyTest > shouldFailIfSinkIsItsOwnParent PASSED
org.apache.kafka.streams.TopologyTest > testPatternMatchesAlreadyProvidedTopicSource STARTED
org.apache.kafka.streams.TopologyTest > testPatternMatchesAlreadyProvidedTopicSource PASSED
org.apache.kafka.streams.TopologyTest > singleSourcePatternShouldHaveSingleSubtopology STARTED
org.apache.kafka.streams.TopologyTest > singleSourcePatternShouldHaveSingleSubtopology PASSED
org.apache.kafka.streams.TopologyTest > kTableNonMaterializedFilterShouldPreserveTopologyStructure STARTED
org.apache.kafka.streams.TopologyTest > kTableNonMaterializedFilterShouldPreserveTopologyStructure PASSED
org.apache.kafka.streams.TopologyTest > singleSourceShouldHaveSingleSubtopology STARTED
org.apache.kafka.streams.TopologyTest > singleSourceShouldHaveSingleSubtopology PASSED
org.apache.kafka.streams.TopologyTest > shouldNotAllowNullTopicChooserWhenAddingSink STARTED
org.apache.kafka.streams.TopologyTest > shouldNotAllowNullTopicChooserWhenAddingSink PASSED
org.apache.kafka.streams.TopologyTest > processorsWithSameSinkShouldHaveSameSubtopology STARTED
org.apache.kafka.streams.TopologyTest > processorsWithSameSinkShouldHaveSameSubtopology PASSED
org.apache.kafka.streams.TopologyTest > shouldNotAllowNullTopicsWhenAddingSoureWithTopic STARTED
org.apache.kafka.streams.TopologyTest > shouldNotAllowNullTopicsWhenAddingSoureWithTopic PASSED
org.apache.kafka.streams.TopologyTest > shouldFailWithUnknownParent STARTED
org.apache.kafka.streams.TopologyTest > shouldFailWithUnknownParent PASSED
org.apache.kafka.streams.TopologyTest > kTableAnonymousMaterializedFilterShouldPreserveTopologyStructure STARTED
org.apache.kafka.streams.TopologyTest > kTableAnonymousMaterializedFilterShouldPreserveTopologyStructure PASSED
org.apache.kafka.streams.TopologyTest > shouldNotAllowToAddProcessorWithEmptyParents STARTED
org.apache.kafka.streams.TopologyTest > shouldNotAllowToAddProcessorWithEmptyParents PASSED
org.apache.kafka.streams.TopologyTest > sessionWindowAnonymousMaterializedCountShouldPreserveTopologyStructure STARTED
org.apache.kafka.streams.TopologyTest > sessionWindowAnonymousMaterializedCountShouldPreserveTopologyStructure PASSED
org.apache.kafka.streams.TopologyTest > shouldFailIfNodeIsItsOwnParent STARTED
org.apache.kafka.streams.TopologyTest > shouldFailIfNodeIsItsOwnParent PASSED
org.apache.kafka.streams.TopologyTest > shouldNotAllowToAddStateStoreToSource STARTED
org.apache.kafka.streams.TopologyTest > shouldNotAllowToAddStateStoreToSource PASSED
org.apache.kafka.streams.TopologyTest > shouldNotAllowNullNameWhenAddingProcessor STARTED
org.apache.kafka.streams.TopologyTest > shouldNotAllowNullNameWhenAddingProcessor PASSED
org.apache.kafka.streams.TopologyTest > shouldNotAllowToAddStoreWithSameName STARTED
org.apache.kafka.streams.TopologyTest > shouldNotAllowToAddStoreWithSameName PASSED
org.apache.kafka.streams.TopologyTest > shouldNotAllowToAddProcessorWithNullParents STARTED
org.apache.kafka.streams.TopologyTest > shouldNotAllowToAddProcessorWithNullParents PASSED
org.apache.kafka.streams.TopologyTest > shouldNotAllowNullNameWhenAddingSourceWithPattern STARTED
org.apache.kafka.streams.TopologyTest > shouldNotAllowNullNameWhenAddingSourceWithPattern PASSED
org.apache.kafka.streams.TopologyTest > multipleSourcesWithSinksShouldHaveDistinctSubtopologies STARTED
org.apache.kafka.streams.TopologyTest > multipleSourcesWithSinksShouldHaveDistinctSubtopologies PASSED
org.apache.kafka.streams.TopologyTest > kGroupedStreamZeroArgCountShouldPreserveTopologyStructure STARTED
org.apache.kafka.streams.TopologyTest > kGroupedStreamZeroArgCountShouldPreserveTopologyStructure PASSED
org.apache.kafka.streams.TopologyTest > sessionWindowNamedMaterializedCountShouldPreserveTopologyStructure STARTED
org.apache.kafka.streams.TopologyTest > sessionWindowNamedMaterializedCountShouldPreserveTopologyStructure PASSED
org.apache.kafka.streams.tools.StreamsResetterTest > testShiftOffsetByWhenBetweenBeginningAndEndOffset STARTED
org.apache.kafka.streams.tools.StreamsResetterTest > testShiftOffsetByWhenBetweenBeginningAndEndOffset PASSED
org.apache.kafka.streams.tools.StreamsResetterTest > testResetToSpecificOffsetWhenAfterEndOffset STARTED
org.apache.kafka.streams.tools.StreamsResetterTest > testResetToSpecificOffsetWhenAfterEndOffset PASSED
org.apache.kafka.streams.tools.StreamsResetterTest > shouldAcceptValidDateFormats STARTED
org.apache.kafka.streams.tools.StreamsResetterTest > shouldAcceptValidDateFormats PASSED
org.apache.kafka.streams.tools.StreamsResetterTest > shouldDeleteTopic STARTED
org.apache.kafka.streams.tools.StreamsResetterTest > shouldDeleteTopic PASSED
org.apache.kafka.streams.tools.StreamsResetterTest > testResetToSpecificOffsetWhenBetweenBeginningAndEndOffset STARTED
org.apache.kafka.streams.tools.StreamsResetterTest > testResetToSpecificOffsetWhenBetweenBeginningAndEndOffset PASSED
org.apache.kafka.streams.tools.StreamsResetterTest > testShiftOffsetByWhenAfterEndOffset STARTED
org.apache.kafka.streams.tools.StreamsResetterTest > testShiftOffsetByWhenAfterEndOffset PASSED
org.apache.kafka.streams.tools.StreamsResetterTest > testResetToSpecificOffsetWhenBeforeBeginningOffset STARTED
org.apache.kafka.streams.tools.StreamsResetterTest > testResetToSpecificOffsetWhenBeforeBeginningOffset PASSED
org.apache.kafka.streams.tools.StreamsResetterTest > shouldSeekToEndOffset STARTED
org.apache.kafka.streams.tools.StreamsResetterTest > shouldSeekToEndOffset PASSED
org.apache.kafka.streams.tools.StreamsResetterTest > testResetUsingPlanWhenBetweenBeginningAndEndOffset STARTED
org.apache.kafka.streams.tools.StreamsResetterTest > testResetUsingPlanWhenBetweenBeginningAndEndOffset PASSED
org.apache.kafka.streams.tools.StreamsResetterTest > testResetUsingPlanWhenBeforeBeginningOffset STARTED
org.apache.kafka.streams.tools.StreamsResetterTest > testResetUsingPlanWhenBeforeBeginningOffset PASSED
org.apache.kafka.streams.tools.StreamsResetterTest > shouldThrowOnInvalidDateFormat STARTED
org.apache.kafka.streams.tools.StreamsResetterTest > shouldThrowOnInvalidDateFormat PASSED
org.apache.kafka.streams.tools.StreamsResetterTest > testResetUsingPlanWhenAfterEndOffset STARTED
org.apache.kafka.streams.tools.StreamsResetterTest > testResetUsingPlanWhenAfterEndOffset PASSED
org.apache.kafka.streams.tools.StreamsResetterTest > testShiftOffsetByWhenBeforeBeginningOffset STARTED
org.apache.kafka.streams.tools.StreamsResetterTest > testShiftOffsetByWhenBeforeBeginningOffset PASSED
org.apache.kafka.streams.KeyValueTest > shouldHaveSaneEqualsAndHashCode STARTED
org.apache.kafka.streams.KeyValueTest > shouldHaveSaneEqualsAndHashCode PASSED
1907 tests completed, 1 failed
> Task :streams:test FAILED
FAILURE: Build failed with an exception.
* What went wrong:
Execution failed for task ':streams:test'.
> There were failing tests. See the report at: file://<https://builds.apache.org/job/kafka-trunk-jdk8/ws/streams/build/reports/tests/test/index.html>
* Try:
Run with --stacktrace option to get the stack trace. Run with --info or --debug option to get more log output. Run with --scan to get full insights.
* Get more help at https://help.gradle.org
BUILD FAILED in 4h 4m 21s
68 actionable tasks: 37 executed, 31 up-to-date
Build step 'Execute shell' marked build as failure
[FINDBUGS] Collecting findbugs analysis files...
Setting GRADLE_4_8_1_HOME=/home/jenkins/tools/gradle/4.8.1
[FINDBUGS] Searching for all files in <https://builds.apache.org/job/kafka-trunk-jdk8/ws/> that match the pattern **/build/reports/findbugs/*.xml
[FINDBUGS] Parsing 6 files in <https://builds.apache.org/job/kafka-trunk-jdk8/ws/>
[FINDBUGS] Successfully parsed file <https://builds.apache.org/job/kafka-trunk-jdk8/ws/clients/build/reports/findbugs/main.xml> with 0 unique warnings and 0 duplicates.
[FINDBUGS] Successfully parsed file <https://builds.apache.org/job/kafka-trunk-jdk8/ws/core/build/reports/findbugs/main.xml> with 0 unique warnings and 0 duplicates.
[FINDBUGS] Successfully parsed file <https://builds.apache.org/job/kafka-trunk-jdk8/ws/examples/build/reports/findbugs/main.xml> with 0 unique warnings and 0 duplicates.
[FINDBUGS] Successfully parsed file <https://builds.apache.org/job/kafka-trunk-jdk8/ws/log4j-appender/build/reports/findbugs/main.xml> with 0 unique warnings and 0 duplicates.
[FINDBUGS] Successfully parsed file <https://builds.apache.org/job/kafka-trunk-jdk8/ws/streams/build/reports/findbugs/main.xml> with 0 unique warnings and 0 duplicates.
[FINDBUGS] Successfully parsed file <https://builds.apache.org/job/kafka-trunk-jdk8/ws/streams/streams-scala/build/reports/findbugs/main.xml> with 0 unique warnings and 0 duplicates.
Setting GRADLE_4_8_1_HOME=/home/jenkins/tools/gradle/4.8.1
Setting GRADLE_4_8_1_HOME=/home/jenkins/tools/gradle/4.8.1
<Git Blamer> Using GitBlamer to create author and commit information for all warnings.
<Git Blamer> GIT_COMMIT=3637b2c374d48e99e0a7be37605d3c79f2661007, workspace=<https://builds.apache.org/job/kafka-trunk-jdk8/ws/>
[FINDBUGS] Computing warning deltas based on reference build #2859
Recording test results
Setting GRADLE_4_8_1_HOME=/home/jenkins/tools/gradle/4.8.1
Setting GRADLE_4_8_1_HOME=/home/jenkins/tools/gradle/4.8.1
Build failed in Jenkins: kafka-trunk-jdk8 #2868
Posted by Apache Jenkins Server <je...@builds.apache.org>.
See <https://builds.apache.org/job/kafka-trunk-jdk8/2868/display/redirect>
------------------------------------------
Started by an SCM change
[EnvInject] - Loading node environment variables.
Building remotely on H32 (ubuntu xenial) in workspace <https://builds.apache.org/job/kafka-trunk-jdk8/ws/>
> git rev-parse --is-inside-work-tree # timeout=10
Fetching changes from the remote Git repository
> git config remote.origin.url https://github.com/apache/kafka.git # timeout=10
Fetching upstream changes from https://github.com/apache/kafka.git
> git --version # timeout=10
> git fetch --tags --progress https://github.com/apache/kafka.git +refs/heads/*:refs/remotes/origin/*
ERROR: Error fetching remote repo 'origin'
hudson.plugins.git.GitException: Failed to fetch from https://github.com/apache/kafka.git
at hudson.plugins.git.GitSCM.fetchFrom(GitSCM.java:888)
at hudson.plugins.git.GitSCM.retrieveChanges(GitSCM.java:1155)
at hudson.plugins.git.GitSCM.checkout(GitSCM.java:1186)
at hudson.scm.SCM.checkout(SCM.java:504)
at hudson.model.AbstractProject.checkout(AbstractProject.java:1208)
at hudson.model.AbstractBuild$AbstractBuildExecution.defaultCheckout(AbstractBuild.java:574)
at jenkins.scm.SCMCheckoutStrategy.checkout(SCMCheckoutStrategy.java:86)
at hudson.model.AbstractBuild$AbstractBuildExecution.run(AbstractBuild.java:499)
at hudson.model.Run.execute(Run.java:1794)
at hudson.model.FreeStyleBuild.run(FreeStyleBuild.java:43)
at hudson.model.ResourceController.execute(ResourceController.java:97)
at hudson.model.Executor.run(Executor.java:429)
Caused by: hudson.plugins.git.GitException: Command "git fetch --tags --progress https://github.com/apache/kafka.git +refs/heads/*:refs/remotes/origin/*" returned status code 128:
stdout:
stderr: error: Could not read 0f3affc0f40751dc8fd064b36b6e859728f63e37
error: Could not read 95fbb2e03f4fe79737c71632e0ef2dfdcfb85a69
error: Could not read 08c465028d057ac23cdfe6d57641fe40240359dd
remote: Counting objects: 7310, done.
remote: Compressing objects: 2% (1/45) remote: Compressing objects: 4% (2/45) remote: Compressing objects: 6% (3/45) remote: Compressing objects: 8% (4/45) remote: Compressing objects: 11% (5/45) remote: Compressing objects: 13% (6/45) remote: Compressing objects: 15% (7/45) remote: Compressing objects: 17% (8/45) remote: Compressing objects: 20% (9/45) remote: Compressing objects: 22% (10/45) remote: Compressing objects: 24% (11/45) remote: Compressing objects: 26% (12/45) remote: Compressing objects: 28% (13/45) remote: Compressing objects: 31% (14/45) remote: Compressing objects: 33% (15/45) remote: Compressing objects: 35% (16/45) remote: Compressing objects: 37% (17/45) remote: Compressing objects: 40% (18/45) remote: Compressing objects: 42% (19/45) remote: Compressing objects: 44% (20/45) remote: Compressing objects: 46% (21/45) remote: Compressing objects: 48% (22/45) remote: Compressing objects: 51% (23/45) remote: Compressing objects: 53% (24/45) remote: Compressing objects: 55% (25/45) remote: Compressing objects: 57% (26/45) remote: Compressing objects: 60% (27/45) remote: Compressing objects: 62% (28/45) remote: Compressing objects: 64% (29/45) remote: Compressing objects: 66% (30/45) remote: Compressing objects: 68% (31/45) remote: Compressing objects: 71% (32/45) remote: Compressing objects: 73% (33/45) remote: Compressing objects: 75% (34/45) remote: Compressing objects: 77% (35/45) remote: Compressing objects: 80% (36/45) remote: Compressing objects: 82% (37/45) remote: Compressing objects: 84% (38/45) remote: Compressing objects: 86% (39/45) remote: Compressing objects: 88% (40/45) remote: Compressing objects: 91% (41/45) remote: Compressing objects: 93% (42/45) remote: Compressing objects: 95% (43/45) remote: Compressing objects: 97% (44/45) remote: Compressing objects: 100% (45/45) remote: Compressing objects: 100% (45/45), done.
Receiving objects: 0% (1/7310) Receiving objects: 1% (74/7310) Receiving objects: 2% (147/7310) Receiving objects: 3% (220/7310) Receiving objects: 4% (293/7310) Receiving objects: 5% (366/7310) Receiving objects: 6% (439/7310) Receiving objects: 7% (512/7310) Receiving objects: 8% (585/7310) Receiving objects: 9% (658/7310) Receiving objects: 10% (731/7310) Receiving objects: 11% (805/7310) Receiving objects: 12% (878/7310) Receiving objects: 13% (951/7310) Receiving objects: 14% (1024/7310) Receiving objects: 15% (1097/7310) Receiving objects: 16% (1170/7310) Receiving objects: 17% (1243/7310) Receiving objects: 18% (1316/7310) Receiving objects: 19% (1389/7310) Receiving objects: 20% (1462/7310) Receiving objects: 21% (1536/7310) Receiving objects: 22% (1609/7310) Receiving objects: 23% (1682/7310) Receiving objects: 24% (1755/7310) Receiving objects: 25% (1828/7310) Receiving objects: 26% (1901/7310) Receiving objects: 27% (1974/7310) Receiving objects: 28% (2047/7310) Receiving objects: 29% (2120/7310) Receiving objects: 30% (2193/7310) Receiving objects: 31% (2267/7310) Receiving objects: 32% (2340/7310) Receiving objects: 33% (2413/7310) Receiving objects: 34% (2486/7310) Receiving objects: 35% (2559/7310) Receiving objects: 36% (2632/7310) Receiving objects: 37% (2705/7310) Receiving objects: 38% (2778/7310) Receiving objects: 39% (2851/7310) Receiving objects: 40% (2924/7310) Receiving objects: 41% (2998/7310) Receiving objects: 42% (3071/7310) Receiving objects: 43% (3144/7310) Receiving objects: 44% (3217/7310) Receiving objects: 45% (3290/7310) Receiving objects: 46% (3363/7310) Receiving objects: 47% (3436/7310) Receiving objects: 48% (3509/7310) Receiving objects: 49% (3582/7310) Receiving objects: 50% (3655/7310) Receiving objects: 51% (3729/7310) Receiving objects: 52% (3802/7310) Receiving objects: 53% (3875/7310) Receiving objects: 54% (3948/7310) Receiving objects: 55% (4021/7310) Receiving objects: 56% (4094/7310) Receiving objects: 57% (4167/7310) Receiving objects: 58% (4240/7310) Receiving objects: 59% (4313/7310) Receiving objects: 60% (4386/7310) Receiving objects: 61% (4460/7310) Receiving objects: 62% (4533/7310) Receiving objects: 63% (4606/7310) Receiving objects: 64% (4679/7310) Receiving objects: 65% (4752/7310) Receiving objects: 66% (4825/7310) Receiving objects: 67% (4898/7310) Receiving objects: 68% (4971/7310) Receiving objects: 69% (5044/7310) Receiving objects: 70% (5117/7310) Receiving objects: 71% (5191/7310) Receiving objects: 72% (5264/7310) Receiving objects: 73% (5337/7310) Receiving objects: 74% (5410/7310) Receiving objects: 75% (5483/7310) Receiving objects: 76% (5556/7310) Receiving objects: 77% (5629/7310) Receiving objects: 78% (5702/7310) Receiving objects: 79% (5775/7310) Receiving objects: 80% (5848/7310) Receiving objects: 81% (5922/7310) Receiving objects: 82% (5995/7310) Receiving objects: 83% (6068/7310) Receiving objects: 84% (6141/7310) Receiving objects: 85% (6214/7310) Receiving objects: 86% (6287/7310) Receiving objects: 87% (6360/7310) Receiving objects: 88% (6433/7310) Receiving objects: 89% (6506/7310) Receiving objects: 90% (6579/7310) Receiving objects: 91% (6653/7310) Receiving objects: 92% (6726/7310) Receiving objects: 93% (6799/7310) Receiving objects: 94% (6872/7310) Receiving objects: 95% (6945/7310) Receiving objects: 96% (7018/7310) Receiving objects: 97% (7091/7310) Receiving objects: 98% (7164/7310) Receiving objects: 99% (7237/7310) remote: Total 7310 (delta 2002), reused 2021 (delta 1993), pack-reused 5266
Receiving objects: 100% (7310/7310) Receiving objects: 100% (7310/7310), 2.09 MiB | 0 bytes/s, done.
Resolving deltas: 0% (0/2792) Resolving deltas: 1% (28/2792) Resolving deltas: 2% (56/2792) Resolving deltas: 3% (85/2792) Resolving deltas: 4% (112/2792) Resolving deltas: 5% (143/2792) Resolving deltas: 6% (168/2792) Resolving deltas: 7% (202/2792) Resolving deltas: 8% (224/2792) Resolving deltas: 9% (269/2792) Resolving deltas: 12% (361/2792) Resolving deltas: 13% (363/2792) Resolving deltas: 14% (392/2792) Resolving deltas: 15% (421/2792) Resolving deltas: 16% (452/2792) Resolving deltas: 17% (477/2792) Resolving deltas: 18% (504/2792) Resolving deltas: 19% (558/2792) Resolving deltas: 20% (559/2792) Resolving deltas: 21% (589/2792) Resolving deltas: 22% (615/2792) Resolving deltas: 23% (645/2792) Resolving deltas: 24% (671/2792) Resolving deltas: 25% (698/2792) Resolving deltas: 26% (726/2792) Resolving deltas: 27% (754/2792) Resolving deltas: 28% (782/2792) Resolving deltas: 29% (821/2792) Resolving deltas: 30% (838/2792) Resolving deltas: 31% (867/2792) Resolving deltas: 32% (894/2792) Resolving deltas: 33% (923/2792) Resolving deltas: 34% (951/2792) Resolving deltas: 35% (983/2792) Resolving deltas: 36% (1006/2792) Resolving deltas: 37% (1034/2792) Resolving deltas: 38% (1061/2792) Resolving deltas: 39% (1090/2792) Resolving deltas: 40% (1119/2792) Resolving deltas: 41% (1146/2792) Resolving deltas: 41% (1158/2792), completed with 189 local objects.
fatal: pack has 1634 unresolved deltas
fatal: index-pack failed
at org.jenkinsci.plugins.gitclient.CliGitAPIImpl.launchCommandIn(CliGitAPIImpl.java:2002)
at org.jenkinsci.plugins.gitclient.CliGitAPIImpl.launchCommandWithCredentials(CliGitAPIImpl.java:1721)
at org.jenkinsci.plugins.gitclient.CliGitAPIImpl.access$300(CliGitAPIImpl.java:72)
at org.jenkinsci.plugins.gitclient.CliGitAPIImpl$1.execute(CliGitAPIImpl.java:405)
at org.jenkinsci.plugins.gitclient.RemoteGitImpl$CommandInvocationHandler$1.call(RemoteGitImpl.java:153)
at org.jenkinsci.plugins.gitclient.RemoteGitImpl$CommandInvocationHandler$1.call(RemoteGitImpl.java:146)
at hudson.remoting.UserRequest.perform(UserRequest.java:212)
at hudson.remoting.UserRequest.perform(UserRequest.java:54)
at hudson.remoting.Request$2.run(Request.java:369)
at hudson.remoting.InterceptingExecutorService$1.call(InterceptingExecutorService.java:72)
at java.util.concurrent.FutureTask.run(FutureTask.java:266)
at java.util.concurrent.ThreadPoolExecutor.runWorker(ThreadPoolExecutor.java:1142)
at java.util.concurrent.ThreadPoolExecutor$Worker.run(ThreadPoolExecutor.java:617)
at java.lang.Thread.run(Thread.java:748)
Suppressed: hudson.remoting.Channel$CallSiteStackTrace: Remote call to H32
at hudson.remoting.Channel.attachCallSiteStackTrace(Channel.java:1741)
at hudson.remoting.UserRequest$ExceptionResponse.retrieve(UserRequest.java:357)
at hudson.remoting.Channel.call(Channel.java:955)
at org.jenkinsci.plugins.gitclient.RemoteGitImpl$CommandInvocationHandler.execute(RemoteGitImpl.java:146)
at sun.reflect.GeneratedMethodAccessor1346.invoke(Unknown Source)
at sun.reflect.DelegatingMethodAccessorImpl.invoke(DelegatingMethodAccessorImpl.java:43)
at java.lang.reflect.Method.invoke(Method.java:498)
at org.jenkinsci.plugins.gitclient.RemoteGitImpl$CommandInvocationHandler.invoke(RemoteGitImpl.java:132)
at com.sun.proxy.$Proxy115.execute(Unknown Source)
at hudson.plugins.git.GitSCM.fetchFrom(GitSCM.java:886)
at hudson.plugins.git.GitSCM.retrieveChanges(GitSCM.java:1155)
at hudson.plugins.git.GitSCM.checkout(GitSCM.java:1186)
at hudson.scm.SCM.checkout(SCM.java:504)
at hudson.model.AbstractProject.checkout(AbstractProject.java:1208)
at hudson.model.AbstractBuild$AbstractBuildExecution.defaultCheckout(AbstractBuild.java:574)
at jenkins.scm.SCMCheckoutStrategy.checkout(SCMCheckoutStrategy.java:86)
at hudson.model.AbstractBuild$AbstractBuildExecution.run(AbstractBuild.java:499)
at hudson.model.Run.execute(Run.java:1794)
at hudson.model.FreeStyleBuild.run(FreeStyleBuild.java:43)
at hudson.model.ResourceController.execute(ResourceController.java:97)
at hudson.model.Executor.run(Executor.java:429)
ERROR: Error fetching remote repo 'origin'
Retrying after 10 seconds
> git rev-parse --is-inside-work-tree # timeout=10
Fetching changes from the remote Git repository
> git config remote.origin.url https://github.com/apache/kafka.git # timeout=10
Fetching upstream changes from https://github.com/apache/kafka.git
> git --version # timeout=10
> git fetch --tags --progress https://github.com/apache/kafka.git +refs/heads/*:refs/remotes/origin/*
ERROR: Error fetching remote repo 'origin'
hudson.plugins.git.GitException: Failed to fetch from https://github.com/apache/kafka.git
at hudson.plugins.git.GitSCM.fetchFrom(GitSCM.java:888)
at hudson.plugins.git.GitSCM.retrieveChanges(GitSCM.java:1155)
at hudson.plugins.git.GitSCM.checkout(GitSCM.java:1186)
at hudson.scm.SCM.checkout(SCM.java:504)
at hudson.model.AbstractProject.checkout(AbstractProject.java:1208)
at hudson.model.AbstractBuild$AbstractBuildExecution.defaultCheckout(AbstractBuild.java:574)
at jenkins.scm.SCMCheckoutStrategy.checkout(SCMCheckoutStrategy.java:86)
at hudson.model.AbstractBuild$AbstractBuildExecution.run(AbstractBuild.java:499)
at hudson.model.Run.execute(Run.java:1794)
at hudson.model.FreeStyleBuild.run(FreeStyleBuild.java:43)
at hudson.model.ResourceController.execute(ResourceController.java:97)
at hudson.model.Executor.run(Executor.java:429)
Caused by: hudson.plugins.git.GitException: Command "git fetch --tags --progress https://github.com/apache/kafka.git +refs/heads/*:refs/remotes/origin/*" returned status code 128:
stdout:
stderr: error: Could not read 0f3affc0f40751dc8fd064b36b6e859728f63e37
error: Could not read 95fbb2e03f4fe79737c71632e0ef2dfdcfb85a69
error: Could not read 08c465028d057ac23cdfe6d57641fe40240359dd
remote: Counting objects: 7310, done.
remote: Compressing objects: 2% (1/45) remote: Compressing objects: 4% (2/45) remote: Compressing objects: 6% (3/45) remote: Compressing objects: 8% (4/45) remote: Compressing objects: 11% (5/45) remote: Compressing objects: 13% (6/45) remote: Compressing objects: 15% (7/45) remote: Compressing objects: 17% (8/45) remote: Compressing objects: 20% (9/45) remote: Compressing objects: 22% (10/45) remote: Compressing objects: 24% (11/45) remote: Compressing objects: 26% (12/45) remote: Compressing objects: 28% (13/45) remote: Compressing objects: 31% (14/45) remote: Compressing objects: 33% (15/45) remote: Compressing objects: 35% (16/45) remote: Compressing objects: 37% (17/45) remote: Compressing objects: 40% (18/45) remote: Compressing objects: 42% (19/45) remote: Compressing objects: 44% (20/45) remote: Compressing objects: 46% (21/45) remote: Compressing objects: 48% (22/45) remote: Compressing objects: 51% (23/45) remote: Compressing objects: 53% (24/45) remote: Compressing objects: 55% (25/45) remote: Compressing objects: 57% (26/45) remote: Compressing objects: 60% (27/45) remote: Compressing objects: 62% (28/45) remote: Compressing objects: 64% (29/45) remote: Compressing objects: 66% (30/45) remote: Compressing objects: 68% (31/45) remote: Compressing objects: 71% (32/45) remote: Compressing objects: 73% (33/45) remote: Compressing objects: 75% (34/45) remote: Compressing objects: 77% (35/45) remote: Compressing objects: 80% (36/45) remote: Compressing objects: 82% (37/45) remote: Compressing objects: 84% (38/45) remote: Compressing objects: 86% (39/45) remote: Compressing objects: 88% (40/45) remote: Compressing objects: 91% (41/45) remote: Compressing objects: 93% (42/45) remote: Compressing objects: 95% (43/45) remote: Compressing objects: 97% (44/45) remote: Compressing objects: 100% (45/45) remote: Compressing objects: 100% (45/45), done.
Receiving objects: 0% (1/7310) Receiving objects: 1% (74/7310) Receiving objects: 2% (147/7310) Receiving objects: 3% (220/7310) Receiving objects: 4% (293/7310) Receiving objects: 5% (366/7310) Receiving objects: 6% (439/7310) Receiving objects: 7% (512/7310) Receiving objects: 8% (585/7310) Receiving objects: 9% (658/7310) Receiving objects: 10% (731/7310) Receiving objects: 11% (805/7310) Receiving objects: 12% (878/7310) Receiving objects: 13% (951/7310) Receiving objects: 14% (1024/7310) Receiving objects: 15% (1097/7310) Receiving objects: 16% (1170/7310) Receiving objects: 17% (1243/7310) Receiving objects: 18% (1316/7310) Receiving objects: 19% (1389/7310) Receiving objects: 20% (1462/7310) Receiving objects: 21% (1536/7310) Receiving objects: 22% (1609/7310) Receiving objects: 23% (1682/7310) Receiving objects: 24% (1755/7310) Receiving objects: 25% (1828/7310) Receiving objects: 26% (1901/7310) Receiving objects: 27% (1974/7310) Receiving objects: 28% (2047/7310) Receiving objects: 29% (2120/7310) Receiving objects: 30% (2193/7310) Receiving objects: 31% (2267/7310) Receiving objects: 32% (2340/7310) Receiving objects: 33% (2413/7310) Receiving objects: 34% (2486/7310) Receiving objects: 35% (2559/7310) Receiving objects: 36% (2632/7310) Receiving objects: 37% (2705/7310) Receiving objects: 38% (2778/7310) Receiving objects: 39% (2851/7310) Receiving objects: 40% (2924/7310) Receiving objects: 41% (2998/7310) Receiving objects: 42% (3071/7310) Receiving objects: 43% (3144/7310) Receiving objects: 44% (3217/7310) Receiving objects: 45% (3290/7310) Receiving objects: 46% (3363/7310) Receiving objects: 47% (3436/7310) Receiving objects: 48% (3509/7310) Receiving objects: 49% (3582/7310) Receiving objects: 50% (3655/7310) Receiving objects: 51% (3729/7310) Receiving objects: 52% (3802/7310) Receiving objects: 53% (3875/7310) Receiving objects: 54% (3948/7310) Receiving objects: 55% (4021/7310) Receiving objects: 56% (4094/7310) Receiving objects: 57% (4167/7310) Receiving objects: 58% (4240/7310) Receiving objects: 59% (4313/7310) Receiving objects: 60% (4386/7310) Receiving objects: 61% (4460/7310) Receiving objects: 62% (4533/7310) Receiving objects: 63% (4606/7310) Receiving objects: 64% (4679/7310) Receiving objects: 65% (4752/7310) Receiving objects: 66% (4825/7310) Receiving objects: 67% (4898/7310) Receiving objects: 68% (4971/7310) Receiving objects: 69% (5044/7310) Receiving objects: 70% (5117/7310) Receiving objects: 71% (5191/7310) Receiving objects: 72% (5264/7310) Receiving objects: 73% (5337/7310) Receiving objects: 74% (5410/7310) Receiving objects: 75% (5483/7310) Receiving objects: 76% (5556/7310) Receiving objects: 77% (5629/7310) Receiving objects: 78% (5702/7310) Receiving objects: 79% (5775/7310) Receiving objects: 80% (5848/7310) Receiving objects: 81% (5922/7310) Receiving objects: 82% (5995/7310) Receiving objects: 83% (6068/7310) Receiving objects: 84% (6141/7310) Receiving objects: 85% (6214/7310) Receiving objects: 86% (6287/7310) Receiving objects: 87% (6360/7310) Receiving objects: 88% (6433/7310) Receiving objects: 89% (6506/7310) Receiving objects: 90% (6579/7310) Receiving objects: 91% (6653/7310) Receiving objects: 92% (6726/7310) Receiving objects: 93% (6799/7310) Receiving objects: 94% (6872/7310) Receiving objects: 95% (6945/7310) Receiving objects: 96% (7018/7310) Receiving objects: 97% (7091/7310) Receiving objects: 98% (7164/7310) Receiving objects: 99% (7237/7310) remote: Total 7310 (delta 2002), reused 2021 (delta 1993), pack-reused 5266
Receiving objects: 100% (7310/7310) Receiving objects: 100% (7310/7310), 2.09 MiB | 0 bytes/s, done.
Resolving deltas: 0% (0/2792) Resolving deltas: 1% (28/2792) Resolving deltas: 2% (65/2792) Resolving deltas: 3% (84/2792) Resolving deltas: 4% (114/2792) Resolving deltas: 5% (162/2792) Resolving deltas: 6% (170/2792) Resolving deltas: 7% (203/2792) Resolving deltas: 8% (236/2792) Resolving deltas: 9% (260/2792) Resolving deltas: 11% (326/2792) Resolving deltas: 12% (359/2792) Resolving deltas: 13% (364/2792) Resolving deltas: 14% (402/2792) Resolving deltas: 15% (421/2792) Resolving deltas: 16% (449/2792) Resolving deltas: 17% (477/2792) Resolving deltas: 19% (546/2792) Resolving deltas: 20% (563/2792) Resolving deltas: 21% (593/2792) Resolving deltas: 22% (623/2792) Resolving deltas: 23% (643/2792) Resolving deltas: 24% (673/2792) Resolving deltas: 25% (698/2792) Resolving deltas: 26% (726/2792) Resolving deltas: 27% (754/2792) Resolving deltas: 28% (782/2792) Resolving deltas: 29% (821/2792) Resolving deltas: 30% (838/2792) Resolving deltas: 31% (867/2792) Resolving deltas: 32% (894/2792) Resolving deltas: 33% (923/2792) Resolving deltas: 34% (951/2792) Resolving deltas: 35% (983/2792) Resolving deltas: 36% (1006/2792) Resolving deltas: 37% (1034/2792) Resolving deltas: 38% (1061/2792) Resolving deltas: 39% (1090/2792) Resolving deltas: 40% (1119/2792) Resolving deltas: 41% (1146/2792) Resolving deltas: 41% (1158/2792), completed with 189 local objects.
fatal: pack has 1634 unresolved deltas
fatal: index-pack failed
at org.jenkinsci.plugins.gitclient.CliGitAPIImpl.launchCommandIn(CliGitAPIImpl.java:2002)
at org.jenkinsci.plugins.gitclient.CliGitAPIImpl.launchCommandWithCredentials(CliGitAPIImpl.java:1721)
at org.jenkinsci.plugins.gitclient.CliGitAPIImpl.access$300(CliGitAPIImpl.java:72)
at org.jenkinsci.plugins.gitclient.CliGitAPIImpl$1.execute(CliGitAPIImpl.java:405)
at org.jenkinsci.plugins.gitclient.RemoteGitImpl$CommandInvocationHandler$1.call(RemoteGitImpl.java:153)
at org.jenkinsci.plugins.gitclient.RemoteGitImpl$CommandInvocationHandler$1.call(RemoteGitImpl.java:146)
at hudson.remoting.UserRequest.perform(UserRequest.java:212)
at hudson.remoting.UserRequest.perform(UserRequest.java:54)
at hudson.remoting.Request$2.run(Request.java:369)
at hudson.remoting.InterceptingExecutorService$1.call(InterceptingExecutorService.java:72)
at java.util.concurrent.FutureTask.run(FutureTask.java:266)
at java.util.concurrent.ThreadPoolExecutor.runWorker(ThreadPoolExecutor.java:1142)
at java.util.concurrent.ThreadPoolExecutor$Worker.run(ThreadPoolExecutor.java:617)
at java.lang.Thread.run(Thread.java:748)
Suppressed: hudson.remoting.Channel$CallSiteStackTrace: Remote call to H32
at hudson.remoting.Channel.attachCallSiteStackTrace(Channel.java:1741)
at hudson.remoting.UserRequest$ExceptionResponse.retrieve(UserRequest.java:357)
at hudson.remoting.Channel.call(Channel.java:955)
at org.jenkinsci.plugins.gitclient.RemoteGitImpl$CommandInvocationHandler.execute(RemoteGitImpl.java:146)
at sun.reflect.GeneratedMethodAccessor1346.invoke(Unknown Source)
at sun.reflect.DelegatingMethodAccessorImpl.invoke(DelegatingMethodAccessorImpl.java:43)
at java.lang.reflect.Method.invoke(Method.java:498)
at org.jenkinsci.plugins.gitclient.RemoteGitImpl$CommandInvocationHandler.invoke(RemoteGitImpl.java:132)
at com.sun.proxy.$Proxy115.execute(Unknown Source)
at hudson.plugins.git.GitSCM.fetchFrom(GitSCM.java:886)
at hudson.plugins.git.GitSCM.retrieveChanges(GitSCM.java:1155)
at hudson.plugins.git.GitSCM.checkout(GitSCM.java:1186)
at hudson.scm.SCM.checkout(SCM.java:504)
at hudson.model.AbstractProject.checkout(AbstractProject.java:1208)
at hudson.model.AbstractBuild$AbstractBuildExecution.defaultCheckout(AbstractBuild.java:574)
at jenkins.scm.SCMCheckoutStrategy.checkout(SCMCheckoutStrategy.java:86)
at hudson.model.AbstractBuild$AbstractBuildExecution.run(AbstractBuild.java:499)
at hudson.model.Run.execute(Run.java:1794)
at hudson.model.FreeStyleBuild.run(FreeStyleBuild.java:43)
at hudson.model.ResourceController.execute(ResourceController.java:97)
at hudson.model.Executor.run(Executor.java:429)
ERROR: Error fetching remote repo 'origin'
Retrying after 10 seconds
> git rev-parse --is-inside-work-tree # timeout=10
Fetching changes from the remote Git repository
> git config remote.origin.url https://github.com/apache/kafka.git # timeout=10
Fetching upstream changes from https://github.com/apache/kafka.git
> git --version # timeout=10
> git fetch --tags --progress https://github.com/apache/kafka.git +refs/heads/*:refs/remotes/origin/*
ERROR: Error fetching remote repo 'origin'
hudson.plugins.git.GitException: Failed to fetch from https://github.com/apache/kafka.git
at hudson.plugins.git.GitSCM.fetchFrom(GitSCM.java:888)
at hudson.plugins.git.GitSCM.retrieveChanges(GitSCM.java:1155)
at hudson.plugins.git.GitSCM.checkout(GitSCM.java:1186)
at hudson.scm.SCM.checkout(SCM.java:504)
at hudson.model.AbstractProject.checkout(AbstractProject.java:1208)
at hudson.model.AbstractBuild$AbstractBuildExecution.defaultCheckout(AbstractBuild.java:574)
at jenkins.scm.SCMCheckoutStrategy.checkout(SCMCheckoutStrategy.java:86)
at hudson.model.AbstractBuild$AbstractBuildExecution.run(AbstractBuild.java:499)
at hudson.model.Run.execute(Run.java:1794)
at hudson.model.FreeStyleBuild.run(FreeStyleBuild.java:43)
at hudson.model.ResourceController.execute(ResourceController.java:97)
at hudson.model.Executor.run(Executor.java:429)
Caused by: hudson.plugins.git.GitException: Command "git fetch --tags --progress https://github.com/apache/kafka.git +refs/heads/*:refs/remotes/origin/*" returned status code 128:
stdout:
stderr: error: Could not read 0f3affc0f40751dc8fd064b36b6e859728f63e37
error: Could not read 95fbb2e03f4fe79737c71632e0ef2dfdcfb85a69
error: Could not read 08c465028d057ac23cdfe6d57641fe40240359dd
remote: Counting objects: 7310, done.
remote: Compressing objects: 2% (1/45) remote: Compressing objects: 4% (2/45) remote: Compressing objects: 6% (3/45) remote: Compressing objects: 8% (4/45) remote: Compressing objects: 11% (5/45) remote: Compressing objects: 13% (6/45) remote: Compressing objects: 15% (7/45) remote: Compressing objects: 17% (8/45) remote: Compressing objects: 20% (9/45) remote: Compressing objects: 22% (10/45) remote: Compressing objects: 24% (11/45) remote: Compressing objects: 26% (12/45) remote: Compressing objects: 28% (13/45) remote: Compressing objects: 31% (14/45) remote: Compressing objects: 33% (15/45) remote: Compressing objects: 35% (16/45) remote: Compressing objects: 37% (17/45) remote: Compressing objects: 40% (18/45) remote: Compressing objects: 42% (19/45) remote: Compressing objects: 44% (20/45) remote: Compressing objects: 46% (21/45) remote: Compressing objects: 48% (22/45) remote: Compressing objects: 51% (23/45) remote: Compressing objects: 53% (24/45) remote: Compressing objects: 55% (25/45) remote: Compressing objects: 57% (26/45) remote: Compressing objects: 60% (27/45) remote: Compressing objects: 62% (28/45) remote: Compressing objects: 64% (29/45) remote: Compressing objects: 66% (30/45) remote: Compressing objects: 68% (31/45) remote: Compressing objects: 71% (32/45) remote: Compressing objects: 73% (33/45) remote: Compressing objects: 75% (34/45) remote: Compressing objects: 77% (35/45) remote: Compressing objects: 80% (36/45) remote: Compressing objects: 82% (37/45) remote: Compressing objects: 84% (38/45) remote: Compressing objects: 86% (39/45) remote: Compressing objects: 88% (40/45) remote: Compressing objects: 91% (41/45) remote: Compressing objects: 93% (42/45) remote: Compressing objects: 95% (43/45) remote: Compressing objects: 97% (44/45) remote: Compressing objects: 100% (45/45) remote: Compressing objects: 100% (45/45), done.
Receiving objects: 0% (1/7310) Receiving objects: 1% (74/7310) Receiving objects: 2% (147/7310) Receiving objects: 3% (220/7310) Receiving objects: 4% (293/7310) Receiving objects: 5% (366/7310) Receiving objects: 6% (439/7310) Receiving objects: 7% (512/7310) Receiving objects: 8% (585/7310) Receiving objects: 9% (658/7310) Receiving objects: 10% (731/7310) Receiving objects: 11% (805/7310) Receiving objects: 12% (878/7310) Receiving objects: 13% (951/7310) Receiving objects: 14% (1024/7310) Receiving objects: 15% (1097/7310) Receiving objects: 16% (1170/7310) Receiving objects: 17% (1243/7310) Receiving objects: 18% (1316/7310) Receiving objects: 19% (1389/7310) Receiving objects: 20% (1462/7310) Receiving objects: 21% (1536/7310) Receiving objects: 22% (1609/7310) Receiving objects: 23% (1682/7310) Receiving objects: 24% (1755/7310) Receiving objects: 25% (1828/7310) Receiving objects: 26% (1901/7310) Receiving objects: 27% (1974/7310) Receiving objects: 28% (2047/7310) Receiving objects: 29% (2120/7310) Receiving objects: 30% (2193/7310) Receiving objects: 31% (2267/7310) Receiving objects: 32% (2340/7310) Receiving objects: 33% (2413/7310) Receiving objects: 34% (2486/7310) Receiving objects: 35% (2559/7310) Receiving objects: 36% (2632/7310) Receiving objects: 37% (2705/7310) Receiving objects: 38% (2778/7310) Receiving objects: 39% (2851/7310) Receiving objects: 40% (2924/7310) Receiving objects: 41% (2998/7310) Receiving objects: 42% (3071/7310) Receiving objects: 43% (3144/7310) Receiving objects: 44% (3217/7310) Receiving objects: 45% (3290/7310) Receiving objects: 46% (3363/7310) Receiving objects: 47% (3436/7310) Receiving objects: 48% (3509/7310) Receiving objects: 49% (3582/7310) Receiving objects: 50% (3655/7310) Receiving objects: 51% (3729/7310) Receiving objects: 52% (3802/7310) Receiving objects: 53% (3875/7310) Receiving objects: 54% (3948/7310) Receiving objects: 55% (4021/7310) Receiving objects: 56% (4094/7310) Receiving objects: 57% (4167/7310) Receiving objects: 58% (4240/7310) Receiving objects: 59% (4313/7310) Receiving objects: 60% (4386/7310) Receiving objects: 61% (4460/7310) Receiving objects: 62% (4533/7310) Receiving objects: 63% (4606/7310) Receiving objects: 64% (4679/7310) Receiving objects: 65% (4752/7310) Receiving objects: 66% (4825/7310) Receiving objects: 67% (4898/7310) Receiving objects: 68% (4971/7310) Receiving objects: 69% (5044/7310) Receiving objects: 70% (5117/7310) Receiving objects: 71% (5191/7310) Receiving objects: 72% (5264/7310) Receiving objects: 73% (5337/7310) Receiving objects: 74% (5410/7310) Receiving objects: 75% (5483/7310) Receiving objects: 76% (5556/7310) Receiving objects: 77% (5629/7310) Receiving objects: 78% (5702/7310) Receiving objects: 79% (5775/7310) Receiving objects: 80% (5848/7310) Receiving objects: 81% (5922/7310) Receiving objects: 82% (5995/7310) Receiving objects: 83% (6068/7310) Receiving objects: 84% (6141/7310) Receiving objects: 85% (6214/7310) Receiving objects: 86% (6287/7310) Receiving objects: 87% (6360/7310) Receiving objects: 88% (6433/7310) Receiving objects: 89% (6506/7310) Receiving objects: 90% (6579/7310) Receiving objects: 91% (6653/7310) Receiving objects: 92% (6726/7310) Receiving objects: 93% (6799/7310) Receiving objects: 94% (6872/7310) Receiving objects: 95% (6945/7310) Receiving objects: 96% (7018/7310) Receiving objects: 97% (7091/7310) Receiving objects: 98% (7164/7310) Receiving objects: 99% (7237/7310) remote: Total 7310 (delta 2002), reused 2021 (delta 1993), pack-reused 5266
Receiving objects: 100% (7310/7310) Receiving objects: 100% (7310/7310), 2.09 MiB | 0 bytes/s, done.
Resolving deltas: 0% (0/2792) Resolving deltas: 1% (28/2792) Resolving deltas: 2% (56/2792) Resolving deltas: 3% (85/2792) Resolving deltas: 4% (112/2792) Resolving deltas: 5% (143/2792) Resolving deltas: 6% (169/2792) Resolving deltas: 7% (199/2792) Resolving deltas: 9% (255/2792) Resolving deltas: 13% (369/2792) Resolving deltas: 14% (393/2792) Resolving deltas: 15% (420/2792) Resolving deltas: 16% (450/2792) Resolving deltas: 17% (475/2792) Resolving deltas: 18% (509/2792) Resolving deltas: 20% (570/2792) Resolving deltas: 21% (587/2792) Resolving deltas: 22% (617/2792) Resolving deltas: 23% (646/2792) Resolving deltas: 24% (672/2792) Resolving deltas: 25% (698/2792) Resolving deltas: 26% (726/2792) Resolving deltas: 27% (754/2792) Resolving deltas: 28% (782/2792) Resolving deltas: 29% (821/2792) Resolving deltas: 30% (838/2792) Resolving deltas: 31% (867/2792) Resolving deltas: 32% (894/2792) Resolving deltas: 33% (923/2792) Resolving deltas: 34% (951/2792) Resolving deltas: 35% (983/2792) Resolving deltas: 36% (1006/2792) Resolving deltas: 37% (1034/2792) Resolving deltas: 38% (1061/2792) Resolving deltas: 39% (1090/2792) Resolving deltas: 40% (1119/2792) Resolving deltas: 41% (1146/2792) Resolving deltas: 41% (1158/2792), completed with 189 local objects.
fatal: pack has 1634 unresolved deltas
fatal: index-pack failed
at org.jenkinsci.plugins.gitclient.CliGitAPIImpl.launchCommandIn(CliGitAPIImpl.java:2002)
at org.jenkinsci.plugins.gitclient.CliGitAPIImpl.launchCommandWithCredentials(CliGitAPIImpl.java:1721)
at org.jenkinsci.plugins.gitclient.CliGitAPIImpl.access$300(CliGitAPIImpl.java:72)
at org.jenkinsci.plugins.gitclient.CliGitAPIImpl$1.execute(CliGitAPIImpl.java:405)
at org.jenkinsci.plugins.gitclient.RemoteGitImpl$CommandInvocationHandler$1.call(RemoteGitImpl.java:153)
at org.jenkinsci.plugins.gitclient.RemoteGitImpl$CommandInvocationHandler$1.call(RemoteGitImpl.java:146)
at hudson.remoting.UserRequest.perform(UserRequest.java:212)
at hudson.remoting.UserRequest.perform(UserRequest.java:54)
at hudson.remoting.Request$2.run(Request.java:369)
at hudson.remoting.InterceptingExecutorService$1.call(InterceptingExecutorService.java:72)
at java.util.concurrent.FutureTask.run(FutureTask.java:266)
at java.util.concurrent.ThreadPoolExecutor.runWorker(ThreadPoolExecutor.java:1142)
at java.util.concurrent.ThreadPoolExecutor$Worker.run(ThreadPoolExecutor.java:617)
at java.lang.Thread.run(Thread.java:748)
Suppressed: hudson.remoting.Channel$CallSiteStackTrace: Remote call to H32
at hudson.remoting.Channel.attachCallSiteStackTrace(Channel.java:1741)
at hudson.remoting.UserRequest$ExceptionResponse.retrieve(UserRequest.java:357)
at hudson.remoting.Channel.call(Channel.java:955)
at org.jenkinsci.plugins.gitclient.RemoteGitImpl$CommandInvocationHandler.execute(RemoteGitImpl.java:146)
at sun.reflect.GeneratedMethodAccessor1346.invoke(Unknown Source)
at sun.reflect.DelegatingMethodAccessorImpl.invoke(DelegatingMethodAccessorImpl.java:43)
at java.lang.reflect.Method.invoke(Method.java:498)
at org.jenkinsci.plugins.gitclient.RemoteGitImpl$CommandInvocationHandler.invoke(RemoteGitImpl.java:132)
at com.sun.proxy.$Proxy115.execute(Unknown Source)
at hudson.plugins.git.GitSCM.fetchFrom(GitSCM.java:886)
at hudson.plugins.git.GitSCM.retrieveChanges(GitSCM.java:1155)
at hudson.plugins.git.GitSCM.checkout(GitSCM.java:1186)
at hudson.scm.SCM.checkout(SCM.java:504)
at hudson.model.AbstractProject.checkout(AbstractProject.java:1208)
at hudson.model.AbstractBuild$AbstractBuildExecution.defaultCheckout(AbstractBuild.java:574)
at jenkins.scm.SCMCheckoutStrategy.checkout(SCMCheckoutStrategy.java:86)
at hudson.model.AbstractBuild$AbstractBuildExecution.run(AbstractBuild.java:499)
at hudson.model.Run.execute(Run.java:1794)
at hudson.model.FreeStyleBuild.run(FreeStyleBuild.java:43)
at hudson.model.ResourceController.execute(ResourceController.java:97)
at hudson.model.Executor.run(Executor.java:429)
ERROR: Error fetching remote repo 'origin'
[FINDBUGS] Collecting findbugs analysis files...
[FINDBUGS] Searching for all files in <https://builds.apache.org/job/kafka-trunk-jdk8/ws/> that match the pattern **/build/reports/findbugs/*.xml
[FINDBUGS] Parsing 15 files in <https://builds.apache.org/job/kafka-trunk-jdk8/ws/>
[FINDBUGS] Successfully parsed file <https://builds.apache.org/job/kafka-trunk-jdk8/ws/clients/build/reports/findbugs/main.xml> with 0 unique warnings and 0 duplicates.
[FINDBUGS] Successfully parsed file <https://builds.apache.org/job/kafka-trunk-jdk8/ws/connect/api/build/reports/findbugs/main.xml> with 0 unique warnings and 0 duplicates.
[FINDBUGS] Successfully parsed file <https://builds.apache.org/job/kafka-trunk-jdk8/ws/connect/basic-auth-extension/build/reports/findbugs/main.xml> with 0 unique warnings and 0 duplicates.
[FINDBUGS] Successfully parsed file <https://builds.apache.org/job/kafka-trunk-jdk8/ws/connect/file/build/reports/findbugs/main.xml> with 0 unique warnings and 0 duplicates.
[FINDBUGS] Successfully parsed file <https://builds.apache.org/job/kafka-trunk-jdk8/ws/connect/json/build/reports/findbugs/main.xml> with 0 unique warnings and 0 duplicates.
[FINDBUGS] Successfully parsed file <https://builds.apache.org/job/kafka-trunk-jdk8/ws/connect/runtime/build/reports/findbugs/main.xml> with 0 unique warnings and 0 duplicates.
[FINDBUGS] Successfully parsed file <https://builds.apache.org/job/kafka-trunk-jdk8/ws/connect/transforms/build/reports/findbugs/main.xml> with 0 unique warnings and 0 duplicates.
[FINDBUGS] Successfully parsed file <https://builds.apache.org/job/kafka-trunk-jdk8/ws/core/build/reports/findbugs/main.xml> with 0 unique warnings and 0 duplicates.
[FINDBUGS] Successfully parsed file <https://builds.apache.org/job/kafka-trunk-jdk8/ws/examples/build/reports/findbugs/main.xml> with 0 unique warnings and 0 duplicates.
[FINDBUGS] Successfully parsed file <https://builds.apache.org/job/kafka-trunk-jdk8/ws/log4j-appender/build/reports/findbugs/main.xml> with 0 unique warnings and 0 duplicates.
[FINDBUGS] Successfully parsed file <https://builds.apache.org/job/kafka-trunk-jdk8/ws/streams/build/reports/findbugs/main.xml> with 0 unique warnings and 0 duplicates.
[FINDBUGS] Successfully parsed file <https://builds.apache.org/job/kafka-trunk-jdk8/ws/streams/examples/build/reports/findbugs/main.xml> with 0 unique warnings and 0 duplicates.
[FINDBUGS] Successfully parsed file <https://builds.apache.org/job/kafka-trunk-jdk8/ws/streams/streams-scala/build/reports/findbugs/main.xml> with 0 unique warnings and 0 duplicates.
[FINDBUGS] Successfully parsed file <https://builds.apache.org/job/kafka-trunk-jdk8/ws/streams/test-utils/build/reports/findbugs/main.xml> with 0 unique warnings and 0 duplicates.
[FINDBUGS] Successfully parsed file <https://builds.apache.org/job/kafka-trunk-jdk8/ws/tools/build/reports/findbugs/main.xml> with 0 unique warnings and 0 duplicates.
<Git Blamer> Using GitBlamer to create author and commit information for all warnings.
<Git Blamer> GIT_COMMIT=609c81ec8b190f4812e7008b30fc509ee1656d68, workspace=<https://builds.apache.org/job/kafka-trunk-jdk8/ws/>
[FINDBUGS] Computing warning deltas based on reference build #2859
Recording test results
ERROR: Step ?Publish JUnit test result report? failed: Test reports were found but none of them are new. Did leafNodes run?
For example, <https://builds.apache.org/job/kafka-trunk-jdk8/ws/clients/build/test-results/test/TEST-org.apache.kafka.clients.ApiVersionsTest.xml> is 15 days old
Not sending mail to unregistered user wangguoz@gmail.com
Not sending mail to unregistered user rajinisivaram@googlemail.com
Not sending mail to unregistered user noreply@github.com
Build failed in Jenkins: kafka-trunk-jdk8 #2867
Posted by Apache Jenkins Server <je...@builds.apache.org>.
See <https://builds.apache.org/job/kafka-trunk-jdk8/2867/display/redirect?page=changes>
Changes:
[rajinisivaram] KAFKA-7183: Add a trogdor test that creates many connections to brokers
------------------------------------------
[...truncated 426.36 KB...]
kafka.security.auth.SimpleAclAuthorizerTest > testAclInheritance PASSED
kafka.security.auth.SimpleAclAuthorizerTest > testDistributedConcurrentModificationOfResourceAcls STARTED
kafka.security.auth.SimpleAclAuthorizerTest > testDistributedConcurrentModificationOfResourceAcls PASSED
kafka.security.auth.SimpleAclAuthorizerTest > testAddAclsOnWildcardResource STARTED
kafka.security.auth.SimpleAclAuthorizerTest > testAddAclsOnWildcardResource PASSED
kafka.security.auth.SimpleAclAuthorizerTest > testWritesExtendedAclChangeEventWhenInterBrokerProtocolAtLeastKafkaV2 STARTED
kafka.security.auth.SimpleAclAuthorizerTest > testWritesExtendedAclChangeEventWhenInterBrokerProtocolAtLeastKafkaV2 PASSED
kafka.security.auth.SimpleAclAuthorizerTest > testAclManagementAPIs STARTED
kafka.security.auth.SimpleAclAuthorizerTest > testAclManagementAPIs PASSED
kafka.security.auth.SimpleAclAuthorizerTest > testWildCardAcls STARTED
kafka.security.auth.SimpleAclAuthorizerTest > testWildCardAcls PASSED
kafka.security.auth.SimpleAclAuthorizerTest > testWritesLiteralAclChangeEventWhenInterBrokerProtocolIsKafkaV2 STARTED
kafka.security.auth.SimpleAclAuthorizerTest > testWritesLiteralAclChangeEventWhenInterBrokerProtocolIsKafkaV2 PASSED
kafka.security.auth.SimpleAclAuthorizerTest > testTopicAcl STARTED
kafka.security.auth.SimpleAclAuthorizerTest > testTopicAcl PASSED
kafka.security.auth.SimpleAclAuthorizerTest > testSuperUserHasAccess STARTED
kafka.security.auth.SimpleAclAuthorizerTest > testSuperUserHasAccess PASSED
kafka.security.auth.SimpleAclAuthorizerTest > testDeleteAclOnPrefixedResource STARTED
kafka.security.auth.SimpleAclAuthorizerTest > testDeleteAclOnPrefixedResource PASSED
kafka.security.auth.SimpleAclAuthorizerTest > testDenyTakesPrecedence STARTED
kafka.security.auth.SimpleAclAuthorizerTest > testDenyTakesPrecedence PASSED
kafka.security.auth.SimpleAclAuthorizerTest > testNoAclFoundOverride STARTED
kafka.security.auth.SimpleAclAuthorizerTest > testNoAclFoundOverride PASSED
kafka.security.auth.SimpleAclAuthorizerTest > testEmptyAclThrowsException STARTED
kafka.security.auth.SimpleAclAuthorizerTest > testEmptyAclThrowsException PASSED
kafka.security.auth.SimpleAclAuthorizerTest > testSuperUserWithCustomPrincipalHasAccess STARTED
kafka.security.auth.SimpleAclAuthorizerTest > testSuperUserWithCustomPrincipalHasAccess PASSED
kafka.security.auth.SimpleAclAuthorizerTest > testAllowAccessWithCustomPrincipal STARTED
kafka.security.auth.SimpleAclAuthorizerTest > testAllowAccessWithCustomPrincipal PASSED
kafka.security.auth.SimpleAclAuthorizerTest > testDeleteAclOnWildcardResource STARTED
kafka.security.auth.SimpleAclAuthorizerTest > testDeleteAclOnWildcardResource PASSED
kafka.security.auth.SimpleAclAuthorizerTest > testChangeListenerTiming STARTED
kafka.security.auth.SimpleAclAuthorizerTest > testChangeListenerTiming PASSED
kafka.security.auth.SimpleAclAuthorizerTest > testWritesLiteralWritesLiteralAclChangeEventWhenInterBrokerProtocolLessThanKafkaV2eralAclChangesForOlderProtocolVersions STARTED
kafka.security.auth.SimpleAclAuthorizerTest > testWritesLiteralWritesLiteralAclChangeEventWhenInterBrokerProtocolLessThanKafkaV2eralAclChangesForOlderProtocolVersions PASSED
kafka.security.auth.SimpleAclAuthorizerTest > testThrowsOnAddPrefixedAclIfInterBrokerProtocolVersionTooLow STARTED
kafka.security.auth.SimpleAclAuthorizerTest > testThrowsOnAddPrefixedAclIfInterBrokerProtocolVersionTooLow PASSED
kafka.security.auth.SimpleAclAuthorizerTest > testAccessAllowedIfAllowAclExistsOnPrefixedResource STARTED
kafka.security.auth.SimpleAclAuthorizerTest > testAccessAllowedIfAllowAclExistsOnPrefixedResource PASSED
kafka.security.auth.SimpleAclAuthorizerTest > testHighConcurrencyModificationOfResourceAcls STARTED
kafka.security.auth.SimpleAclAuthorizerTest > testHighConcurrencyModificationOfResourceAcls PASSED
kafka.security.auth.SimpleAclAuthorizerTest > testAuthorizeWithEmptyResourceName STARTED
kafka.security.auth.SimpleAclAuthorizerTest > testAuthorizeWithEmptyResourceName PASSED
kafka.security.auth.SimpleAclAuthorizerTest > testDeleteAllAclOnPrefixedResource STARTED
kafka.security.auth.SimpleAclAuthorizerTest > testDeleteAllAclOnPrefixedResource PASSED
kafka.security.auth.SimpleAclAuthorizerTest > testAddAclsOnLiteralResource STARTED
kafka.security.auth.SimpleAclAuthorizerTest > testAddAclsOnLiteralResource PASSED
kafka.security.auth.SimpleAclAuthorizerTest > testAuthorizeThrowsOnNoneLiteralResource STARTED
kafka.security.auth.SimpleAclAuthorizerTest > testAuthorizeThrowsOnNoneLiteralResource PASSED
kafka.security.auth.SimpleAclAuthorizerTest > testGetAclsPrincipal STARTED
kafka.security.auth.SimpleAclAuthorizerTest > testGetAclsPrincipal PASSED
kafka.security.auth.SimpleAclAuthorizerTest > testAddAclsOnPrefiexedResource STARTED
kafka.security.auth.SimpleAclAuthorizerTest > testAddAclsOnPrefiexedResource PASSED
kafka.security.auth.SimpleAclAuthorizerTest > testWritesExtendedAclChangeEventIfInterBrokerProtocolNotSet STARTED
kafka.security.auth.SimpleAclAuthorizerTest > testWritesExtendedAclChangeEventIfInterBrokerProtocolNotSet PASSED
kafka.security.auth.SimpleAclAuthorizerTest > testAccessAllowedIfAllowAclExistsOnWildcardResource STARTED
kafka.security.auth.SimpleAclAuthorizerTest > testAccessAllowedIfAllowAclExistsOnWildcardResource PASSED
kafka.security.auth.SimpleAclAuthorizerTest > testLoadCache STARTED
kafka.security.auth.SimpleAclAuthorizerTest > testLoadCache PASSED
kafka.security.auth.ZkAuthorizationTest > testIsZkSecurityEnabled STARTED
kafka.security.auth.ZkAuthorizationTest > testIsZkSecurityEnabled PASSED
kafka.security.auth.ZkAuthorizationTest > testZkUtils STARTED
kafka.security.auth.ZkAuthorizationTest > testZkUtils PASSED
kafka.security.auth.ZkAuthorizationTest > testZkAntiMigration STARTED
kafka.security.auth.ZkAuthorizationTest > testZkAntiMigration PASSED
kafka.security.auth.ZkAuthorizationTest > testZkMigration STARTED
kafka.security.auth.ZkAuthorizationTest > testZkMigration PASSED
kafka.security.auth.ZkAuthorizationTest > testChroot STARTED
kafka.security.auth.ZkAuthorizationTest > testChroot PASSED
kafka.security.auth.ZkAuthorizationTest > testDelete STARTED
kafka.security.auth.ZkAuthorizationTest > testDelete PASSED
kafka.security.auth.ZkAuthorizationTest > testDeleteRecursive STARTED
kafka.security.auth.ZkAuthorizationTest > testDeleteRecursive PASSED
kafka.security.auth.ResourceTest > shouldParseOldTwoPartString STARTED
kafka.security.auth.ResourceTest > shouldParseOldTwoPartString PASSED
kafka.security.auth.ResourceTest > shouldParseOldTwoPartWithEmbeddedSeparators STARTED
kafka.security.auth.ResourceTest > shouldParseOldTwoPartWithEmbeddedSeparators PASSED
kafka.security.auth.ResourceTest > shouldThrowOnTwoPartStringWithUnknownResourceType STARTED
kafka.security.auth.ResourceTest > shouldThrowOnTwoPartStringWithUnknownResourceType PASSED
kafka.security.auth.ResourceTest > shouldThrowOnBadResourceTypeSeparator STARTED
kafka.security.auth.ResourceTest > shouldThrowOnBadResourceTypeSeparator PASSED
kafka.security.auth.ResourceTest > shouldParseThreePartString STARTED
kafka.security.auth.ResourceTest > shouldParseThreePartString PASSED
kafka.security.auth.ResourceTest > shouldRoundTripViaString STARTED
kafka.security.auth.ResourceTest > shouldRoundTripViaString PASSED
kafka.security.auth.ResourceTest > shouldParseThreePartWithEmbeddedSeparators STARTED
kafka.security.auth.ResourceTest > shouldParseThreePartWithEmbeddedSeparators PASSED
kafka.security.auth.AclTest > testAclJsonConversion STARTED
kafka.security.auth.AclTest > testAclJsonConversion PASSED
kafka.security.auth.OperationTest > testJavaConversions STARTED
kafka.security.auth.OperationTest > testJavaConversions PASSED
kafka.security.auth.PermissionTypeTest > testJavaConversions STARTED
kafka.security.auth.PermissionTypeTest > testJavaConversions PASSED
kafka.security.auth.PermissionTypeTest > testFromString STARTED
kafka.security.auth.PermissionTypeTest > testFromString PASSED
kafka.security.token.delegation.DelegationTokenManagerTest > testPeriodicTokenExpiry STARTED
kafka.security.token.delegation.DelegationTokenManagerTest > testPeriodicTokenExpiry PASSED
kafka.security.token.delegation.DelegationTokenManagerTest > testTokenRequestsWithDelegationTokenDisabled STARTED
kafka.security.token.delegation.DelegationTokenManagerTest > testTokenRequestsWithDelegationTokenDisabled PASSED
kafka.security.token.delegation.DelegationTokenManagerTest > testDescribeToken STARTED
kafka.security.token.delegation.DelegationTokenManagerTest > testDescribeToken PASSED
kafka.security.token.delegation.DelegationTokenManagerTest > testCreateToken STARTED
kafka.security.token.delegation.DelegationTokenManagerTest > testCreateToken PASSED
kafka.security.token.delegation.DelegationTokenManagerTest > testExpireToken STARTED
kafka.security.token.delegation.DelegationTokenManagerTest > testExpireToken PASSED
kafka.security.token.delegation.DelegationTokenManagerTest > testRenewToken STARTED
kafka.security.token.delegation.DelegationTokenManagerTest > testRenewToken PASSED
2031 tests completed, 1 failed, 4 skipped
> Task :kafka-trunk-jdk8:core:test FAILED
> Task :testScala_2_11 FAILED
FAILURE: Build failed with an exception.
* What went wrong:
Execution failed for task ':kafka-trunk-jdk8:core:test'.
> There were failing tests. See the report at: file://<https://builds.apache.org/job/kafka-trunk-jdk8/ws/core/build/reports/tests/test/index.html>
* Try:
Run with --stacktrace option to get the stack trace. Run with --info or --debug option to get more log output. Run with --scan to get full insights.
* Get more help at https://help.gradle.org
BUILD FAILED in 1h 47m 45s
25 actionable tasks: 9 executed, 16 up-to-date
Build step 'Execute shell' marked build as failure
[FINDBUGS] Collecting findbugs analysis files...
Setting GRADLE_4_8_1_HOME=/home/jenkins/tools/gradle/4.8.1
[FINDBUGS] Searching for all files in <https://builds.apache.org/job/kafka-trunk-jdk8/ws/> that match the pattern **/build/reports/findbugs/*.xml
[FINDBUGS] Parsing 1 file in <https://builds.apache.org/job/kafka-trunk-jdk8/ws/>
[FINDBUGS] Successfully parsed file <https://builds.apache.org/job/kafka-trunk-jdk8/ws/core/build/reports/findbugs/main.xml> with 0 unique warnings and 0 duplicates.
Setting GRADLE_4_8_1_HOME=/home/jenkins/tools/gradle/4.8.1
Setting GRADLE_4_8_1_HOME=/home/jenkins/tools/gradle/4.8.1
<Git Blamer> Using GitBlamer to create author and commit information for all warnings.
<Git Blamer> GIT_COMMIT=609c81ec8b190f4812e7008b30fc509ee1656d68, workspace=<https://builds.apache.org/job/kafka-trunk-jdk8/ws/>
[FINDBUGS] Computing warning deltas based on reference build #2859
Recording test results
Setting GRADLE_4_8_1_HOME=/home/jenkins/tools/gradle/4.8.1
Setting GRADLE_4_8_1_HOME=/home/jenkins/tools/gradle/4.8.1
Not sending mail to unregistered user wangguoz@gmail.com
Not sending mail to unregistered user rajinisivaram@googlemail.com
Not sending mail to unregistered user noreply@github.com
Build failed in Jenkins: kafka-trunk-jdk8 #2866
Posted by Apache Jenkins Server <je...@builds.apache.org>.
See <https://builds.apache.org/job/kafka-trunk-jdk8/2866/display/redirect?page=changes>
Changes:
[mjsax] MINOR: clean up window store interface to avoid confusion (#5359)
------------------------------------------
[...truncated 875.78 KB...]
kafka.security.auth.SimpleAclAuthorizerTest > testAclInheritance PASSED
kafka.security.auth.SimpleAclAuthorizerTest > testDistributedConcurrentModificationOfResourceAcls STARTED
kafka.security.auth.SimpleAclAuthorizerTest > testDistributedConcurrentModificationOfResourceAcls PASSED
kafka.security.auth.SimpleAclAuthorizerTest > testAddAclsOnWildcardResource STARTED
kafka.security.auth.SimpleAclAuthorizerTest > testAddAclsOnWildcardResource PASSED
kafka.security.auth.SimpleAclAuthorizerTest > testWritesExtendedAclChangeEventWhenInterBrokerProtocolAtLeastKafkaV2 STARTED
kafka.security.auth.SimpleAclAuthorizerTest > testWritesExtendedAclChangeEventWhenInterBrokerProtocolAtLeastKafkaV2 PASSED
kafka.security.auth.SimpleAclAuthorizerTest > testAclManagementAPIs STARTED
kafka.security.auth.SimpleAclAuthorizerTest > testAclManagementAPIs PASSED
kafka.security.auth.SimpleAclAuthorizerTest > testWildCardAcls STARTED
kafka.security.auth.SimpleAclAuthorizerTest > testWildCardAcls PASSED
kafka.security.auth.SimpleAclAuthorizerTest > testWritesLiteralAclChangeEventWhenInterBrokerProtocolIsKafkaV2 STARTED
kafka.security.auth.SimpleAclAuthorizerTest > testWritesLiteralAclChangeEventWhenInterBrokerProtocolIsKafkaV2 PASSED
kafka.security.auth.SimpleAclAuthorizerTest > testTopicAcl STARTED
kafka.security.auth.SimpleAclAuthorizerTest > testTopicAcl PASSED
kafka.security.auth.SimpleAclAuthorizerTest > testSuperUserHasAccess STARTED
kafka.security.auth.SimpleAclAuthorizerTest > testSuperUserHasAccess PASSED
kafka.security.auth.SimpleAclAuthorizerTest > testDeleteAclOnPrefixedResource STARTED
kafka.security.auth.SimpleAclAuthorizerTest > testDeleteAclOnPrefixedResource PASSED
kafka.security.auth.SimpleAclAuthorizerTest > testDenyTakesPrecedence STARTED
kafka.security.auth.SimpleAclAuthorizerTest > testDenyTakesPrecedence PASSED
kafka.security.auth.SimpleAclAuthorizerTest > testNoAclFoundOverride STARTED
kafka.security.auth.SimpleAclAuthorizerTest > testNoAclFoundOverride PASSED
kafka.security.auth.SimpleAclAuthorizerTest > testEmptyAclThrowsException STARTED
kafka.security.auth.SimpleAclAuthorizerTest > testEmptyAclThrowsException PASSED
kafka.security.auth.SimpleAclAuthorizerTest > testSuperUserWithCustomPrincipalHasAccess STARTED
kafka.security.auth.SimpleAclAuthorizerTest > testSuperUserWithCustomPrincipalHasAccess PASSED
kafka.security.auth.SimpleAclAuthorizerTest > testAllowAccessWithCustomPrincipal STARTED
kafka.security.auth.SimpleAclAuthorizerTest > testAllowAccessWithCustomPrincipal PASSED
kafka.security.auth.SimpleAclAuthorizerTest > testDeleteAclOnWildcardResource STARTED
kafka.security.auth.SimpleAclAuthorizerTest > testDeleteAclOnWildcardResource PASSED
kafka.security.auth.SimpleAclAuthorizerTest > testChangeListenerTiming STARTED
kafka.security.auth.SimpleAclAuthorizerTest > testChangeListenerTiming PASSED
kafka.security.auth.SimpleAclAuthorizerTest > testWritesLiteralWritesLiteralAclChangeEventWhenInterBrokerProtocolLessThanKafkaV2eralAclChangesForOlderProtocolVersions STARTED
kafka.security.auth.SimpleAclAuthorizerTest > testWritesLiteralWritesLiteralAclChangeEventWhenInterBrokerProtocolLessThanKafkaV2eralAclChangesForOlderProtocolVersions PASSED
kafka.security.auth.SimpleAclAuthorizerTest > testThrowsOnAddPrefixedAclIfInterBrokerProtocolVersionTooLow STARTED
kafka.security.auth.SimpleAclAuthorizerTest > testThrowsOnAddPrefixedAclIfInterBrokerProtocolVersionTooLow PASSED
kafka.security.auth.SimpleAclAuthorizerTest > testAccessAllowedIfAllowAclExistsOnPrefixedResource STARTED
kafka.security.auth.SimpleAclAuthorizerTest > testAccessAllowedIfAllowAclExistsOnPrefixedResource PASSED
kafka.security.auth.SimpleAclAuthorizerTest > testHighConcurrencyModificationOfResourceAcls STARTED
kafka.security.auth.SimpleAclAuthorizerTest > testHighConcurrencyModificationOfResourceAcls PASSED
kafka.security.auth.SimpleAclAuthorizerTest > testAuthorizeWithEmptyResourceName STARTED
kafka.security.auth.SimpleAclAuthorizerTest > testAuthorizeWithEmptyResourceName PASSED
kafka.security.auth.SimpleAclAuthorizerTest > testDeleteAllAclOnPrefixedResource STARTED
kafka.security.auth.SimpleAclAuthorizerTest > testDeleteAllAclOnPrefixedResource PASSED
kafka.security.auth.SimpleAclAuthorizerTest > testAddAclsOnLiteralResource STARTED
kafka.security.auth.SimpleAclAuthorizerTest > testAddAclsOnLiteralResource PASSED
kafka.security.auth.SimpleAclAuthorizerTest > testAuthorizeThrowsOnNoneLiteralResource STARTED
kafka.security.auth.SimpleAclAuthorizerTest > testAuthorizeThrowsOnNoneLiteralResource PASSED
kafka.security.auth.SimpleAclAuthorizerTest > testGetAclsPrincipal STARTED
kafka.security.auth.SimpleAclAuthorizerTest > testGetAclsPrincipal PASSED
kafka.security.auth.SimpleAclAuthorizerTest > testAddAclsOnPrefiexedResource STARTED
kafka.security.auth.SimpleAclAuthorizerTest > testAddAclsOnPrefiexedResource PASSED
kafka.security.auth.SimpleAclAuthorizerTest > testWritesExtendedAclChangeEventIfInterBrokerProtocolNotSet STARTED
kafka.security.auth.SimpleAclAuthorizerTest > testWritesExtendedAclChangeEventIfInterBrokerProtocolNotSet PASSED
kafka.security.auth.SimpleAclAuthorizerTest > testAccessAllowedIfAllowAclExistsOnWildcardResource STARTED
kafka.security.auth.SimpleAclAuthorizerTest > testAccessAllowedIfAllowAclExistsOnWildcardResource PASSED
kafka.security.auth.SimpleAclAuthorizerTest > testLoadCache STARTED
kafka.security.auth.SimpleAclAuthorizerTest > testLoadCache PASSED
kafka.security.auth.ZkAuthorizationTest > testIsZkSecurityEnabled STARTED
kafka.security.auth.ZkAuthorizationTest > testIsZkSecurityEnabled PASSED
kafka.security.auth.ZkAuthorizationTest > testZkUtils STARTED
kafka.security.auth.ZkAuthorizationTest > testZkUtils PASSED
kafka.security.auth.ZkAuthorizationTest > testZkAntiMigration STARTED
kafka.security.auth.ZkAuthorizationTest > testZkAntiMigration PASSED
kafka.security.auth.ZkAuthorizationTest > testZkMigration STARTED
kafka.security.auth.ZkAuthorizationTest > testZkMigration PASSED
kafka.security.auth.ZkAuthorizationTest > testChroot STARTED
kafka.security.auth.ZkAuthorizationTest > testChroot PASSED
kafka.security.auth.ZkAuthorizationTest > testDelete STARTED
kafka.security.auth.ZkAuthorizationTest > testDelete PASSED
kafka.security.auth.ZkAuthorizationTest > testDeleteRecursive STARTED
kafka.security.auth.ZkAuthorizationTest > testDeleteRecursive PASSED
kafka.security.auth.ResourceTest > shouldParseOldTwoPartString STARTED
kafka.security.auth.ResourceTest > shouldParseOldTwoPartString PASSED
kafka.security.auth.ResourceTest > shouldParseOldTwoPartWithEmbeddedSeparators STARTED
kafka.security.auth.ResourceTest > shouldParseOldTwoPartWithEmbeddedSeparators PASSED
kafka.security.auth.ResourceTest > shouldThrowOnTwoPartStringWithUnknownResourceType STARTED
kafka.security.auth.ResourceTest > shouldThrowOnTwoPartStringWithUnknownResourceType PASSED
kafka.security.auth.ResourceTest > shouldThrowOnBadResourceTypeSeparator STARTED
kafka.security.auth.ResourceTest > shouldThrowOnBadResourceTypeSeparator PASSED
kafka.security.auth.ResourceTest > shouldParseThreePartString STARTED
kafka.security.auth.ResourceTest > shouldParseThreePartString PASSED
kafka.security.auth.ResourceTest > shouldRoundTripViaString STARTED
kafka.security.auth.ResourceTest > shouldRoundTripViaString PASSED
kafka.security.auth.ResourceTest > shouldParseThreePartWithEmbeddedSeparators STARTED
kafka.security.auth.ResourceTest > shouldParseThreePartWithEmbeddedSeparators PASSED
kafka.security.auth.AclTest > testAclJsonConversion STARTED
kafka.security.auth.AclTest > testAclJsonConversion PASSED
kafka.security.auth.OperationTest > testJavaConversions STARTED
kafka.security.auth.OperationTest > testJavaConversions PASSED
kafka.security.auth.PermissionTypeTest > testJavaConversions STARTED
kafka.security.auth.PermissionTypeTest > testJavaConversions PASSED
kafka.security.auth.PermissionTypeTest > testFromString STARTED
kafka.security.auth.PermissionTypeTest > testFromString PASSED
kafka.security.token.delegation.DelegationTokenManagerTest > testPeriodicTokenExpiry STARTED
kafka.security.token.delegation.DelegationTokenManagerTest > testPeriodicTokenExpiry PASSED
kafka.security.token.delegation.DelegationTokenManagerTest > testTokenRequestsWithDelegationTokenDisabled STARTED
kafka.security.token.delegation.DelegationTokenManagerTest > testTokenRequestsWithDelegationTokenDisabled PASSED
kafka.security.token.delegation.DelegationTokenManagerTest > testDescribeToken STARTED
kafka.security.token.delegation.DelegationTokenManagerTest > testDescribeToken PASSED
kafka.security.token.delegation.DelegationTokenManagerTest > testCreateToken STARTED
kafka.security.token.delegation.DelegationTokenManagerTest > testCreateToken PASSED
kafka.security.token.delegation.DelegationTokenManagerTest > testExpireToken STARTED
kafka.security.token.delegation.DelegationTokenManagerTest > testExpireToken PASSED
kafka.security.token.delegation.DelegationTokenManagerTest > testRenewToken STARTED
kafka.security.token.delegation.DelegationTokenManagerTest > testRenewToken PASSED
2031 tests completed, 1 failed, 4 skipped
> Task :kafka-trunk-jdk8:core:test FAILED
> Task :testScala_2_12 FAILED
FAILURE: Build failed with an exception.
* What went wrong:
Execution failed for task ':kafka-trunk-jdk8:core:test'.
> There were failing tests. See the report at: file://<https://builds.apache.org/job/kafka-trunk-jdk8/ws/core/build/reports/tests/test/index.html>
* Try:
Run with --stacktrace option to get the stack trace. Run with --info or --debug option to get more log output. Run with --scan to get full insights.
* Get more help at https://help.gradle.org
BUILD FAILED in 3h 25m 3s
26 actionable tasks: 12 executed, 14 up-to-date
Build step 'Execute shell' marked build as failure
[FINDBUGS] Collecting findbugs analysis files...
Setting GRADLE_4_8_1_HOME=/home/jenkins/tools/gradle/4.8.1
[FINDBUGS] Searching for all files in <https://builds.apache.org/job/kafka-trunk-jdk8/ws/> that match the pattern **/build/reports/findbugs/*.xml
[FINDBUGS] Parsing 2 files in <https://builds.apache.org/job/kafka-trunk-jdk8/ws/>
[FINDBUGS] Successfully parsed file <https://builds.apache.org/job/kafka-trunk-jdk8/ws/core/build/reports/findbugs/main.xml> with 0 unique warnings and 0 duplicates.
[FINDBUGS] Successfully parsed file <https://builds.apache.org/job/kafka-trunk-jdk8/ws/streams/streams-scala/build/reports/findbugs/main.xml> with 0 unique warnings and 0 duplicates.
Setting GRADLE_4_8_1_HOME=/home/jenkins/tools/gradle/4.8.1
Setting GRADLE_4_8_1_HOME=/home/jenkins/tools/gradle/4.8.1
<Git Blamer> Using GitBlamer to create author and commit information for all warnings.
<Git Blamer> GIT_COMMIT=b9f11796944056a5b3c7440033d587d19290b3c3, workspace=<https://builds.apache.org/job/kafka-trunk-jdk8/ws/>
[FINDBUGS] Computing warning deltas based on reference build #2859
Recording test results
Setting GRADLE_4_8_1_HOME=/home/jenkins/tools/gradle/4.8.1
Setting GRADLE_4_8_1_HOME=/home/jenkins/tools/gradle/4.8.1
Not sending mail to unregistered user wangguoz@gmail.com
Not sending mail to unregistered user noreply@github.com
Build failed in Jenkins: kafka-trunk-jdk8 #2865
Posted by Apache Jenkins Server <je...@builds.apache.org>.
See <https://builds.apache.org/job/kafka-trunk-jdk8/2865/display/redirect?page=changes>
Changes:
[wangguoz] MINOR: close producer instance in AbstractJoinIntegrationTest (#5459)
------------------------------------------
[...truncated 2.47 MB...]
org.apache.kafka.streams.TopologyTest > shouldThrowOnUnassignedStateStoreAccess STARTED
org.apache.kafka.streams.TopologyTest > shouldThrowOnUnassignedStateStoreAccess PASSED
org.apache.kafka.streams.TopologyTest > shouldNotAllowNullProcessorNameWhenConnectingProcessorAndStateStores STARTED
org.apache.kafka.streams.TopologyTest > shouldNotAllowNullProcessorNameWhenConnectingProcessorAndStateStores PASSED
org.apache.kafka.streams.TopologyTest > kTableAnonymousMaterializedMapValuesShouldPreserveTopologyStructure STARTED
org.apache.kafka.streams.TopologyTest > kTableAnonymousMaterializedMapValuesShouldPreserveTopologyStructure PASSED
org.apache.kafka.streams.TopologyTest > sessionWindowZeroArgCountShouldPreserveTopologyStructure STARTED
org.apache.kafka.streams.TopologyTest > sessionWindowZeroArgCountShouldPreserveTopologyStructure PASSED
org.apache.kafka.streams.TopologyTest > tableAnonymousMaterializedCountShouldPreserveTopologyStructure STARTED
org.apache.kafka.streams.TopologyTest > tableAnonymousMaterializedCountShouldPreserveTopologyStructure PASSED
org.apache.kafka.streams.TopologyTest > shouldDescribeGlobalStoreTopology STARTED
org.apache.kafka.streams.TopologyTest > shouldDescribeGlobalStoreTopology PASSED
org.apache.kafka.streams.TopologyTest > kTableNonMaterializedMapValuesShouldPreserveTopologyStructure STARTED
org.apache.kafka.streams.TopologyTest > kTableNonMaterializedMapValuesShouldPreserveTopologyStructure PASSED
org.apache.kafka.streams.TopologyTest > kGroupedStreamAnonymousMaterializedCountShouldPreserveTopologyStructure STARTED
org.apache.kafka.streams.TopologyTest > kGroupedStreamAnonymousMaterializedCountShouldPreserveTopologyStructure PASSED
org.apache.kafka.streams.TopologyTest > shouldDescribeMultipleGlobalStoreTopology STARTED
org.apache.kafka.streams.TopologyTest > shouldDescribeMultipleGlobalStoreTopology PASSED
org.apache.kafka.streams.TopologyTest > shouldNotAllowToAddSinkWithSameName STARTED
org.apache.kafka.streams.TopologyTest > shouldNotAllowToAddSinkWithSameName PASSED
org.apache.kafka.streams.TopologyTest > shouldNotAllowToAddSinkWithNullParents STARTED
org.apache.kafka.streams.TopologyTest > shouldNotAllowToAddSinkWithNullParents PASSED
org.apache.kafka.streams.TopologyTest > shouldNotAllowNullProcessorSupplierWhenAddingProcessor STARTED
org.apache.kafka.streams.TopologyTest > shouldNotAllowNullProcessorSupplierWhenAddingProcessor PASSED
org.apache.kafka.streams.TopologyTest > timeWindowAnonymousMaterializedCountShouldPreserveTopologyStructure STARTED
org.apache.kafka.streams.TopologyTest > timeWindowAnonymousMaterializedCountShouldPreserveTopologyStructure PASSED
org.apache.kafka.streams.TopologyTest > shouldFailIfSinkIsParent STARTED
org.apache.kafka.streams.TopologyTest > shouldFailIfSinkIsParent PASSED
org.apache.kafka.streams.TopologyTest > shouldNotAllowToAddSourcesWithSameName STARTED
org.apache.kafka.streams.TopologyTest > shouldNotAllowToAddSourcesWithSameName PASSED
org.apache.kafka.streams.TopologyTest > sourceAndProcessorWithMultipleStatesShouldHaveSingleSubtopology STARTED
org.apache.kafka.streams.TopologyTest > sourceAndProcessorWithMultipleStatesShouldHaveSingleSubtopology PASSED
org.apache.kafka.streams.TopologyTest > shouldDescribeEmptyTopology STARTED
org.apache.kafka.streams.TopologyTest > shouldDescribeEmptyTopology PASSED
org.apache.kafka.streams.TopologyTest > shouldFailIfSinkIsItsOwnParent STARTED
org.apache.kafka.streams.TopologyTest > shouldFailIfSinkIsItsOwnParent PASSED
org.apache.kafka.streams.TopologyTest > testPatternMatchesAlreadyProvidedTopicSource STARTED
org.apache.kafka.streams.TopologyTest > testPatternMatchesAlreadyProvidedTopicSource PASSED
org.apache.kafka.streams.TopologyTest > singleSourcePatternShouldHaveSingleSubtopology STARTED
org.apache.kafka.streams.TopologyTest > singleSourcePatternShouldHaveSingleSubtopology PASSED
org.apache.kafka.streams.TopologyTest > kTableNonMaterializedFilterShouldPreserveTopologyStructure STARTED
org.apache.kafka.streams.TopologyTest > kTableNonMaterializedFilterShouldPreserveTopologyStructure PASSED
org.apache.kafka.streams.TopologyTest > singleSourceShouldHaveSingleSubtopology STARTED
org.apache.kafka.streams.TopologyTest > singleSourceShouldHaveSingleSubtopology PASSED
org.apache.kafka.streams.TopologyTest > shouldNotAllowNullTopicChooserWhenAddingSink STARTED
org.apache.kafka.streams.TopologyTest > shouldNotAllowNullTopicChooserWhenAddingSink PASSED
org.apache.kafka.streams.TopologyTest > processorsWithSameSinkShouldHaveSameSubtopology STARTED
org.apache.kafka.streams.TopologyTest > processorsWithSameSinkShouldHaveSameSubtopology PASSED
org.apache.kafka.streams.TopologyTest > shouldNotAllowNullTopicsWhenAddingSoureWithTopic STARTED
org.apache.kafka.streams.TopologyTest > shouldNotAllowNullTopicsWhenAddingSoureWithTopic PASSED
org.apache.kafka.streams.TopologyTest > shouldFailWithUnknownParent STARTED
org.apache.kafka.streams.TopologyTest > shouldFailWithUnknownParent PASSED
org.apache.kafka.streams.TopologyTest > kTableAnonymousMaterializedFilterShouldPreserveTopologyStructure STARTED
org.apache.kafka.streams.TopologyTest > kTableAnonymousMaterializedFilterShouldPreserveTopologyStructure PASSED
org.apache.kafka.streams.TopologyTest > shouldNotAllowToAddProcessorWithEmptyParents STARTED
org.apache.kafka.streams.TopologyTest > shouldNotAllowToAddProcessorWithEmptyParents PASSED
org.apache.kafka.streams.TopologyTest > sessionWindowAnonymousMaterializedCountShouldPreserveTopologyStructure STARTED
org.apache.kafka.streams.TopologyTest > sessionWindowAnonymousMaterializedCountShouldPreserveTopologyStructure PASSED
org.apache.kafka.streams.TopologyTest > shouldFailIfNodeIsItsOwnParent STARTED
org.apache.kafka.streams.TopologyTest > shouldFailIfNodeIsItsOwnParent PASSED
org.apache.kafka.streams.TopologyTest > shouldNotAllowToAddStateStoreToSource STARTED
org.apache.kafka.streams.TopologyTest > shouldNotAllowToAddStateStoreToSource PASSED
org.apache.kafka.streams.TopologyTest > shouldNotAllowNullNameWhenAddingProcessor STARTED
org.apache.kafka.streams.TopologyTest > shouldNotAllowNullNameWhenAddingProcessor PASSED
org.apache.kafka.streams.TopologyTest > shouldNotAllowToAddStoreWithSameName STARTED
org.apache.kafka.streams.TopologyTest > shouldNotAllowToAddStoreWithSameName PASSED
org.apache.kafka.streams.TopologyTest > shouldNotAllowToAddProcessorWithNullParents STARTED
org.apache.kafka.streams.TopologyTest > shouldNotAllowToAddProcessorWithNullParents PASSED
org.apache.kafka.streams.TopologyTest > shouldNotAllowNullNameWhenAddingSourceWithPattern STARTED
org.apache.kafka.streams.TopologyTest > shouldNotAllowNullNameWhenAddingSourceWithPattern PASSED
org.apache.kafka.streams.TopologyTest > multipleSourcesWithSinksShouldHaveDistinctSubtopologies STARTED
org.apache.kafka.streams.TopologyTest > multipleSourcesWithSinksShouldHaveDistinctSubtopologies PASSED
org.apache.kafka.streams.TopologyTest > kGroupedStreamZeroArgCountShouldPreserveTopologyStructure STARTED
org.apache.kafka.streams.TopologyTest > kGroupedStreamZeroArgCountShouldPreserveTopologyStructure PASSED
org.apache.kafka.streams.TopologyTest > sessionWindowNamedMaterializedCountShouldPreserveTopologyStructure STARTED
org.apache.kafka.streams.TopologyTest > sessionWindowNamedMaterializedCountShouldPreserveTopologyStructure PASSED
org.apache.kafka.streams.tools.StreamsResetterTest > testShiftOffsetByWhenBetweenBeginningAndEndOffset STARTED
org.apache.kafka.streams.tools.StreamsResetterTest > testShiftOffsetByWhenBetweenBeginningAndEndOffset PASSED
org.apache.kafka.streams.tools.StreamsResetterTest > testResetToSpecificOffsetWhenAfterEndOffset STARTED
org.apache.kafka.streams.tools.StreamsResetterTest > testResetToSpecificOffsetWhenAfterEndOffset PASSED
org.apache.kafka.streams.tools.StreamsResetterTest > shouldAcceptValidDateFormats STARTED
org.apache.kafka.streams.tools.StreamsResetterTest > shouldAcceptValidDateFormats PASSED
org.apache.kafka.streams.tools.StreamsResetterTest > shouldDeleteTopic STARTED
org.apache.kafka.streams.tools.StreamsResetterTest > shouldDeleteTopic PASSED
org.apache.kafka.streams.tools.StreamsResetterTest > testResetToSpecificOffsetWhenBetweenBeginningAndEndOffset STARTED
org.apache.kafka.streams.tools.StreamsResetterTest > testResetToSpecificOffsetWhenBetweenBeginningAndEndOffset PASSED
org.apache.kafka.streams.tools.StreamsResetterTest > testShiftOffsetByWhenAfterEndOffset STARTED
org.apache.kafka.streams.tools.StreamsResetterTest > testShiftOffsetByWhenAfterEndOffset PASSED
org.apache.kafka.streams.tools.StreamsResetterTest > testResetToSpecificOffsetWhenBeforeBeginningOffset STARTED
org.apache.kafka.streams.tools.StreamsResetterTest > testResetToSpecificOffsetWhenBeforeBeginningOffset PASSED
org.apache.kafka.streams.tools.StreamsResetterTest > shouldSeekToEndOffset STARTED
org.apache.kafka.streams.tools.StreamsResetterTest > shouldSeekToEndOffset PASSED
org.apache.kafka.streams.tools.StreamsResetterTest > testResetUsingPlanWhenBetweenBeginningAndEndOffset STARTED
org.apache.kafka.streams.tools.StreamsResetterTest > testResetUsingPlanWhenBetweenBeginningAndEndOffset PASSED
org.apache.kafka.streams.tools.StreamsResetterTest > testResetUsingPlanWhenBeforeBeginningOffset STARTED
org.apache.kafka.streams.tools.StreamsResetterTest > testResetUsingPlanWhenBeforeBeginningOffset PASSED
org.apache.kafka.streams.tools.StreamsResetterTest > shouldThrowOnInvalidDateFormat STARTED
org.apache.kafka.streams.tools.StreamsResetterTest > shouldThrowOnInvalidDateFormat PASSED
org.apache.kafka.streams.tools.StreamsResetterTest > testResetUsingPlanWhenAfterEndOffset STARTED
org.apache.kafka.streams.tools.StreamsResetterTest > testResetUsingPlanWhenAfterEndOffset PASSED
org.apache.kafka.streams.tools.StreamsResetterTest > testShiftOffsetByWhenBeforeBeginningOffset STARTED
org.apache.kafka.streams.tools.StreamsResetterTest > testShiftOffsetByWhenBeforeBeginningOffset PASSED
org.apache.kafka.streams.KeyValueTest > shouldHaveSaneEqualsAndHashCode STARTED
org.apache.kafka.streams.KeyValueTest > shouldHaveSaneEqualsAndHashCode PASSED
pure virtual method called
terminate called without an active exception
> Task :streams:test FAILED
FAILURE: Build failed with an exception.
* What went wrong:
Execution failed for task ':streams:test'.
> Process 'Gradle Test Executor 16' finished with non-zero exit value 134
This problem might be caused by incorrect test process configuration.
Please refer to the test execution section in the user guide at https://docs.gradle.org/4.8.1/userguide/java_plugin.html#sec:test_execution
* Try:
Run with --stacktrace option to get the stack trace. Run with --info or --debug option to get more log output. Run with --scan to get full insights.
* Get more help at https://help.gradle.org
BUILD FAILED in 3h 58m 57s
68 actionable tasks: 37 executed, 31 up-to-date
Build step 'Execute shell' marked build as failure
[FINDBUGS] Collecting findbugs analysis files...
Setting GRADLE_4_8_1_HOME=/home/jenkins/tools/gradle/4.8.1
[FINDBUGS] Searching for all files in <https://builds.apache.org/job/kafka-trunk-jdk8/ws/> that match the pattern **/build/reports/findbugs/*.xml
[FINDBUGS] Parsing 6 files in <https://builds.apache.org/job/kafka-trunk-jdk8/ws/>
[FINDBUGS] Successfully parsed file <https://builds.apache.org/job/kafka-trunk-jdk8/ws/clients/build/reports/findbugs/main.xml> with 0 unique warnings and 0 duplicates.
[FINDBUGS] Successfully parsed file <https://builds.apache.org/job/kafka-trunk-jdk8/ws/core/build/reports/findbugs/main.xml> with 0 unique warnings and 0 duplicates.
[FINDBUGS] Successfully parsed file <https://builds.apache.org/job/kafka-trunk-jdk8/ws/examples/build/reports/findbugs/main.xml> with 0 unique warnings and 0 duplicates.
[FINDBUGS] Successfully parsed file <https://builds.apache.org/job/kafka-trunk-jdk8/ws/log4j-appender/build/reports/findbugs/main.xml> with 0 unique warnings and 0 duplicates.
[FINDBUGS] Successfully parsed file <https://builds.apache.org/job/kafka-trunk-jdk8/ws/streams/build/reports/findbugs/main.xml> with 0 unique warnings and 0 duplicates.
[FINDBUGS] Successfully parsed file <https://builds.apache.org/job/kafka-trunk-jdk8/ws/streams/streams-scala/build/reports/findbugs/main.xml> with 0 unique warnings and 0 duplicates.
Setting GRADLE_4_8_1_HOME=/home/jenkins/tools/gradle/4.8.1
Setting GRADLE_4_8_1_HOME=/home/jenkins/tools/gradle/4.8.1
<Git Blamer> Using GitBlamer to create author and commit information for all warnings.
<Git Blamer> GIT_COMMIT=924466ad627d96fd1851722fdbb02dd6cd71eafa, workspace=<https://builds.apache.org/job/kafka-trunk-jdk8/ws/>
[FINDBUGS] Computing warning deltas based on reference build #2859
Recording test results
Setting GRADLE_4_8_1_HOME=/home/jenkins/tools/gradle/4.8.1
Setting GRADLE_4_8_1_HOME=/home/jenkins/tools/gradle/4.8.1
Not sending mail to unregistered user wangguoz@gmail.com
Not sending mail to unregistered user noreply@github.com
Build failed in Jenkins: kafka-trunk-jdk8 #2864
Posted by Apache Jenkins Server <je...@builds.apache.org>.
See <https://builds.apache.org/job/kafka-trunk-jdk8/2864/display/redirect>
------------------------------------------
Started by an SCM change
[EnvInject] - Loading node environment variables.
Building remotely on H32 (ubuntu xenial) in workspace <https://builds.apache.org/job/kafka-trunk-jdk8/ws/>
> git rev-parse --is-inside-work-tree # timeout=10
Fetching changes from the remote Git repository
> git config remote.origin.url https://github.com/apache/kafka.git # timeout=10
Fetching upstream changes from https://github.com/apache/kafka.git
> git --version # timeout=10
> git fetch --tags --progress https://github.com/apache/kafka.git +refs/heads/*:refs/remotes/origin/*
ERROR: Error fetching remote repo 'origin'
hudson.plugins.git.GitException: Failed to fetch from https://github.com/apache/kafka.git
at hudson.plugins.git.GitSCM.fetchFrom(GitSCM.java:888)
at hudson.plugins.git.GitSCM.retrieveChanges(GitSCM.java:1155)
at hudson.plugins.git.GitSCM.checkout(GitSCM.java:1186)
at hudson.scm.SCM.checkout(SCM.java:504)
at hudson.model.AbstractProject.checkout(AbstractProject.java:1208)
at hudson.model.AbstractBuild$AbstractBuildExecution.defaultCheckout(AbstractBuild.java:574)
at jenkins.scm.SCMCheckoutStrategy.checkout(SCMCheckoutStrategy.java:86)
at hudson.model.AbstractBuild$AbstractBuildExecution.run(AbstractBuild.java:499)
at hudson.model.Run.execute(Run.java:1794)
at hudson.model.FreeStyleBuild.run(FreeStyleBuild.java:43)
at hudson.model.ResourceController.execute(ResourceController.java:97)
at hudson.model.Executor.run(Executor.java:429)
Caused by: hudson.plugins.git.GitException: Command "git fetch --tags --progress https://github.com/apache/kafka.git +refs/heads/*:refs/remotes/origin/*" returned status code 128:
stdout:
stderr: error: Could not read 0f3affc0f40751dc8fd064b36b6e859728f63e37
error: Could not read 95fbb2e03f4fe79737c71632e0ef2dfdcfb85a69
error: Could not read 08c465028d057ac23cdfe6d57641fe40240359dd
remote: Counting objects: 7208, done.
remote: Compressing objects: 2% (1/43) remote: Compressing objects: 4% (2/43) remote: Compressing objects: 6% (3/43) remote: Compressing objects: 9% (4/43) remote: Compressing objects: 11% (5/43) remote: Compressing objects: 13% (6/43) remote: Compressing objects: 16% (7/43) remote: Compressing objects: 18% (8/43) remote: Compressing objects: 20% (9/43) remote: Compressing objects: 23% (10/43) remote: Compressing objects: 25% (11/43) remote: Compressing objects: 27% (12/43) remote: Compressing objects: 30% (13/43) remote: Compressing objects: 32% (14/43) remote: Compressing objects: 34% (15/43) remote: Compressing objects: 37% (16/43) remote: Compressing objects: 39% (17/43) remote: Compressing objects: 41% (18/43) remote: Compressing objects: 44% (19/43) remote: Compressing objects: 46% (20/43) remote: Compressing objects: 48% (21/43) remote: Compressing objects: 51% (22/43) remote: Compressing objects: 53% (23/43) remote: Compressing objects: 55% (24/43) remote: Compressing objects: 58% (25/43) remote: Compressing objects: 60% (26/43) remote: Compressing objects: 62% (27/43) remote: Compressing objects: 65% (28/43) remote: Compressing objects: 67% (29/43) remote: Compressing objects: 69% (30/43) remote: Compressing objects: 72% (31/43) remote: Compressing objects: 74% (32/43) remote: Compressing objects: 76% (33/43) remote: Compressing objects: 79% (34/43) remote: Compressing objects: 81% (35/43) remote: Compressing objects: 83% (36/43) remote: Compressing objects: 86% (37/43) remote: Compressing objects: 88% (38/43) remote: Compressing objects: 90% (39/43) remote: Compressing objects: 93% (40/43) remote: Compressing objects: 95% (41/43) remote: Compressing objects: 97% (42/43) remote: Compressing objects: 100% (43/43) remote: Compressing objects: 100% (43/43), done.
Receiving objects: 0% (1/7208) Receiving objects: 1% (73/7208) Receiving objects: 2% (145/7208) Receiving objects: 3% (217/7208) Receiving objects: 4% (289/7208) Receiving objects: 5% (361/7208) Receiving objects: 6% (433/7208) Receiving objects: 7% (505/7208) Receiving objects: 8% (577/7208) Receiving objects: 9% (649/7208) Receiving objects: 10% (721/7208) Receiving objects: 11% (793/7208) Receiving objects: 12% (865/7208) Receiving objects: 13% (938/7208) Receiving objects: 14% (1010/7208) Receiving objects: 15% (1082/7208) Receiving objects: 16% (1154/7208) Receiving objects: 17% (1226/7208) Receiving objects: 18% (1298/7208) Receiving objects: 19% (1370/7208) Receiving objects: 20% (1442/7208) Receiving objects: 21% (1514/7208) Receiving objects: 22% (1586/7208) Receiving objects: 23% (1658/7208) Receiving objects: 24% (1730/7208) Receiving objects: 25% (1802/7208) Receiving objects: 26% (1875/7208) Receiving objects: 27% (1947/7208) Receiving objects: 28% (2019/7208) Receiving objects: 29% (2091/7208) Receiving objects: 30% (2163/7208) Receiving objects: 31% (2235/7208) Receiving objects: 32% (2307/7208) Receiving objects: 33% (2379/7208) Receiving objects: 34% (2451/7208) Receiving objects: 35% (2523/7208) Receiving objects: 36% (2595/7208) Receiving objects: 37% (2667/7208) Receiving objects: 38% (2740/7208) Receiving objects: 39% (2812/7208) Receiving objects: 40% (2884/7208) Receiving objects: 41% (2956/7208) Receiving objects: 42% (3028/7208) Receiving objects: 43% (3100/7208) Receiving objects: 44% (3172/7208) Receiving objects: 45% (3244/7208) Receiving objects: 46% (3316/7208) Receiving objects: 47% (3388/7208) Receiving objects: 48% (3460/7208) Receiving objects: 49% (3532/7208) Receiving objects: 50% (3604/7208) Receiving objects: 51% (3677/7208) Receiving objects: 52% (3749/7208) Receiving objects: 53% (3821/7208) Receiving objects: 54% (3893/7208) Receiving objects: 55% (3965/7208) Receiving objects: 56% (4037/7208) Receiving objects: 57% (4109/7208) Receiving objects: 58% (4181/7208) Receiving objects: 59% (4253/7208) Receiving objects: 60% (4325/7208) Receiving objects: 61% (4397/7208) Receiving objects: 62% (4469/7208) Receiving objects: 63% (4542/7208) Receiving objects: 64% (4614/7208) Receiving objects: 65% (4686/7208) Receiving objects: 66% (4758/7208) Receiving objects: 67% (4830/7208) Receiving objects: 68% (4902/7208) Receiving objects: 69% (4974/7208) Receiving objects: 70% (5046/7208) Receiving objects: 71% (5118/7208) Receiving objects: 72% (5190/7208) Receiving objects: 73% (5262/7208) Receiving objects: 74% (5334/7208) Receiving objects: 75% (5406/7208) Receiving objects: 76% (5479/7208) Receiving objects: 77% (5551/7208) Receiving objects: 78% (5623/7208) Receiving objects: 79% (5695/7208) Receiving objects: 80% (5767/7208) Receiving objects: 81% (5839/7208) Receiving objects: 82% (5911/7208) Receiving objects: 83% (5983/7208) Receiving objects: 84% (6055/7208) Receiving objects: 85% (6127/7208) Receiving objects: 86% (6199/7208) Receiving objects: 87% (6271/7208) Receiving objects: 88% (6344/7208) Receiving objects: 89% (6416/7208) Receiving objects: 90% (6488/7208) Receiving objects: 91% (6560/7208) Receiving objects: 92% (6632/7208) Receiving objects: 93% (6704/7208) Receiving objects: 94% (6776/7208) Receiving objects: 95% (6848/7208) Receiving objects: 96% (6920/7208) Receiving objects: 97% (6992/7208) Receiving objects: 98% (7064/7208) remote: Total 7208 (delta 1952), reused 1985 (delta 1952), pack-reused 5199
Receiving objects: 99% (7136/7208) Receiving objects: 100% (7208/7208) Receiving objects: 100% (7208/7208), 1.95 MiB | 0 bytes/s, done.
Resolving deltas: 0% (0/2743) Resolving deltas: 1% (28/2743) Resolving deltas: 2% (55/2743) Resolving deltas: 3% (85/2743) Resolving deltas: 4% (110/2743) Resolving deltas: 5% (155/2743) Resolving deltas: 6% (165/2743) Resolving deltas: 7% (194/2743) Resolving deltas: 8% (222/2743) Resolving deltas: 11% (321/2743) Resolving deltas: 12% (330/2743) Resolving deltas: 14% (399/2743) Resolving deltas: 15% (412/2743) Resolving deltas: 16% (443/2743) Resolving deltas: 17% (471/2743) Resolving deltas: 18% (500/2743) Resolving deltas: 19% (522/2743) Resolving deltas: 20% (561/2743) Resolving deltas: 21% (599/2743) Resolving deltas: 22% (614/2743) Resolving deltas: 23% (632/2743) Resolving deltas: 24% (663/2743) Resolving deltas: 25% (686/2743) Resolving deltas: 26% (714/2743) Resolving deltas: 27% (741/2743) Resolving deltas: 28% (774/2743) Resolving deltas: 29% (796/2743) Resolving deltas: 30% (823/2743) Resolving deltas: 31% (853/2743) Resolving deltas: 32% (879/2743) Resolving deltas: 33% (906/2743) Resolving deltas: 34% (934/2743) Resolving deltas: 35% (961/2743) Resolving deltas: 36% (988/2743) Resolving deltas: 37% (1015/2743) Resolving deltas: 38% (1043/2743) Resolving deltas: 39% (1070/2743) Resolving deltas: 40% (1098/2743) Resolving deltas: 41% (1125/2743) Resolving deltas: 41% (1134/2743), completed with 180 local objects.
fatal: pack has 1609 unresolved deltas
fatal: index-pack failed
at org.jenkinsci.plugins.gitclient.CliGitAPIImpl.launchCommandIn(CliGitAPIImpl.java:2002)
at org.jenkinsci.plugins.gitclient.CliGitAPIImpl.launchCommandWithCredentials(CliGitAPIImpl.java:1721)
at org.jenkinsci.plugins.gitclient.CliGitAPIImpl.access$300(CliGitAPIImpl.java:72)
at org.jenkinsci.plugins.gitclient.CliGitAPIImpl$1.execute(CliGitAPIImpl.java:405)
at org.jenkinsci.plugins.gitclient.RemoteGitImpl$CommandInvocationHandler$1.call(RemoteGitImpl.java:153)
at org.jenkinsci.plugins.gitclient.RemoteGitImpl$CommandInvocationHandler$1.call(RemoteGitImpl.java:146)
at hudson.remoting.UserRequest.perform(UserRequest.java:212)
at hudson.remoting.UserRequest.perform(UserRequest.java:54)
at hudson.remoting.Request$2.run(Request.java:369)
at hudson.remoting.InterceptingExecutorService$1.call(InterceptingExecutorService.java:72)
at java.util.concurrent.FutureTask.run(FutureTask.java:266)
at java.util.concurrent.ThreadPoolExecutor.runWorker(ThreadPoolExecutor.java:1142)
at java.util.concurrent.ThreadPoolExecutor$Worker.run(ThreadPoolExecutor.java:617)
at java.lang.Thread.run(Thread.java:748)
Suppressed: hudson.remoting.Channel$CallSiteStackTrace: Remote call to H32
at hudson.remoting.Channel.attachCallSiteStackTrace(Channel.java:1741)
at hudson.remoting.UserRequest$ExceptionResponse.retrieve(UserRequest.java:357)
at hudson.remoting.Channel.call(Channel.java:955)
at org.jenkinsci.plugins.gitclient.RemoteGitImpl$CommandInvocationHandler.execute(RemoteGitImpl.java:146)
at sun.reflect.GeneratedMethodAccessor1346.invoke(Unknown Source)
at sun.reflect.DelegatingMethodAccessorImpl.invoke(DelegatingMethodAccessorImpl.java:43)
at java.lang.reflect.Method.invoke(Method.java:498)
at org.jenkinsci.plugins.gitclient.RemoteGitImpl$CommandInvocationHandler.invoke(RemoteGitImpl.java:132)
at com.sun.proxy.$Proxy115.execute(Unknown Source)
at hudson.plugins.git.GitSCM.fetchFrom(GitSCM.java:886)
at hudson.plugins.git.GitSCM.retrieveChanges(GitSCM.java:1155)
at hudson.plugins.git.GitSCM.checkout(GitSCM.java:1186)
at hudson.scm.SCM.checkout(SCM.java:504)
at hudson.model.AbstractProject.checkout(AbstractProject.java:1208)
at hudson.model.AbstractBuild$AbstractBuildExecution.defaultCheckout(AbstractBuild.java:574)
at jenkins.scm.SCMCheckoutStrategy.checkout(SCMCheckoutStrategy.java:86)
at hudson.model.AbstractBuild$AbstractBuildExecution.run(AbstractBuild.java:499)
at hudson.model.Run.execute(Run.java:1794)
at hudson.model.FreeStyleBuild.run(FreeStyleBuild.java:43)
at hudson.model.ResourceController.execute(ResourceController.java:97)
at hudson.model.Executor.run(Executor.java:429)
ERROR: Error fetching remote repo 'origin'
Retrying after 10 seconds
> git rev-parse --is-inside-work-tree # timeout=10
Fetching changes from the remote Git repository
> git config remote.origin.url https://github.com/apache/kafka.git # timeout=10
Fetching upstream changes from https://github.com/apache/kafka.git
> git --version # timeout=10
> git fetch --tags --progress https://github.com/apache/kafka.git +refs/heads/*:refs/remotes/origin/*
ERROR: Error fetching remote repo 'origin'
hudson.plugins.git.GitException: Failed to fetch from https://github.com/apache/kafka.git
at hudson.plugins.git.GitSCM.fetchFrom(GitSCM.java:888)
at hudson.plugins.git.GitSCM.retrieveChanges(GitSCM.java:1155)
at hudson.plugins.git.GitSCM.checkout(GitSCM.java:1186)
at hudson.scm.SCM.checkout(SCM.java:504)
at hudson.model.AbstractProject.checkout(AbstractProject.java:1208)
at hudson.model.AbstractBuild$AbstractBuildExecution.defaultCheckout(AbstractBuild.java:574)
at jenkins.scm.SCMCheckoutStrategy.checkout(SCMCheckoutStrategy.java:86)
at hudson.model.AbstractBuild$AbstractBuildExecution.run(AbstractBuild.java:499)
at hudson.model.Run.execute(Run.java:1794)
at hudson.model.FreeStyleBuild.run(FreeStyleBuild.java:43)
at hudson.model.ResourceController.execute(ResourceController.java:97)
at hudson.model.Executor.run(Executor.java:429)
Caused by: hudson.plugins.git.GitException: Command "git fetch --tags --progress https://github.com/apache/kafka.git +refs/heads/*:refs/remotes/origin/*" returned status code 128:
stdout:
stderr: error: Could not read 0f3affc0f40751dc8fd064b36b6e859728f63e37
error: Could not read 95fbb2e03f4fe79737c71632e0ef2dfdcfb85a69
error: Could not read 08c465028d057ac23cdfe6d57641fe40240359dd
remote: Counting objects: 7208, done.
remote: Compressing objects: 2% (1/43) remote: Compressing objects: 4% (2/43) remote: Compressing objects: 6% (3/43) remote: Compressing objects: 9% (4/43) remote: Compressing objects: 11% (5/43) remote: Compressing objects: 13% (6/43) remote: Compressing objects: 16% (7/43) remote: Compressing objects: 18% (8/43) remote: Compressing objects: 20% (9/43) remote: Compressing objects: 23% (10/43) remote: Compressing objects: 25% (11/43) remote: Compressing objects: 27% (12/43) remote: Compressing objects: 30% (13/43) remote: Compressing objects: 32% (14/43) remote: Compressing objects: 34% (15/43) remote: Compressing objects: 37% (16/43) remote: Compressing objects: 39% (17/43) remote: Compressing objects: 41% (18/43) remote: Compressing objects: 44% (19/43) remote: Compressing objects: 46% (20/43) remote: Compressing objects: 48% (21/43) remote: Compressing objects: 51% (22/43) remote: Compressing objects: 53% (23/43) remote: Compressing objects: 55% (24/43) remote: Compressing objects: 58% (25/43) remote: Compressing objects: 60% (26/43) remote: Compressing objects: 62% (27/43) remote: Compressing objects: 65% (28/43) remote: Compressing objects: 67% (29/43) remote: Compressing objects: 69% (30/43) remote: Compressing objects: 72% (31/43) remote: Compressing objects: 74% (32/43) remote: Compressing objects: 76% (33/43) remote: Compressing objects: 79% (34/43) remote: Compressing objects: 81% (35/43) remote: Compressing objects: 83% (36/43) remote: Compressing objects: 86% (37/43) remote: Compressing objects: 88% (38/43) remote: Compressing objects: 90% (39/43) remote: Compressing objects: 93% (40/43) remote: Compressing objects: 95% (41/43) remote: Compressing objects: 97% (42/43) remote: Compressing objects: 100% (43/43) remote: Compressing objects: 100% (43/43), done.
Receiving objects: 0% (1/7208) Receiving objects: 1% (73/7208) Receiving objects: 2% (145/7208) Receiving objects: 3% (217/7208) Receiving objects: 4% (289/7208) Receiving objects: 5% (361/7208) Receiving objects: 6% (433/7208) Receiving objects: 7% (505/7208) Receiving objects: 8% (577/7208) Receiving objects: 9% (649/7208) Receiving objects: 10% (721/7208) Receiving objects: 11% (793/7208) Receiving objects: 12% (865/7208) Receiving objects: 13% (938/7208) Receiving objects: 14% (1010/7208) Receiving objects: 15% (1082/7208) Receiving objects: 16% (1154/7208) Receiving objects: 17% (1226/7208) Receiving objects: 18% (1298/7208) Receiving objects: 19% (1370/7208) Receiving objects: 20% (1442/7208) Receiving objects: 21% (1514/7208) Receiving objects: 22% (1586/7208) Receiving objects: 23% (1658/7208) Receiving objects: 24% (1730/7208) Receiving objects: 25% (1802/7208) Receiving objects: 26% (1875/7208) Receiving objects: 27% (1947/7208) Receiving objects: 28% (2019/7208) Receiving objects: 29% (2091/7208) Receiving objects: 30% (2163/7208) Receiving objects: 31% (2235/7208) Receiving objects: 32% (2307/7208) Receiving objects: 33% (2379/7208) Receiving objects: 34% (2451/7208) Receiving objects: 35% (2523/7208) Receiving objects: 36% (2595/7208) Receiving objects: 37% (2667/7208) Receiving objects: 38% (2740/7208) Receiving objects: 39% (2812/7208) Receiving objects: 40% (2884/7208) Receiving objects: 41% (2956/7208) Receiving objects: 42% (3028/7208) Receiving objects: 43% (3100/7208) Receiving objects: 44% (3172/7208) Receiving objects: 45% (3244/7208) Receiving objects: 46% (3316/7208) Receiving objects: 47% (3388/7208) Receiving objects: 48% (3460/7208) Receiving objects: 49% (3532/7208) Receiving objects: 50% (3604/7208) Receiving objects: 51% (3677/7208) Receiving objects: 52% (3749/7208) Receiving objects: 53% (3821/7208) Receiving objects: 54% (3893/7208) Receiving objects: 55% (3965/7208) Receiving objects: 56% (4037/7208) Receiving objects: 57% (4109/7208) Receiving objects: 58% (4181/7208) Receiving objects: 59% (4253/7208) Receiving objects: 60% (4325/7208) Receiving objects: 61% (4397/7208) Receiving objects: 62% (4469/7208) Receiving objects: 63% (4542/7208) Receiving objects: 64% (4614/7208) Receiving objects: 65% (4686/7208) Receiving objects: 66% (4758/7208) Receiving objects: 67% (4830/7208) Receiving objects: 68% (4902/7208) Receiving objects: 69% (4974/7208) Receiving objects: 70% (5046/7208) Receiving objects: 71% (5118/7208) Receiving objects: 72% (5190/7208) Receiving objects: 73% (5262/7208) Receiving objects: 74% (5334/7208) Receiving objects: 75% (5406/7208) Receiving objects: 76% (5479/7208) Receiving objects: 77% (5551/7208) Receiving objects: 78% (5623/7208) Receiving objects: 79% (5695/7208) Receiving objects: 80% (5767/7208) Receiving objects: 81% (5839/7208) Receiving objects: 82% (5911/7208) Receiving objects: 83% (5983/7208) Receiving objects: 84% (6055/7208) Receiving objects: 85% (6127/7208) Receiving objects: 86% (6199/7208) Receiving objects: 87% (6271/7208) Receiving objects: 88% (6344/7208) Receiving objects: 89% (6416/7208) Receiving objects: 90% (6488/7208) Receiving objects: 91% (6560/7208) Receiving objects: 92% (6632/7208) Receiving objects: 93% (6704/7208) Receiving objects: 94% (6776/7208) Receiving objects: 95% (6848/7208) Receiving objects: 96% (6920/7208) Receiving objects: 97% (6992/7208) Receiving objects: 98% (7064/7208) remote: Total 7208 (delta 1952), reused 1985 (delta 1952), pack-reused 5199
Receiving objects: 99% (7136/7208) Receiving objects: 100% (7208/7208) Receiving objects: 100% (7208/7208), 1.95 MiB | 0 bytes/s, done.
Resolving deltas: 0% (0/2743) Resolving deltas: 1% (28/2743) Resolving deltas: 2% (55/2743) Resolving deltas: 3% (83/2743) Resolving deltas: 4% (111/2743) Resolving deltas: 5% (138/2743) Resolving deltas: 6% (168/2743) Resolving deltas: 7% (201/2743) Resolving deltas: 8% (220/2743) Resolving deltas: 9% (256/2743) Resolving deltas: 13% (362/2743) Resolving deltas: 14% (386/2743) Resolving deltas: 15% (415/2743) Resolving deltas: 16% (443/2743) Resolving deltas: 17% (467/2743) Resolving deltas: 18% (500/2743) Resolving deltas: 19% (522/2743) Resolving deltas: 20% (570/2743) Resolving deltas: 21% (579/2743) Resolving deltas: 22% (604/2743) Resolving deltas: 23% (638/2743) Resolving deltas: 24% (661/2743) Resolving deltas: 25% (686/2743) Resolving deltas: 26% (714/2743) Resolving deltas: 27% (741/2743) Resolving deltas: 28% (773/2743) Resolving deltas: 29% (796/2743) Resolving deltas: 30% (823/2743) Resolving deltas: 31% (853/2743) Resolving deltas: 32% (879/2743) Resolving deltas: 33% (906/2743) Resolving deltas: 34% (934/2743) Resolving deltas: 35% (961/2743) Resolving deltas: 36% (988/2743) Resolving deltas: 37% (1015/2743) Resolving deltas: 38% (1043/2743) Resolving deltas: 39% (1070/2743) Resolving deltas: 40% (1098/2743) Resolving deltas: 41% (1125/2743) Resolving deltas: 41% (1134/2743), completed with 180 local objects.
fatal: pack has 1609 unresolved deltas
fatal: index-pack failed
at org.jenkinsci.plugins.gitclient.CliGitAPIImpl.launchCommandIn(CliGitAPIImpl.java:2002)
at org.jenkinsci.plugins.gitclient.CliGitAPIImpl.launchCommandWithCredentials(CliGitAPIImpl.java:1721)
at org.jenkinsci.plugins.gitclient.CliGitAPIImpl.access$300(CliGitAPIImpl.java:72)
at org.jenkinsci.plugins.gitclient.CliGitAPIImpl$1.execute(CliGitAPIImpl.java:405)
at org.jenkinsci.plugins.gitclient.RemoteGitImpl$CommandInvocationHandler$1.call(RemoteGitImpl.java:153)
at org.jenkinsci.plugins.gitclient.RemoteGitImpl$CommandInvocationHandler$1.call(RemoteGitImpl.java:146)
at hudson.remoting.UserRequest.perform(UserRequest.java:212)
at hudson.remoting.UserRequest.perform(UserRequest.java:54)
at hudson.remoting.Request$2.run(Request.java:369)
at hudson.remoting.InterceptingExecutorService$1.call(InterceptingExecutorService.java:72)
at java.util.concurrent.FutureTask.run(FutureTask.java:266)
at java.util.concurrent.ThreadPoolExecutor.runWorker(ThreadPoolExecutor.java:1142)
at java.util.concurrent.ThreadPoolExecutor$Worker.run(ThreadPoolExecutor.java:617)
at java.lang.Thread.run(Thread.java:748)
Suppressed: hudson.remoting.Channel$CallSiteStackTrace: Remote call to H32
at hudson.remoting.Channel.attachCallSiteStackTrace(Channel.java:1741)
at hudson.remoting.UserRequest$ExceptionResponse.retrieve(UserRequest.java:357)
at hudson.remoting.Channel.call(Channel.java:955)
at org.jenkinsci.plugins.gitclient.RemoteGitImpl$CommandInvocationHandler.execute(RemoteGitImpl.java:146)
at sun.reflect.GeneratedMethodAccessor1346.invoke(Unknown Source)
at sun.reflect.DelegatingMethodAccessorImpl.invoke(DelegatingMethodAccessorImpl.java:43)
at java.lang.reflect.Method.invoke(Method.java:498)
at org.jenkinsci.plugins.gitclient.RemoteGitImpl$CommandInvocationHandler.invoke(RemoteGitImpl.java:132)
at com.sun.proxy.$Proxy115.execute(Unknown Source)
at hudson.plugins.git.GitSCM.fetchFrom(GitSCM.java:886)
at hudson.plugins.git.GitSCM.retrieveChanges(GitSCM.java:1155)
at hudson.plugins.git.GitSCM.checkout(GitSCM.java:1186)
at hudson.scm.SCM.checkout(SCM.java:504)
at hudson.model.AbstractProject.checkout(AbstractProject.java:1208)
at hudson.model.AbstractBuild$AbstractBuildExecution.defaultCheckout(AbstractBuild.java:574)
at jenkins.scm.SCMCheckoutStrategy.checkout(SCMCheckoutStrategy.java:86)
at hudson.model.AbstractBuild$AbstractBuildExecution.run(AbstractBuild.java:499)
at hudson.model.Run.execute(Run.java:1794)
at hudson.model.FreeStyleBuild.run(FreeStyleBuild.java:43)
at hudson.model.ResourceController.execute(ResourceController.java:97)
at hudson.model.Executor.run(Executor.java:429)
ERROR: Error fetching remote repo 'origin'
Retrying after 10 seconds
> git rev-parse --is-inside-work-tree # timeout=10
Fetching changes from the remote Git repository
> git config remote.origin.url https://github.com/apache/kafka.git # timeout=10
Fetching upstream changes from https://github.com/apache/kafka.git
> git --version # timeout=10
> git fetch --tags --progress https://github.com/apache/kafka.git +refs/heads/*:refs/remotes/origin/*
ERROR: Error fetching remote repo 'origin'
hudson.plugins.git.GitException: Failed to fetch from https://github.com/apache/kafka.git
at hudson.plugins.git.GitSCM.fetchFrom(GitSCM.java:888)
at hudson.plugins.git.GitSCM.retrieveChanges(GitSCM.java:1155)
at hudson.plugins.git.GitSCM.checkout(GitSCM.java:1186)
at hudson.scm.SCM.checkout(SCM.java:504)
at hudson.model.AbstractProject.checkout(AbstractProject.java:1208)
at hudson.model.AbstractBuild$AbstractBuildExecution.defaultCheckout(AbstractBuild.java:574)
at jenkins.scm.SCMCheckoutStrategy.checkout(SCMCheckoutStrategy.java:86)
at hudson.model.AbstractBuild$AbstractBuildExecution.run(AbstractBuild.java:499)
at hudson.model.Run.execute(Run.java:1794)
at hudson.model.FreeStyleBuild.run(FreeStyleBuild.java:43)
at hudson.model.ResourceController.execute(ResourceController.java:97)
at hudson.model.Executor.run(Executor.java:429)
Caused by: hudson.plugins.git.GitException: Command "git fetch --tags --progress https://github.com/apache/kafka.git +refs/heads/*:refs/remotes/origin/*" returned status code 128:
stdout:
stderr: error: Could not read 0f3affc0f40751dc8fd064b36b6e859728f63e37
error: Could not read 95fbb2e03f4fe79737c71632e0ef2dfdcfb85a69
error: Could not read 08c465028d057ac23cdfe6d57641fe40240359dd
remote: Counting objects: 7208, done.
remote: Compressing objects: 2% (1/43) remote: Compressing objects: 4% (2/43) remote: Compressing objects: 6% (3/43) remote: Compressing objects: 9% (4/43) remote: Compressing objects: 11% (5/43) remote: Compressing objects: 13% (6/43) remote: Compressing objects: 16% (7/43) remote: Compressing objects: 18% (8/43) remote: Compressing objects: 20% (9/43) remote: Compressing objects: 23% (10/43) remote: Compressing objects: 25% (11/43) remote: Compressing objects: 27% (12/43) remote: Compressing objects: 30% (13/43) remote: Compressing objects: 32% (14/43) remote: Compressing objects: 34% (15/43) remote: Compressing objects: 37% (16/43) remote: Compressing objects: 39% (17/43) remote: Compressing objects: 41% (18/43) remote: Compressing objects: 44% (19/43) remote: Compressing objects: 46% (20/43) remote: Compressing objects: 48% (21/43) remote: Compressing objects: 51% (22/43) remote: Compressing objects: 53% (23/43) remote: Compressing objects: 55% (24/43) remote: Compressing objects: 58% (25/43) remote: Compressing objects: 60% (26/43) remote: Compressing objects: 62% (27/43) remote: Compressing objects: 65% (28/43) remote: Compressing objects: 67% (29/43) remote: Compressing objects: 69% (30/43) remote: Compressing objects: 72% (31/43) remote: Compressing objects: 74% (32/43) remote: Compressing objects: 76% (33/43) remote: Compressing objects: 79% (34/43) remote: Compressing objects: 81% (35/43) remote: Compressing objects: 83% (36/43) remote: Compressing objects: 86% (37/43) remote: Compressing objects: 88% (38/43) remote: Compressing objects: 90% (39/43) remote: Compressing objects: 93% (40/43) remote: Compressing objects: 95% (41/43) remote: Compressing objects: 97% (42/43) remote: Compressing objects: 100% (43/43) remote: Compressing objects: 100% (43/43), done.
Receiving objects: 0% (1/7208) Receiving objects: 1% (73/7208) Receiving objects: 2% (145/7208) Receiving objects: 3% (217/7208) Receiving objects: 4% (289/7208) Receiving objects: 5% (361/7208) Receiving objects: 6% (433/7208) Receiving objects: 7% (505/7208) Receiving objects: 8% (577/7208) Receiving objects: 9% (649/7208) Receiving objects: 10% (721/7208) Receiving objects: 11% (793/7208) Receiving objects: 12% (865/7208) Receiving objects: 13% (938/7208) Receiving objects: 14% (1010/7208) Receiving objects: 15% (1082/7208) Receiving objects: 16% (1154/7208) Receiving objects: 17% (1226/7208) Receiving objects: 18% (1298/7208) Receiving objects: 19% (1370/7208) Receiving objects: 20% (1442/7208) Receiving objects: 21% (1514/7208) Receiving objects: 22% (1586/7208) Receiving objects: 23% (1658/7208) Receiving objects: 24% (1730/7208) Receiving objects: 25% (1802/7208) Receiving objects: 26% (1875/7208) Receiving objects: 27% (1947/7208) Receiving objects: 28% (2019/7208) Receiving objects: 29% (2091/7208) Receiving objects: 30% (2163/7208) Receiving objects: 31% (2235/7208) Receiving objects: 32% (2307/7208) Receiving objects: 33% (2379/7208) Receiving objects: 34% (2451/7208) Receiving objects: 35% (2523/7208) Receiving objects: 36% (2595/7208) Receiving objects: 37% (2667/7208) Receiving objects: 38% (2740/7208) Receiving objects: 39% (2812/7208) Receiving objects: 40% (2884/7208) Receiving objects: 41% (2956/7208) Receiving objects: 42% (3028/7208) Receiving objects: 43% (3100/7208) Receiving objects: 44% (3172/7208) Receiving objects: 45% (3244/7208) Receiving objects: 46% (3316/7208) Receiving objects: 47% (3388/7208) Receiving objects: 48% (3460/7208) Receiving objects: 49% (3532/7208) Receiving objects: 50% (3604/7208) Receiving objects: 51% (3677/7208) Receiving objects: 52% (3749/7208) Receiving objects: 53% (3821/7208) Receiving objects: 54% (3893/7208) Receiving objects: 55% (3965/7208) Receiving objects: 56% (4037/7208) Receiving objects: 57% (4109/7208) Receiving objects: 58% (4181/7208) Receiving objects: 59% (4253/7208) Receiving objects: 60% (4325/7208) Receiving objects: 61% (4397/7208) Receiving objects: 62% (4469/7208) Receiving objects: 63% (4542/7208) Receiving objects: 64% (4614/7208) Receiving objects: 65% (4686/7208) Receiving objects: 66% (4758/7208) Receiving objects: 67% (4830/7208) Receiving objects: 68% (4902/7208) Receiving objects: 69% (4974/7208) Receiving objects: 70% (5046/7208) Receiving objects: 71% (5118/7208) Receiving objects: 72% (5190/7208) Receiving objects: 73% (5262/7208) Receiving objects: 74% (5334/7208) Receiving objects: 75% (5406/7208) Receiving objects: 76% (5479/7208) Receiving objects: 77% (5551/7208) Receiving objects: 78% (5623/7208) Receiving objects: 79% (5695/7208) Receiving objects: 80% (5767/7208) Receiving objects: 81% (5839/7208) Receiving objects: 82% (5911/7208) Receiving objects: 83% (5983/7208) Receiving objects: 84% (6055/7208) Receiving objects: 85% (6127/7208) Receiving objects: 86% (6199/7208) Receiving objects: 87% (6271/7208) Receiving objects: 88% (6344/7208) Receiving objects: 89% (6416/7208) Receiving objects: 90% (6488/7208) Receiving objects: 91% (6560/7208) Receiving objects: 92% (6632/7208) Receiving objects: 93% (6704/7208) Receiving objects: 94% (6776/7208) Receiving objects: 95% (6848/7208) Receiving objects: 96% (6920/7208) Receiving objects: 97% (6992/7208) Receiving objects: 98% (7064/7208) remote: Total 7208 (delta 1952), reused 1985 (delta 1952), pack-reused 5199
Receiving objects: 99% (7136/7208) Receiving objects: 100% (7208/7208) Receiving objects: 100% (7208/7208), 1.95 MiB | 0 bytes/s, done.
Resolving deltas: 0% (0/2743) Resolving deltas: 1% (28/2743) Resolving deltas: 2% (55/2743) Resolving deltas: 3% (85/2743) Resolving deltas: 4% (111/2743) Resolving deltas: 5% (138/2743) Resolving deltas: 6% (165/2743) Resolving deltas: 7% (202/2743) Resolving deltas: 8% (220/2743) Resolving deltas: 9% (258/2743) Resolving deltas: 13% (366/2743) Resolving deltas: 14% (387/2743) Resolving deltas: 15% (415/2743) Resolving deltas: 16% (441/2743) Resolving deltas: 17% (468/2743) Resolving deltas: 18% (498/2743) Resolving deltas: 20% (573/2743) Resolving deltas: 21% (578/2743) Resolving deltas: 22% (605/2743) Resolving deltas: 23% (631/2743) Resolving deltas: 24% (659/2743) Resolving deltas: 25% (686/2743) Resolving deltas: 26% (715/2743) Resolving deltas: 27% (741/2743) Resolving deltas: 28% (774/2743) Resolving deltas: 29% (796/2743) Resolving deltas: 30% (823/2743) Resolving deltas: 31% (853/2743) Resolving deltas: 32% (879/2743) Resolving deltas: 33% (906/2743) Resolving deltas: 34% (934/2743) Resolving deltas: 35% (961/2743) Resolving deltas: 36% (988/2743) Resolving deltas: 37% (1015/2743) Resolving deltas: 38% (1043/2743) Resolving deltas: 39% (1070/2743) Resolving deltas: 40% (1098/2743) Resolving deltas: 41% (1125/2743) Resolving deltas: 41% (1134/2743), completed with 180 local objects.
fatal: pack has 1609 unresolved deltas
fatal: index-pack failed
at org.jenkinsci.plugins.gitclient.CliGitAPIImpl.launchCommandIn(CliGitAPIImpl.java:2002)
at org.jenkinsci.plugins.gitclient.CliGitAPIImpl.launchCommandWithCredentials(CliGitAPIImpl.java:1721)
at org.jenkinsci.plugins.gitclient.CliGitAPIImpl.access$300(CliGitAPIImpl.java:72)
at org.jenkinsci.plugins.gitclient.CliGitAPIImpl$1.execute(CliGitAPIImpl.java:405)
at org.jenkinsci.plugins.gitclient.RemoteGitImpl$CommandInvocationHandler$1.call(RemoteGitImpl.java:153)
at org.jenkinsci.plugins.gitclient.RemoteGitImpl$CommandInvocationHandler$1.call(RemoteGitImpl.java:146)
at hudson.remoting.UserRequest.perform(UserRequest.java:212)
at hudson.remoting.UserRequest.perform(UserRequest.java:54)
at hudson.remoting.Request$2.run(Request.java:369)
at hudson.remoting.InterceptingExecutorService$1.call(InterceptingExecutorService.java:72)
at java.util.concurrent.FutureTask.run(FutureTask.java:266)
at java.util.concurrent.ThreadPoolExecutor.runWorker(ThreadPoolExecutor.java:1142)
at java.util.concurrent.ThreadPoolExecutor$Worker.run(ThreadPoolExecutor.java:617)
at java.lang.Thread.run(Thread.java:748)
Suppressed: hudson.remoting.Channel$CallSiteStackTrace: Remote call to H32
at hudson.remoting.Channel.attachCallSiteStackTrace(Channel.java:1741)
at hudson.remoting.UserRequest$ExceptionResponse.retrieve(UserRequest.java:357)
at hudson.remoting.Channel.call(Channel.java:955)
at org.jenkinsci.plugins.gitclient.RemoteGitImpl$CommandInvocationHandler.execute(RemoteGitImpl.java:146)
at sun.reflect.GeneratedMethodAccessor1346.invoke(Unknown Source)
at sun.reflect.DelegatingMethodAccessorImpl.invoke(DelegatingMethodAccessorImpl.java:43)
at java.lang.reflect.Method.invoke(Method.java:498)
at org.jenkinsci.plugins.gitclient.RemoteGitImpl$CommandInvocationHandler.invoke(RemoteGitImpl.java:132)
at com.sun.proxy.$Proxy115.execute(Unknown Source)
at hudson.plugins.git.GitSCM.fetchFrom(GitSCM.java:886)
at hudson.plugins.git.GitSCM.retrieveChanges(GitSCM.java:1155)
at hudson.plugins.git.GitSCM.checkout(GitSCM.java:1186)
at hudson.scm.SCM.checkout(SCM.java:504)
at hudson.model.AbstractProject.checkout(AbstractProject.java:1208)
at hudson.model.AbstractBuild$AbstractBuildExecution.defaultCheckout(AbstractBuild.java:574)
at jenkins.scm.SCMCheckoutStrategy.checkout(SCMCheckoutStrategy.java:86)
at hudson.model.AbstractBuild$AbstractBuildExecution.run(AbstractBuild.java:499)
at hudson.model.Run.execute(Run.java:1794)
at hudson.model.FreeStyleBuild.run(FreeStyleBuild.java:43)
at hudson.model.ResourceController.execute(ResourceController.java:97)
at hudson.model.Executor.run(Executor.java:429)
ERROR: Error fetching remote repo 'origin'
[FINDBUGS] Collecting findbugs analysis files...
[FINDBUGS] Searching for all files in <https://builds.apache.org/job/kafka-trunk-jdk8/ws/> that match the pattern **/build/reports/findbugs/*.xml
[FINDBUGS] Parsing 15 files in <https://builds.apache.org/job/kafka-trunk-jdk8/ws/>
[FINDBUGS] Successfully parsed file <https://builds.apache.org/job/kafka-trunk-jdk8/ws/clients/build/reports/findbugs/main.xml> with 0 unique warnings and 0 duplicates.
[FINDBUGS] Successfully parsed file <https://builds.apache.org/job/kafka-trunk-jdk8/ws/connect/api/build/reports/findbugs/main.xml> with 0 unique warnings and 0 duplicates.
[FINDBUGS] Successfully parsed file <https://builds.apache.org/job/kafka-trunk-jdk8/ws/connect/basic-auth-extension/build/reports/findbugs/main.xml> with 0 unique warnings and 0 duplicates.
[FINDBUGS] Successfully parsed file <https://builds.apache.org/job/kafka-trunk-jdk8/ws/connect/file/build/reports/findbugs/main.xml> with 0 unique warnings and 0 duplicates.
[FINDBUGS] Successfully parsed file <https://builds.apache.org/job/kafka-trunk-jdk8/ws/connect/json/build/reports/findbugs/main.xml> with 0 unique warnings and 0 duplicates.
[FINDBUGS] Successfully parsed file <https://builds.apache.org/job/kafka-trunk-jdk8/ws/connect/runtime/build/reports/findbugs/main.xml> with 0 unique warnings and 0 duplicates.
[FINDBUGS] Successfully parsed file <https://builds.apache.org/job/kafka-trunk-jdk8/ws/connect/transforms/build/reports/findbugs/main.xml> with 0 unique warnings and 0 duplicates.
[FINDBUGS] Successfully parsed file <https://builds.apache.org/job/kafka-trunk-jdk8/ws/core/build/reports/findbugs/main.xml> with 0 unique warnings and 0 duplicates.
[FINDBUGS] Successfully parsed file <https://builds.apache.org/job/kafka-trunk-jdk8/ws/examples/build/reports/findbugs/main.xml> with 0 unique warnings and 0 duplicates.
[FINDBUGS] Successfully parsed file <https://builds.apache.org/job/kafka-trunk-jdk8/ws/log4j-appender/build/reports/findbugs/main.xml> with 0 unique warnings and 0 duplicates.
[FINDBUGS] Successfully parsed file <https://builds.apache.org/job/kafka-trunk-jdk8/ws/streams/build/reports/findbugs/main.xml> with 0 unique warnings and 0 duplicates.
[FINDBUGS] Successfully parsed file <https://builds.apache.org/job/kafka-trunk-jdk8/ws/streams/examples/build/reports/findbugs/main.xml> with 0 unique warnings and 0 duplicates.
[FINDBUGS] Successfully parsed file <https://builds.apache.org/job/kafka-trunk-jdk8/ws/streams/streams-scala/build/reports/findbugs/main.xml> with 0 unique warnings and 0 duplicates.
[FINDBUGS] Successfully parsed file <https://builds.apache.org/job/kafka-trunk-jdk8/ws/streams/test-utils/build/reports/findbugs/main.xml> with 0 unique warnings and 0 duplicates.
[FINDBUGS] Successfully parsed file <https://builds.apache.org/job/kafka-trunk-jdk8/ws/tools/build/reports/findbugs/main.xml> with 0 unique warnings and 0 duplicates.
<Git Blamer> Using GitBlamer to create author and commit information for all warnings.
<Git Blamer> GIT_COMMIT=cf2c5e9ffc066aad37090fb6f2953a602cd8621b, workspace=<https://builds.apache.org/job/kafka-trunk-jdk8/ws/>
[FINDBUGS] Computing warning deltas based on reference build #2859
Recording test results
ERROR: Step ?Publish JUnit test result report? failed: Test reports were found but none of them are new. Did leafNodes run?
For example, <https://builds.apache.org/job/kafka-trunk-jdk8/ws/clients/build/test-results/test/TEST-org.apache.kafka.clients.ApiVersionsTest.xml> is 13 days old
Not sending mail to unregistered user wangguoz@gmail.com
Not sending mail to unregistered user noreply@github.com
Build failed in Jenkins: kafka-trunk-jdk8 #2863
Posted by Apache Jenkins Server <je...@builds.apache.org>.
See <https://builds.apache.org/job/kafka-trunk-jdk8/2863/display/redirect>
------------------------------------------
Started by an SCM change
[EnvInject] - Loading node environment variables.
Building remotely on H32 (ubuntu xenial) in workspace <https://builds.apache.org/job/kafka-trunk-jdk8/ws/>
> git rev-parse --is-inside-work-tree # timeout=10
Fetching changes from the remote Git repository
> git config remote.origin.url https://github.com/apache/kafka.git # timeout=10
Fetching upstream changes from https://github.com/apache/kafka.git
> git --version # timeout=10
> git fetch --tags --progress https://github.com/apache/kafka.git +refs/heads/*:refs/remotes/origin/*
ERROR: Error fetching remote repo 'origin'
hudson.plugins.git.GitException: Failed to fetch from https://github.com/apache/kafka.git
at hudson.plugins.git.GitSCM.fetchFrom(GitSCM.java:888)
at hudson.plugins.git.GitSCM.retrieveChanges(GitSCM.java:1155)
at hudson.plugins.git.GitSCM.checkout(GitSCM.java:1186)
at hudson.scm.SCM.checkout(SCM.java:504)
at hudson.model.AbstractProject.checkout(AbstractProject.java:1208)
at hudson.model.AbstractBuild$AbstractBuildExecution.defaultCheckout(AbstractBuild.java:574)
at jenkins.scm.SCMCheckoutStrategy.checkout(SCMCheckoutStrategy.java:86)
at hudson.model.AbstractBuild$AbstractBuildExecution.run(AbstractBuild.java:499)
at hudson.model.Run.execute(Run.java:1794)
at hudson.model.FreeStyleBuild.run(FreeStyleBuild.java:43)
at hudson.model.ResourceController.execute(ResourceController.java:97)
at hudson.model.Executor.run(Executor.java:429)
Caused by: hudson.plugins.git.GitException: Command "git fetch --tags --progress https://github.com/apache/kafka.git +refs/heads/*:refs/remotes/origin/*" returned status code 128:
stdout:
stderr: error: Could not read 0f3affc0f40751dc8fd064b36b6e859728f63e37
error: Could not read 95fbb2e03f4fe79737c71632e0ef2dfdcfb85a69
error: Could not read 08c465028d057ac23cdfe6d57641fe40240359dd
remote: Counting objects: 7208, done.
remote: Compressing objects: 2% (1/42) remote: Compressing objects: 4% (2/42) remote: Compressing objects: 7% (3/42) remote: Compressing objects: 9% (4/42) remote: Compressing objects: 11% (5/42) remote: Compressing objects: 14% (6/42) remote: Compressing objects: 16% (7/42) remote: Compressing objects: 19% (8/42) remote: Compressing objects: 21% (9/42) remote: Compressing objects: 23% (10/42) remote: Compressing objects: 26% (11/42) remote: Compressing objects: 28% (12/42) remote: Compressing objects: 30% (13/42) remote: Compressing objects: 33% (14/42) remote: Compressing objects: 35% (15/42) remote: Compressing objects: 38% (16/42) remote: Compressing objects: 40% (17/42) remote: Compressing objects: 42% (18/42) remote: Compressing objects: 45% (19/42) remote: Compressing objects: 47% (20/42) remote: Compressing objects: 50% (21/42) remote: Compressing objects: 52% (22/42) remote: Compressing objects: 54% (23/42) remote: Compressing objects: 57% (24/42) remote: Compressing objects: 59% (25/42) remote: Compressing objects: 61% (26/42) remote: Compressing objects: 64% (27/42) remote: Compressing objects: 66% (28/42) remote: Compressing objects: 69% (29/42) remote: Compressing objects: 71% (30/42) remote: Compressing objects: 73% (31/42) remote: Compressing objects: 76% (32/42) remote: Compressing objects: 78% (33/42) remote: Compressing objects: 80% (34/42) remote: Compressing objects: 83% (35/42) remote: Compressing objects: 85% (36/42) remote: Compressing objects: 88% (37/42) remote: Compressing objects: 90% (38/42) remote: Compressing objects: 92% (39/42) remote: Compressing objects: 95% (40/42) remote: Compressing objects: 97% (41/42) remote: Compressing objects: 100% (42/42) remote: Compressing objects: 100% (42/42), done.
Receiving objects: 0% (1/7208) Receiving objects: 1% (73/7208) Receiving objects: 2% (145/7208) Receiving objects: 3% (217/7208) Receiving objects: 4% (289/7208) Receiving objects: 5% (361/7208) Receiving objects: 6% (433/7208) Receiving objects: 7% (505/7208) Receiving objects: 8% (577/7208) Receiving objects: 9% (649/7208) Receiving objects: 10% (721/7208) Receiving objects: 11% (793/7208) Receiving objects: 12% (865/7208) Receiving objects: 13% (938/7208) Receiving objects: 14% (1010/7208) Receiving objects: 15% (1082/7208) Receiving objects: 16% (1154/7208) Receiving objects: 17% (1226/7208) Receiving objects: 18% (1298/7208) Receiving objects: 19% (1370/7208) Receiving objects: 20% (1442/7208) Receiving objects: 21% (1514/7208) Receiving objects: 22% (1586/7208) Receiving objects: 23% (1658/7208) Receiving objects: 24% (1730/7208) Receiving objects: 25% (1802/7208) Receiving objects: 26% (1875/7208) Receiving objects: 27% (1947/7208) Receiving objects: 28% (2019/7208) Receiving objects: 29% (2091/7208) Receiving objects: 30% (2163/7208) Receiving objects: 31% (2235/7208) Receiving objects: 32% (2307/7208) Receiving objects: 33% (2379/7208) Receiving objects: 34% (2451/7208) Receiving objects: 35% (2523/7208) Receiving objects: 36% (2595/7208) Receiving objects: 37% (2667/7208) Receiving objects: 38% (2740/7208) Receiving objects: 39% (2812/7208) Receiving objects: 40% (2884/7208) Receiving objects: 41% (2956/7208) Receiving objects: 42% (3028/7208) Receiving objects: 43% (3100/7208) Receiving objects: 44% (3172/7208) Receiving objects: 45% (3244/7208) Receiving objects: 46% (3316/7208) Receiving objects: 47% (3388/7208) Receiving objects: 48% (3460/7208) Receiving objects: 49% (3532/7208) Receiving objects: 50% (3604/7208) Receiving objects: 51% (3677/7208) Receiving objects: 52% (3749/7208) Receiving objects: 53% (3821/7208) Receiving objects: 54% (3893/7208) Receiving objects: 55% (3965/7208) Receiving objects: 56% (4037/7208) Receiving objects: 57% (4109/7208) Receiving objects: 58% (4181/7208) Receiving objects: 59% (4253/7208) Receiving objects: 60% (4325/7208) Receiving objects: 61% (4397/7208) Receiving objects: 62% (4469/7208) Receiving objects: 63% (4542/7208) Receiving objects: 64% (4614/7208) Receiving objects: 65% (4686/7208) Receiving objects: 66% (4758/7208) Receiving objects: 67% (4830/7208) Receiving objects: 68% (4902/7208) Receiving objects: 69% (4974/7208) Receiving objects: 70% (5046/7208) Receiving objects: 71% (5118/7208) Receiving objects: 72% (5190/7208) Receiving objects: 73% (5262/7208) Receiving objects: 74% (5334/7208) Receiving objects: 75% (5406/7208) Receiving objects: 76% (5479/7208) Receiving objects: 77% (5551/7208) Receiving objects: 78% (5623/7208) Receiving objects: 79% (5695/7208) Receiving objects: 80% (5767/7208) Receiving objects: 81% (5839/7208) Receiving objects: 82% (5911/7208) Receiving objects: 83% (5983/7208) Receiving objects: 84% (6055/7208) Receiving objects: 85% (6127/7208) Receiving objects: 86% (6199/7208) Receiving objects: 87% (6271/7208) Receiving objects: 88% (6344/7208) Receiving objects: 89% (6416/7208) Receiving objects: 90% (6488/7208) Receiving objects: 91% (6560/7208) Receiving objects: 92% (6632/7208) Receiving objects: 93% (6704/7208) Receiving objects: 94% (6776/7208) Receiving objects: 95% (6848/7208) Receiving objects: 96% (6920/7208) Receiving objects: 97% (6992/7208) Receiving objects: 98% (7064/7208) remote: Total 7208 (delta 1953), reused 1986 (delta 1953), pack-reused 5199
Receiving objects: 99% (7136/7208) Receiving objects: 100% (7208/7208) Receiving objects: 100% (7208/7208), 1.95 MiB | 0 bytes/s, done.
Resolving deltas: 0% (0/2744) Resolving deltas: 1% (28/2744) Resolving deltas: 2% (55/2744) Resolving deltas: 3% (83/2744) Resolving deltas: 4% (111/2744) Resolving deltas: 5% (142/2744) Resolving deltas: 6% (170/2744) Resolving deltas: 7% (198/2744) Resolving deltas: 8% (225/2744) Resolving deltas: 9% (247/2744) Resolving deltas: 12% (353/2744) Resolving deltas: 13% (359/2744) Resolving deltas: 14% (390/2744) Resolving deltas: 15% (416/2744) Resolving deltas: 16% (441/2744) Resolving deltas: 17% (479/2744) Resolving deltas: 18% (502/2744) Resolving deltas: 20% (561/2744) Resolving deltas: 21% (578/2744) Resolving deltas: 22% (604/2744) Resolving deltas: 23% (638/2744) Resolving deltas: 24% (671/2744) Resolving deltas: 25% (686/2744) Resolving deltas: 26% (714/2744) Resolving deltas: 27% (741/2744) Resolving deltas: 28% (770/2744) Resolving deltas: 29% (796/2744) Resolving deltas: 30% (825/2744) Resolving deltas: 31% (853/2744) Resolving deltas: 32% (879/2744) Resolving deltas: 33% (906/2744) Resolving deltas: 34% (933/2744) Resolving deltas: 35% (961/2744) Resolving deltas: 36% (988/2744) Resolving deltas: 37% (1016/2744) Resolving deltas: 38% (1043/2744) Resolving deltas: 39% (1072/2744) Resolving deltas: 40% (1098/2744) Resolving deltas: 41% (1126/2744) Resolving deltas: 41% (1135/2744), completed with 182 local objects.
fatal: pack has 1609 unresolved deltas
fatal: index-pack failed
at org.jenkinsci.plugins.gitclient.CliGitAPIImpl.launchCommandIn(CliGitAPIImpl.java:2002)
at org.jenkinsci.plugins.gitclient.CliGitAPIImpl.launchCommandWithCredentials(CliGitAPIImpl.java:1721)
at org.jenkinsci.plugins.gitclient.CliGitAPIImpl.access$300(CliGitAPIImpl.java:72)
at org.jenkinsci.plugins.gitclient.CliGitAPIImpl$1.execute(CliGitAPIImpl.java:405)
at org.jenkinsci.plugins.gitclient.RemoteGitImpl$CommandInvocationHandler$1.call(RemoteGitImpl.java:153)
at org.jenkinsci.plugins.gitclient.RemoteGitImpl$CommandInvocationHandler$1.call(RemoteGitImpl.java:146)
at hudson.remoting.UserRequest.perform(UserRequest.java:212)
at hudson.remoting.UserRequest.perform(UserRequest.java:54)
at hudson.remoting.Request$2.run(Request.java:369)
at hudson.remoting.InterceptingExecutorService$1.call(InterceptingExecutorService.java:72)
at java.util.concurrent.FutureTask.run(FutureTask.java:266)
at java.util.concurrent.ThreadPoolExecutor.runWorker(ThreadPoolExecutor.java:1142)
at java.util.concurrent.ThreadPoolExecutor$Worker.run(ThreadPoolExecutor.java:617)
at java.lang.Thread.run(Thread.java:748)
Suppressed: hudson.remoting.Channel$CallSiteStackTrace: Remote call to H32
at hudson.remoting.Channel.attachCallSiteStackTrace(Channel.java:1741)
at hudson.remoting.UserRequest$ExceptionResponse.retrieve(UserRequest.java:357)
at hudson.remoting.Channel.call(Channel.java:955)
at org.jenkinsci.plugins.gitclient.RemoteGitImpl$CommandInvocationHandler.execute(RemoteGitImpl.java:146)
at sun.reflect.GeneratedMethodAccessor1346.invoke(Unknown Source)
at sun.reflect.DelegatingMethodAccessorImpl.invoke(DelegatingMethodAccessorImpl.java:43)
at java.lang.reflect.Method.invoke(Method.java:498)
at org.jenkinsci.plugins.gitclient.RemoteGitImpl$CommandInvocationHandler.invoke(RemoteGitImpl.java:132)
at com.sun.proxy.$Proxy115.execute(Unknown Source)
at hudson.plugins.git.GitSCM.fetchFrom(GitSCM.java:886)
at hudson.plugins.git.GitSCM.retrieveChanges(GitSCM.java:1155)
at hudson.plugins.git.GitSCM.checkout(GitSCM.java:1186)
at hudson.scm.SCM.checkout(SCM.java:504)
at hudson.model.AbstractProject.checkout(AbstractProject.java:1208)
at hudson.model.AbstractBuild$AbstractBuildExecution.defaultCheckout(AbstractBuild.java:574)
at jenkins.scm.SCMCheckoutStrategy.checkout(SCMCheckoutStrategy.java:86)
at hudson.model.AbstractBuild$AbstractBuildExecution.run(AbstractBuild.java:499)
at hudson.model.Run.execute(Run.java:1794)
at hudson.model.FreeStyleBuild.run(FreeStyleBuild.java:43)
at hudson.model.ResourceController.execute(ResourceController.java:97)
at hudson.model.Executor.run(Executor.java:429)
ERROR: Error fetching remote repo 'origin'
Retrying after 10 seconds
> git rev-parse --is-inside-work-tree # timeout=10
Fetching changes from the remote Git repository
> git config remote.origin.url https://github.com/apache/kafka.git # timeout=10
Fetching upstream changes from https://github.com/apache/kafka.git
> git --version # timeout=10
> git fetch --tags --progress https://github.com/apache/kafka.git +refs/heads/*:refs/remotes/origin/*
ERROR: Error fetching remote repo 'origin'
hudson.plugins.git.GitException: Failed to fetch from https://github.com/apache/kafka.git
at hudson.plugins.git.GitSCM.fetchFrom(GitSCM.java:888)
at hudson.plugins.git.GitSCM.retrieveChanges(GitSCM.java:1155)
at hudson.plugins.git.GitSCM.checkout(GitSCM.java:1186)
at hudson.scm.SCM.checkout(SCM.java:504)
at hudson.model.AbstractProject.checkout(AbstractProject.java:1208)
at hudson.model.AbstractBuild$AbstractBuildExecution.defaultCheckout(AbstractBuild.java:574)
at jenkins.scm.SCMCheckoutStrategy.checkout(SCMCheckoutStrategy.java:86)
at hudson.model.AbstractBuild$AbstractBuildExecution.run(AbstractBuild.java:499)
at hudson.model.Run.execute(Run.java:1794)
at hudson.model.FreeStyleBuild.run(FreeStyleBuild.java:43)
at hudson.model.ResourceController.execute(ResourceController.java:97)
at hudson.model.Executor.run(Executor.java:429)
Caused by: hudson.plugins.git.GitException: Command "git fetch --tags --progress https://github.com/apache/kafka.git +refs/heads/*:refs/remotes/origin/*" returned status code 128:
stdout:
stderr: error: Could not read 0f3affc0f40751dc8fd064b36b6e859728f63e37
error: Could not read 95fbb2e03f4fe79737c71632e0ef2dfdcfb85a69
error: Could not read 08c465028d057ac23cdfe6d57641fe40240359dd
remote: Counting objects: 7208, done.
remote: Compressing objects: 2% (1/42) remote: Compressing objects: 4% (2/42) remote: Compressing objects: 7% (3/42) remote: Compressing objects: 9% (4/42) remote: Compressing objects: 11% (5/42) remote: Compressing objects: 14% (6/42) remote: Compressing objects: 16% (7/42) remote: Compressing objects: 19% (8/42) remote: Compressing objects: 21% (9/42) remote: Compressing objects: 23% (10/42) remote: Compressing objects: 26% (11/42) remote: Compressing objects: 28% (12/42) remote: Compressing objects: 30% (13/42) remote: Compressing objects: 33% (14/42) remote: Compressing objects: 35% (15/42) remote: Compressing objects: 38% (16/42) remote: Compressing objects: 40% (17/42) remote: Compressing objects: 42% (18/42) remote: Compressing objects: 45% (19/42) remote: Compressing objects: 47% (20/42) remote: Compressing objects: 50% (21/42) remote: Compressing objects: 52% (22/42) remote: Compressing objects: 54% (23/42) remote: Compressing objects: 57% (24/42) remote: Compressing objects: 59% (25/42) remote: Compressing objects: 61% (26/42) remote: Compressing objects: 64% (27/42) remote: Compressing objects: 66% (28/42) remote: Compressing objects: 69% (29/42) remote: Compressing objects: 71% (30/42) remote: Compressing objects: 73% (31/42) remote: Compressing objects: 76% (32/42) remote: Compressing objects: 78% (33/42) remote: Compressing objects: 80% (34/42) remote: Compressing objects: 83% (35/42) remote: Compressing objects: 85% (36/42) remote: Compressing objects: 88% (37/42) remote: Compressing objects: 90% (38/42) remote: Compressing objects: 92% (39/42) remote: Compressing objects: 95% (40/42) remote: Compressing objects: 97% (41/42) remote: Compressing objects: 100% (42/42) remote: Compressing objects: 100% (42/42), done.
Receiving objects: 0% (1/7208) Receiving objects: 1% (73/7208) Receiving objects: 2% (145/7208) Receiving objects: 3% (217/7208) Receiving objects: 4% (289/7208) Receiving objects: 5% (361/7208) Receiving objects: 6% (433/7208) Receiving objects: 7% (505/7208) Receiving objects: 8% (577/7208) Receiving objects: 9% (649/7208) Receiving objects: 10% (721/7208) Receiving objects: 11% (793/7208) Receiving objects: 12% (865/7208) Receiving objects: 13% (938/7208) Receiving objects: 14% (1010/7208) Receiving objects: 15% (1082/7208) Receiving objects: 16% (1154/7208) Receiving objects: 17% (1226/7208) Receiving objects: 18% (1298/7208) Receiving objects: 19% (1370/7208) Receiving objects: 20% (1442/7208) Receiving objects: 21% (1514/7208) Receiving objects: 22% (1586/7208) Receiving objects: 23% (1658/7208) Receiving objects: 24% (1730/7208) Receiving objects: 25% (1802/7208) Receiving objects: 26% (1875/7208) Receiving objects: 27% (1947/7208) Receiving objects: 28% (2019/7208) Receiving objects: 29% (2091/7208) Receiving objects: 30% (2163/7208) Receiving objects: 31% (2235/7208) Receiving objects: 32% (2307/7208) Receiving objects: 33% (2379/7208) Receiving objects: 34% (2451/7208) Receiving objects: 35% (2523/7208) Receiving objects: 36% (2595/7208) Receiving objects: 37% (2667/7208) Receiving objects: 38% (2740/7208) Receiving objects: 39% (2812/7208) Receiving objects: 40% (2884/7208) Receiving objects: 41% (2956/7208) Receiving objects: 42% (3028/7208) Receiving objects: 43% (3100/7208) Receiving objects: 44% (3172/7208) Receiving objects: 45% (3244/7208) Receiving objects: 46% (3316/7208) Receiving objects: 47% (3388/7208) Receiving objects: 48% (3460/7208) Receiving objects: 49% (3532/7208) Receiving objects: 50% (3604/7208) Receiving objects: 51% (3677/7208) Receiving objects: 52% (3749/7208) Receiving objects: 53% (3821/7208) Receiving objects: 54% (3893/7208) Receiving objects: 55% (3965/7208) Receiving objects: 56% (4037/7208) Receiving objects: 57% (4109/7208) Receiving objects: 58% (4181/7208) Receiving objects: 59% (4253/7208) Receiving objects: 60% (4325/7208) Receiving objects: 61% (4397/7208) Receiving objects: 62% (4469/7208) Receiving objects: 63% (4542/7208) Receiving objects: 64% (4614/7208) Receiving objects: 65% (4686/7208) Receiving objects: 66% (4758/7208) Receiving objects: 67% (4830/7208) Receiving objects: 68% (4902/7208) Receiving objects: 69% (4974/7208) Receiving objects: 70% (5046/7208) Receiving objects: 71% (5118/7208) Receiving objects: 72% (5190/7208) Receiving objects: 73% (5262/7208) Receiving objects: 74% (5334/7208) Receiving objects: 75% (5406/7208) Receiving objects: 76% (5479/7208) Receiving objects: 77% (5551/7208) Receiving objects: 78% (5623/7208) Receiving objects: 79% (5695/7208) Receiving objects: 80% (5767/7208) Receiving objects: 81% (5839/7208) Receiving objects: 82% (5911/7208) Receiving objects: 83% (5983/7208) Receiving objects: 84% (6055/7208) Receiving objects: 85% (6127/7208) Receiving objects: 86% (6199/7208) Receiving objects: 87% (6271/7208) Receiving objects: 88% (6344/7208) Receiving objects: 89% (6416/7208) Receiving objects: 90% (6488/7208) Receiving objects: 91% (6560/7208) Receiving objects: 92% (6632/7208) Receiving objects: 93% (6704/7208) Receiving objects: 94% (6776/7208) Receiving objects: 95% (6848/7208) Receiving objects: 96% (6920/7208) Receiving objects: 97% (6992/7208) Receiving objects: 98% (7064/7208) remote: Total 7208 (delta 1953), reused 1986 (delta 1953), pack-reused 5199
Receiving objects: 99% (7136/7208) Receiving objects: 100% (7208/7208) Receiving objects: 100% (7208/7208), 1.95 MiB | 0 bytes/s, done.
Resolving deltas: 0% (0/2744) Resolving deltas: 1% (28/2744) Resolving deltas: 2% (55/2744) Resolving deltas: 3% (85/2744) Resolving deltas: 4% (111/2744) Resolving deltas: 5% (140/2744) Resolving deltas: 6% (165/2744) Resolving deltas: 7% (201/2744) Resolving deltas: 8% (220/2744) Resolving deltas: 9% (251/2744) Resolving deltas: 13% (367/2744) Resolving deltas: 14% (387/2744) Resolving deltas: 15% (414/2744) Resolving deltas: 16% (446/2744) Resolving deltas: 17% (469/2744) Resolving deltas: 18% (505/2744) Resolving deltas: 19% (525/2744) Resolving deltas: 20% (569/2744) Resolving deltas: 21% (579/2744) Resolving deltas: 22% (604/2744) Resolving deltas: 23% (633/2744) Resolving deltas: 24% (674/2744) Resolving deltas: 25% (686/2744) Resolving deltas: 26% (714/2744) Resolving deltas: 27% (741/2744) Resolving deltas: 28% (774/2744) Resolving deltas: 29% (796/2744) Resolving deltas: 30% (825/2744) Resolving deltas: 31% (853/2744) Resolving deltas: 32% (879/2744) Resolving deltas: 33% (906/2744) Resolving deltas: 34% (933/2744) Resolving deltas: 35% (961/2744) Resolving deltas: 36% (988/2744) Resolving deltas: 37% (1016/2744) Resolving deltas: 38% (1043/2744) Resolving deltas: 39% (1072/2744) Resolving deltas: 40% (1098/2744) Resolving deltas: 41% (1126/2744) Resolving deltas: 41% (1135/2744), completed with 182 local objects.
fatal: pack has 1609 unresolved deltas
fatal: index-pack failed
at org.jenkinsci.plugins.gitclient.CliGitAPIImpl.launchCommandIn(CliGitAPIImpl.java:2002)
at org.jenkinsci.plugins.gitclient.CliGitAPIImpl.launchCommandWithCredentials(CliGitAPIImpl.java:1721)
at org.jenkinsci.plugins.gitclient.CliGitAPIImpl.access$300(CliGitAPIImpl.java:72)
at org.jenkinsci.plugins.gitclient.CliGitAPIImpl$1.execute(CliGitAPIImpl.java:405)
at org.jenkinsci.plugins.gitclient.RemoteGitImpl$CommandInvocationHandler$1.call(RemoteGitImpl.java:153)
at org.jenkinsci.plugins.gitclient.RemoteGitImpl$CommandInvocationHandler$1.call(RemoteGitImpl.java:146)
at hudson.remoting.UserRequest.perform(UserRequest.java:212)
at hudson.remoting.UserRequest.perform(UserRequest.java:54)
at hudson.remoting.Request$2.run(Request.java:369)
at hudson.remoting.InterceptingExecutorService$1.call(InterceptingExecutorService.java:72)
at java.util.concurrent.FutureTask.run(FutureTask.java:266)
at java.util.concurrent.ThreadPoolExecutor.runWorker(ThreadPoolExecutor.java:1142)
at java.util.concurrent.ThreadPoolExecutor$Worker.run(ThreadPoolExecutor.java:617)
at java.lang.Thread.run(Thread.java:748)
Suppressed: hudson.remoting.Channel$CallSiteStackTrace: Remote call to H32
at hudson.remoting.Channel.attachCallSiteStackTrace(Channel.java:1741)
at hudson.remoting.UserRequest$ExceptionResponse.retrieve(UserRequest.java:357)
at hudson.remoting.Channel.call(Channel.java:955)
at org.jenkinsci.plugins.gitclient.RemoteGitImpl$CommandInvocationHandler.execute(RemoteGitImpl.java:146)
at sun.reflect.GeneratedMethodAccessor1346.invoke(Unknown Source)
at sun.reflect.DelegatingMethodAccessorImpl.invoke(DelegatingMethodAccessorImpl.java:43)
at java.lang.reflect.Method.invoke(Method.java:498)
at org.jenkinsci.plugins.gitclient.RemoteGitImpl$CommandInvocationHandler.invoke(RemoteGitImpl.java:132)
at com.sun.proxy.$Proxy115.execute(Unknown Source)
at hudson.plugins.git.GitSCM.fetchFrom(GitSCM.java:886)
at hudson.plugins.git.GitSCM.retrieveChanges(GitSCM.java:1155)
at hudson.plugins.git.GitSCM.checkout(GitSCM.java:1186)
at hudson.scm.SCM.checkout(SCM.java:504)
at hudson.model.AbstractProject.checkout(AbstractProject.java:1208)
at hudson.model.AbstractBuild$AbstractBuildExecution.defaultCheckout(AbstractBuild.java:574)
at jenkins.scm.SCMCheckoutStrategy.checkout(SCMCheckoutStrategy.java:86)
at hudson.model.AbstractBuild$AbstractBuildExecution.run(AbstractBuild.java:499)
at hudson.model.Run.execute(Run.java:1794)
at hudson.model.FreeStyleBuild.run(FreeStyleBuild.java:43)
at hudson.model.ResourceController.execute(ResourceController.java:97)
at hudson.model.Executor.run(Executor.java:429)
ERROR: Error fetching remote repo 'origin'
Retrying after 10 seconds
> git rev-parse --is-inside-work-tree # timeout=10
Fetching changes from the remote Git repository
> git config remote.origin.url https://github.com/apache/kafka.git # timeout=10
Fetching upstream changes from https://github.com/apache/kafka.git
> git --version # timeout=10
> git fetch --tags --progress https://github.com/apache/kafka.git +refs/heads/*:refs/remotes/origin/*
ERROR: Error fetching remote repo 'origin'
hudson.plugins.git.GitException: Failed to fetch from https://github.com/apache/kafka.git
at hudson.plugins.git.GitSCM.fetchFrom(GitSCM.java:888)
at hudson.plugins.git.GitSCM.retrieveChanges(GitSCM.java:1155)
at hudson.plugins.git.GitSCM.checkout(GitSCM.java:1186)
at hudson.scm.SCM.checkout(SCM.java:504)
at hudson.model.AbstractProject.checkout(AbstractProject.java:1208)
at hudson.model.AbstractBuild$AbstractBuildExecution.defaultCheckout(AbstractBuild.java:574)
at jenkins.scm.SCMCheckoutStrategy.checkout(SCMCheckoutStrategy.java:86)
at hudson.model.AbstractBuild$AbstractBuildExecution.run(AbstractBuild.java:499)
at hudson.model.Run.execute(Run.java:1794)
at hudson.model.FreeStyleBuild.run(FreeStyleBuild.java:43)
at hudson.model.ResourceController.execute(ResourceController.java:97)
at hudson.model.Executor.run(Executor.java:429)
Caused by: hudson.plugins.git.GitException: Command "git fetch --tags --progress https://github.com/apache/kafka.git +refs/heads/*:refs/remotes/origin/*" returned status code 128:
stdout:
stderr: error: Could not read 0f3affc0f40751dc8fd064b36b6e859728f63e37
error: Could not read 95fbb2e03f4fe79737c71632e0ef2dfdcfb85a69
error: Could not read 08c465028d057ac23cdfe6d57641fe40240359dd
remote: Counting objects: 7208, done.
remote: Compressing objects: 2% (1/42) remote: Compressing objects: 4% (2/42) remote: Compressing objects: 7% (3/42) remote: Compressing objects: 9% (4/42) remote: Compressing objects: 11% (5/42) remote: Compressing objects: 14% (6/42) remote: Compressing objects: 16% (7/42) remote: Compressing objects: 19% (8/42) remote: Compressing objects: 21% (9/42) remote: Compressing objects: 23% (10/42) remote: Compressing objects: 26% (11/42) remote: Compressing objects: 28% (12/42) remote: Compressing objects: 30% (13/42) remote: Compressing objects: 33% (14/42) remote: Compressing objects: 35% (15/42) remote: Compressing objects: 38% (16/42) remote: Compressing objects: 40% (17/42) remote: Compressing objects: 42% (18/42) remote: Compressing objects: 45% (19/42) remote: Compressing objects: 47% (20/42) remote: Compressing objects: 50% (21/42) remote: Compressing objects: 52% (22/42) remote: Compressing objects: 54% (23/42) remote: Compressing objects: 57% (24/42) remote: Compressing objects: 59% (25/42) remote: Compressing objects: 61% (26/42) remote: Compressing objects: 64% (27/42) remote: Compressing objects: 66% (28/42) remote: Compressing objects: 69% (29/42) remote: Compressing objects: 71% (30/42) remote: Compressing objects: 73% (31/42) remote: Compressing objects: 76% (32/42) remote: Compressing objects: 78% (33/42) remote: Compressing objects: 80% (34/42) remote: Compressing objects: 83% (35/42) remote: Compressing objects: 85% (36/42) remote: Compressing objects: 88% (37/42) remote: Compressing objects: 90% (38/42) remote: Compressing objects: 92% (39/42) remote: Compressing objects: 95% (40/42) remote: Compressing objects: 97% (41/42) remote: Compressing objects: 100% (42/42) remote: Compressing objects: 100% (42/42), done.
Receiving objects: 0% (1/7208) Receiving objects: 1% (73/7208) Receiving objects: 2% (145/7208) Receiving objects: 3% (217/7208) Receiving objects: 4% (289/7208) Receiving objects: 5% (361/7208) Receiving objects: 6% (433/7208) Receiving objects: 7% (505/7208) Receiving objects: 8% (577/7208) Receiving objects: 9% (649/7208) Receiving objects: 10% (721/7208) Receiving objects: 11% (793/7208) Receiving objects: 12% (865/7208) Receiving objects: 13% (938/7208) Receiving objects: 14% (1010/7208) Receiving objects: 15% (1082/7208) Receiving objects: 16% (1154/7208) Receiving objects: 17% (1226/7208) Receiving objects: 18% (1298/7208) Receiving objects: 19% (1370/7208) Receiving objects: 20% (1442/7208) Receiving objects: 21% (1514/7208) Receiving objects: 22% (1586/7208) Receiving objects: 23% (1658/7208) Receiving objects: 24% (1730/7208) Receiving objects: 25% (1802/7208) Receiving objects: 26% (1875/7208) Receiving objects: 27% (1947/7208) Receiving objects: 28% (2019/7208) Receiving objects: 29% (2091/7208) Receiving objects: 30% (2163/7208) Receiving objects: 31% (2235/7208) Receiving objects: 32% (2307/7208) Receiving objects: 33% (2379/7208) Receiving objects: 34% (2451/7208) Receiving objects: 35% (2523/7208) Receiving objects: 36% (2595/7208) Receiving objects: 37% (2667/7208) Receiving objects: 38% (2740/7208) Receiving objects: 39% (2812/7208) Receiving objects: 40% (2884/7208) Receiving objects: 41% (2956/7208) Receiving objects: 42% (3028/7208) Receiving objects: 43% (3100/7208) Receiving objects: 44% (3172/7208) Receiving objects: 45% (3244/7208) Receiving objects: 46% (3316/7208) Receiving objects: 47% (3388/7208) Receiving objects: 48% (3460/7208) Receiving objects: 49% (3532/7208) Receiving objects: 50% (3604/7208) Receiving objects: 51% (3677/7208) Receiving objects: 52% (3749/7208) Receiving objects: 53% (3821/7208) Receiving objects: 54% (3893/7208) Receiving objects: 55% (3965/7208) Receiving objects: 56% (4037/7208) Receiving objects: 57% (4109/7208) Receiving objects: 58% (4181/7208) Receiving objects: 59% (4253/7208) Receiving objects: 60% (4325/7208) Receiving objects: 61% (4397/7208) Receiving objects: 62% (4469/7208) Receiving objects: 63% (4542/7208) Receiving objects: 64% (4614/7208) Receiving objects: 65% (4686/7208) Receiving objects: 66% (4758/7208) Receiving objects: 67% (4830/7208) Receiving objects: 68% (4902/7208) Receiving objects: 69% (4974/7208) Receiving objects: 70% (5046/7208) Receiving objects: 71% (5118/7208) Receiving objects: 72% (5190/7208) Receiving objects: 73% (5262/7208) Receiving objects: 74% (5334/7208) Receiving objects: 75% (5406/7208) Receiving objects: 76% (5479/7208) Receiving objects: 77% (5551/7208) Receiving objects: 78% (5623/7208) Receiving objects: 79% (5695/7208) Receiving objects: 80% (5767/7208) Receiving objects: 81% (5839/7208) Receiving objects: 82% (5911/7208) Receiving objects: 83% (5983/7208) Receiving objects: 84% (6055/7208) Receiving objects: 85% (6127/7208) Receiving objects: 86% (6199/7208) Receiving objects: 87% (6271/7208) Receiving objects: 88% (6344/7208) Receiving objects: 89% (6416/7208) Receiving objects: 90% (6488/7208) Receiving objects: 91% (6560/7208) Receiving objects: 92% (6632/7208) Receiving objects: 93% (6704/7208) Receiving objects: 94% (6776/7208) Receiving objects: 95% (6848/7208) Receiving objects: 96% (6920/7208) Receiving objects: 97% (6992/7208) Receiving objects: 98% (7064/7208) remote: Total 7208 (delta 1953), reused 1986 (delta 1953), pack-reused 5199
Receiving objects: 99% (7136/7208) Receiving objects: 100% (7208/7208) Receiving objects: 100% (7208/7208), 1.95 MiB | 0 bytes/s, done.
Resolving deltas: 0% (0/2744) Resolving deltas: 1% (28/2744) Resolving deltas: 2% (55/2744) Resolving deltas: 3% (83/2744) Resolving deltas: 4% (111/2744) Resolving deltas: 5% (138/2744) Resolving deltas: 6% (167/2744) Resolving deltas: 7% (203/2744) Resolving deltas: 8% (220/2744) Resolving deltas: 9% (257/2744) Resolving deltas: 13% (362/2744) Resolving deltas: 14% (391/2744) Resolving deltas: 15% (422/2744) Resolving deltas: 16% (444/2744) Resolving deltas: 17% (469/2744) Resolving deltas: 18% (497/2744) Resolving deltas: 20% (574/2744) Resolving deltas: 21% (579/2744) Resolving deltas: 22% (604/2744) Resolving deltas: 23% (639/2744) Resolving deltas: 24% (666/2744) Resolving deltas: 25% (686/2744) Resolving deltas: 26% (714/2744) Resolving deltas: 27% (741/2744) Resolving deltas: 28% (774/2744) Resolving deltas: 29% (796/2744) Resolving deltas: 30% (825/2744) Resolving deltas: 31% (853/2744) Resolving deltas: 32% (879/2744) Resolving deltas: 33% (906/2744) Resolving deltas: 34% (933/2744) Resolving deltas: 35% (961/2744) Resolving deltas: 36% (988/2744) Resolving deltas: 37% (1016/2744) Resolving deltas: 38% (1043/2744) Resolving deltas: 39% (1072/2744) Resolving deltas: 40% (1098/2744) Resolving deltas: 41% (1126/2744) Resolving deltas: 41% (1135/2744), completed with 182 local objects.
fatal: pack has 1609 unresolved deltas
fatal: index-pack failed
at org.jenkinsci.plugins.gitclient.CliGitAPIImpl.launchCommandIn(CliGitAPIImpl.java:2002)
at org.jenkinsci.plugins.gitclient.CliGitAPIImpl.launchCommandWithCredentials(CliGitAPIImpl.java:1721)
at org.jenkinsci.plugins.gitclient.CliGitAPIImpl.access$300(CliGitAPIImpl.java:72)
at org.jenkinsci.plugins.gitclient.CliGitAPIImpl$1.execute(CliGitAPIImpl.java:405)
at org.jenkinsci.plugins.gitclient.RemoteGitImpl$CommandInvocationHandler$1.call(RemoteGitImpl.java:153)
at org.jenkinsci.plugins.gitclient.RemoteGitImpl$CommandInvocationHandler$1.call(RemoteGitImpl.java:146)
at hudson.remoting.UserRequest.perform(UserRequest.java:212)
at hudson.remoting.UserRequest.perform(UserRequest.java:54)
at hudson.remoting.Request$2.run(Request.java:369)
at hudson.remoting.InterceptingExecutorService$1.call(InterceptingExecutorService.java:72)
at java.util.concurrent.FutureTask.run(FutureTask.java:266)
at java.util.concurrent.ThreadPoolExecutor.runWorker(ThreadPoolExecutor.java:1142)
at java.util.concurrent.ThreadPoolExecutor$Worker.run(ThreadPoolExecutor.java:617)
at java.lang.Thread.run(Thread.java:748)
Suppressed: hudson.remoting.Channel$CallSiteStackTrace: Remote call to H32
at hudson.remoting.Channel.attachCallSiteStackTrace(Channel.java:1741)
at hudson.remoting.UserRequest$ExceptionResponse.retrieve(UserRequest.java:357)
at hudson.remoting.Channel.call(Channel.java:955)
at org.jenkinsci.plugins.gitclient.RemoteGitImpl$CommandInvocationHandler.execute(RemoteGitImpl.java:146)
at sun.reflect.GeneratedMethodAccessor1346.invoke(Unknown Source)
at sun.reflect.DelegatingMethodAccessorImpl.invoke(DelegatingMethodAccessorImpl.java:43)
at java.lang.reflect.Method.invoke(Method.java:498)
at org.jenkinsci.plugins.gitclient.RemoteGitImpl$CommandInvocationHandler.invoke(RemoteGitImpl.java:132)
at com.sun.proxy.$Proxy115.execute(Unknown Source)
at hudson.plugins.git.GitSCM.fetchFrom(GitSCM.java:886)
at hudson.plugins.git.GitSCM.retrieveChanges(GitSCM.java:1155)
at hudson.plugins.git.GitSCM.checkout(GitSCM.java:1186)
at hudson.scm.SCM.checkout(SCM.java:504)
at hudson.model.AbstractProject.checkout(AbstractProject.java:1208)
at hudson.model.AbstractBuild$AbstractBuildExecution.defaultCheckout(AbstractBuild.java:574)
at jenkins.scm.SCMCheckoutStrategy.checkout(SCMCheckoutStrategy.java:86)
at hudson.model.AbstractBuild$AbstractBuildExecution.run(AbstractBuild.java:499)
at hudson.model.Run.execute(Run.java:1794)
at hudson.model.FreeStyleBuild.run(FreeStyleBuild.java:43)
at hudson.model.ResourceController.execute(ResourceController.java:97)
at hudson.model.Executor.run(Executor.java:429)
ERROR: Error fetching remote repo 'origin'
[FINDBUGS] Collecting findbugs analysis files...
[FINDBUGS] Searching for all files in <https://builds.apache.org/job/kafka-trunk-jdk8/ws/> that match the pattern **/build/reports/findbugs/*.xml
[FINDBUGS] Parsing 15 files in <https://builds.apache.org/job/kafka-trunk-jdk8/ws/>
[FINDBUGS] Successfully parsed file <https://builds.apache.org/job/kafka-trunk-jdk8/ws/clients/build/reports/findbugs/main.xml> with 0 unique warnings and 0 duplicates.
[FINDBUGS] Successfully parsed file <https://builds.apache.org/job/kafka-trunk-jdk8/ws/connect/api/build/reports/findbugs/main.xml> with 0 unique warnings and 0 duplicates.
[FINDBUGS] Successfully parsed file <https://builds.apache.org/job/kafka-trunk-jdk8/ws/connect/basic-auth-extension/build/reports/findbugs/main.xml> with 0 unique warnings and 0 duplicates.
[FINDBUGS] Successfully parsed file <https://builds.apache.org/job/kafka-trunk-jdk8/ws/connect/file/build/reports/findbugs/main.xml> with 0 unique warnings and 0 duplicates.
[FINDBUGS] Successfully parsed file <https://builds.apache.org/job/kafka-trunk-jdk8/ws/connect/json/build/reports/findbugs/main.xml> with 0 unique warnings and 0 duplicates.
[FINDBUGS] Successfully parsed file <https://builds.apache.org/job/kafka-trunk-jdk8/ws/connect/runtime/build/reports/findbugs/main.xml> with 0 unique warnings and 0 duplicates.
[FINDBUGS] Successfully parsed file <https://builds.apache.org/job/kafka-trunk-jdk8/ws/connect/transforms/build/reports/findbugs/main.xml> with 0 unique warnings and 0 duplicates.
[FINDBUGS] Successfully parsed file <https://builds.apache.org/job/kafka-trunk-jdk8/ws/core/build/reports/findbugs/main.xml> with 0 unique warnings and 0 duplicates.
[FINDBUGS] Successfully parsed file <https://builds.apache.org/job/kafka-trunk-jdk8/ws/examples/build/reports/findbugs/main.xml> with 0 unique warnings and 0 duplicates.
[FINDBUGS] Successfully parsed file <https://builds.apache.org/job/kafka-trunk-jdk8/ws/log4j-appender/build/reports/findbugs/main.xml> with 0 unique warnings and 0 duplicates.
[FINDBUGS] Successfully parsed file <https://builds.apache.org/job/kafka-trunk-jdk8/ws/streams/build/reports/findbugs/main.xml> with 0 unique warnings and 0 duplicates.
[FINDBUGS] Successfully parsed file <https://builds.apache.org/job/kafka-trunk-jdk8/ws/streams/examples/build/reports/findbugs/main.xml> with 0 unique warnings and 0 duplicates.
[FINDBUGS] Successfully parsed file <https://builds.apache.org/job/kafka-trunk-jdk8/ws/streams/streams-scala/build/reports/findbugs/main.xml> with 0 unique warnings and 0 duplicates.
[FINDBUGS] Successfully parsed file <https://builds.apache.org/job/kafka-trunk-jdk8/ws/streams/test-utils/build/reports/findbugs/main.xml> with 0 unique warnings and 0 duplicates.
[FINDBUGS] Successfully parsed file <https://builds.apache.org/job/kafka-trunk-jdk8/ws/tools/build/reports/findbugs/main.xml> with 0 unique warnings and 0 duplicates.
<Git Blamer> Using GitBlamer to create author and commit information for all warnings.
<Git Blamer> GIT_COMMIT=cf2c5e9ffc066aad37090fb6f2953a602cd8621b, workspace=<https://builds.apache.org/job/kafka-trunk-jdk8/ws/>
[FINDBUGS] Computing warning deltas based on reference build #2859
Recording test results
ERROR: Step ?Publish JUnit test result report? failed: Test reports were found but none of them are new. Did leafNodes run?
For example, <https://builds.apache.org/job/kafka-trunk-jdk8/ws/clients/build/test-results/test/TEST-org.apache.kafka.clients.ApiVersionsTest.xml> is 13 days old
Not sending mail to unregistered user wangguoz@gmail.com
Not sending mail to unregistered user noreply@github.com
Build failed in Jenkins: kafka-trunk-jdk8 #2862
Posted by Apache Jenkins Server <je...@builds.apache.org>.
See <https://builds.apache.org/job/kafka-trunk-jdk8/2862/display/redirect?page=changes>
Changes:
[wangguoz] MINOR: clean up node and store sensors (#5450)
------------------------------------------
[...truncated 2.48 MB...]
org.apache.kafka.streams.TopologyTest > multipleSourcesWithProcessorsShouldHaveDistinctSubtopologies PASSED
org.apache.kafka.streams.TopologyTest > shouldThrowOnUnassignedStateStoreAccess STARTED
org.apache.kafka.streams.TopologyTest > shouldThrowOnUnassignedStateStoreAccess PASSED
org.apache.kafka.streams.TopologyTest > shouldNotAllowNullProcessorNameWhenConnectingProcessorAndStateStores STARTED
org.apache.kafka.streams.TopologyTest > shouldNotAllowNullProcessorNameWhenConnectingProcessorAndStateStores PASSED
org.apache.kafka.streams.TopologyTest > kTableAnonymousMaterializedMapValuesShouldPreserveTopologyStructure STARTED
org.apache.kafka.streams.TopologyTest > kTableAnonymousMaterializedMapValuesShouldPreserveTopologyStructure PASSED
org.apache.kafka.streams.TopologyTest > sessionWindowZeroArgCountShouldPreserveTopologyStructure STARTED
org.apache.kafka.streams.TopologyTest > sessionWindowZeroArgCountShouldPreserveTopologyStructure PASSED
org.apache.kafka.streams.TopologyTest > tableAnonymousMaterializedCountShouldPreserveTopologyStructure STARTED
org.apache.kafka.streams.TopologyTest > tableAnonymousMaterializedCountShouldPreserveTopologyStructure PASSED
org.apache.kafka.streams.TopologyTest > shouldDescribeGlobalStoreTopology STARTED
org.apache.kafka.streams.TopologyTest > shouldDescribeGlobalStoreTopology PASSED
org.apache.kafka.streams.TopologyTest > kTableNonMaterializedMapValuesShouldPreserveTopologyStructure STARTED
org.apache.kafka.streams.TopologyTest > kTableNonMaterializedMapValuesShouldPreserveTopologyStructure PASSED
org.apache.kafka.streams.TopologyTest > kGroupedStreamAnonymousMaterializedCountShouldPreserveTopologyStructure STARTED
org.apache.kafka.streams.TopologyTest > kGroupedStreamAnonymousMaterializedCountShouldPreserveTopologyStructure PASSED
org.apache.kafka.streams.TopologyTest > shouldDescribeMultipleGlobalStoreTopology STARTED
org.apache.kafka.streams.TopologyTest > shouldDescribeMultipleGlobalStoreTopology PASSED
org.apache.kafka.streams.TopologyTest > shouldNotAllowToAddSinkWithSameName STARTED
org.apache.kafka.streams.TopologyTest > shouldNotAllowToAddSinkWithSameName PASSED
org.apache.kafka.streams.TopologyTest > shouldNotAllowToAddSinkWithNullParents STARTED
org.apache.kafka.streams.TopologyTest > shouldNotAllowToAddSinkWithNullParents PASSED
org.apache.kafka.streams.TopologyTest > shouldNotAllowNullProcessorSupplierWhenAddingProcessor STARTED
org.apache.kafka.streams.TopologyTest > shouldNotAllowNullProcessorSupplierWhenAddingProcessor PASSED
org.apache.kafka.streams.TopologyTest > timeWindowAnonymousMaterializedCountShouldPreserveTopologyStructure STARTED
org.apache.kafka.streams.TopologyTest > timeWindowAnonymousMaterializedCountShouldPreserveTopologyStructure PASSED
org.apache.kafka.streams.TopologyTest > shouldFailIfSinkIsParent STARTED
org.apache.kafka.streams.TopologyTest > shouldFailIfSinkIsParent PASSED
org.apache.kafka.streams.TopologyTest > shouldNotAllowToAddSourcesWithSameName STARTED
org.apache.kafka.streams.TopologyTest > shouldNotAllowToAddSourcesWithSameName PASSED
org.apache.kafka.streams.TopologyTest > sourceAndProcessorWithMultipleStatesShouldHaveSingleSubtopology STARTED
org.apache.kafka.streams.TopologyTest > sourceAndProcessorWithMultipleStatesShouldHaveSingleSubtopology PASSED
org.apache.kafka.streams.TopologyTest > shouldDescribeEmptyTopology STARTED
org.apache.kafka.streams.TopologyTest > shouldDescribeEmptyTopology PASSED
org.apache.kafka.streams.TopologyTest > shouldFailIfSinkIsItsOwnParent STARTED
org.apache.kafka.streams.TopologyTest > shouldFailIfSinkIsItsOwnParent PASSED
org.apache.kafka.streams.TopologyTest > testPatternMatchesAlreadyProvidedTopicSource STARTED
org.apache.kafka.streams.TopologyTest > testPatternMatchesAlreadyProvidedTopicSource PASSED
org.apache.kafka.streams.TopologyTest > singleSourcePatternShouldHaveSingleSubtopology STARTED
org.apache.kafka.streams.TopologyTest > singleSourcePatternShouldHaveSingleSubtopology PASSED
org.apache.kafka.streams.TopologyTest > kTableNonMaterializedFilterShouldPreserveTopologyStructure STARTED
org.apache.kafka.streams.TopologyTest > kTableNonMaterializedFilterShouldPreserveTopologyStructure PASSED
org.apache.kafka.streams.TopologyTest > singleSourceShouldHaveSingleSubtopology STARTED
org.apache.kafka.streams.TopologyTest > singleSourceShouldHaveSingleSubtopology PASSED
org.apache.kafka.streams.TopologyTest > shouldNotAllowNullTopicChooserWhenAddingSink STARTED
org.apache.kafka.streams.TopologyTest > shouldNotAllowNullTopicChooserWhenAddingSink PASSED
org.apache.kafka.streams.TopologyTest > processorsWithSameSinkShouldHaveSameSubtopology STARTED
org.apache.kafka.streams.TopologyTest > processorsWithSameSinkShouldHaveSameSubtopology PASSED
org.apache.kafka.streams.TopologyTest > shouldNotAllowNullTopicsWhenAddingSoureWithTopic STARTED
org.apache.kafka.streams.TopologyTest > shouldNotAllowNullTopicsWhenAddingSoureWithTopic PASSED
org.apache.kafka.streams.TopologyTest > shouldFailWithUnknownParent STARTED
org.apache.kafka.streams.TopologyTest > shouldFailWithUnknownParent PASSED
org.apache.kafka.streams.TopologyTest > kTableAnonymousMaterializedFilterShouldPreserveTopologyStructure STARTED
org.apache.kafka.streams.TopologyTest > kTableAnonymousMaterializedFilterShouldPreserveTopologyStructure PASSED
org.apache.kafka.streams.TopologyTest > shouldNotAllowToAddProcessorWithEmptyParents STARTED
org.apache.kafka.streams.TopologyTest > shouldNotAllowToAddProcessorWithEmptyParents PASSED
org.apache.kafka.streams.TopologyTest > sessionWindowAnonymousMaterializedCountShouldPreserveTopologyStructure STARTED
org.apache.kafka.streams.TopologyTest > sessionWindowAnonymousMaterializedCountShouldPreserveTopologyStructure PASSED
org.apache.kafka.streams.TopologyTest > shouldFailIfNodeIsItsOwnParent STARTED
org.apache.kafka.streams.TopologyTest > shouldFailIfNodeIsItsOwnParent PASSED
org.apache.kafka.streams.TopologyTest > shouldNotAllowToAddStateStoreToSource STARTED
org.apache.kafka.streams.TopologyTest > shouldNotAllowToAddStateStoreToSource PASSED
org.apache.kafka.streams.TopologyTest > shouldNotAllowNullNameWhenAddingProcessor STARTED
org.apache.kafka.streams.TopologyTest > shouldNotAllowNullNameWhenAddingProcessor PASSED
org.apache.kafka.streams.TopologyTest > shouldNotAllowToAddStoreWithSameName STARTED
org.apache.kafka.streams.TopologyTest > shouldNotAllowToAddStoreWithSameName PASSED
org.apache.kafka.streams.TopologyTest > shouldNotAllowToAddProcessorWithNullParents STARTED
org.apache.kafka.streams.TopologyTest > shouldNotAllowToAddProcessorWithNullParents PASSED
org.apache.kafka.streams.TopologyTest > shouldNotAllowNullNameWhenAddingSourceWithPattern STARTED
org.apache.kafka.streams.TopologyTest > shouldNotAllowNullNameWhenAddingSourceWithPattern PASSED
org.apache.kafka.streams.TopologyTest > multipleSourcesWithSinksShouldHaveDistinctSubtopologies STARTED
org.apache.kafka.streams.TopologyTest > multipleSourcesWithSinksShouldHaveDistinctSubtopologies PASSED
org.apache.kafka.streams.TopologyTest > kGroupedStreamZeroArgCountShouldPreserveTopologyStructure STARTED
org.apache.kafka.streams.TopologyTest > kGroupedStreamZeroArgCountShouldPreserveTopologyStructure PASSED
org.apache.kafka.streams.TopologyTest > sessionWindowNamedMaterializedCountShouldPreserveTopologyStructure STARTED
org.apache.kafka.streams.TopologyTest > sessionWindowNamedMaterializedCountShouldPreserveTopologyStructure PASSED
org.apache.kafka.streams.tools.StreamsResetterTest > testShiftOffsetByWhenBetweenBeginningAndEndOffset STARTED
org.apache.kafka.streams.tools.StreamsResetterTest > testShiftOffsetByWhenBetweenBeginningAndEndOffset PASSED
org.apache.kafka.streams.tools.StreamsResetterTest > testResetToSpecificOffsetWhenAfterEndOffset STARTED
org.apache.kafka.streams.tools.StreamsResetterTest > testResetToSpecificOffsetWhenAfterEndOffset PASSED
org.apache.kafka.streams.tools.StreamsResetterTest > shouldAcceptValidDateFormats STARTED
org.apache.kafka.streams.tools.StreamsResetterTest > shouldAcceptValidDateFormats PASSED
org.apache.kafka.streams.tools.StreamsResetterTest > shouldDeleteTopic STARTED
org.apache.kafka.streams.tools.StreamsResetterTest > shouldDeleteTopic PASSED
org.apache.kafka.streams.tools.StreamsResetterTest > testResetToSpecificOffsetWhenBetweenBeginningAndEndOffset STARTED
org.apache.kafka.streams.tools.StreamsResetterTest > testResetToSpecificOffsetWhenBetweenBeginningAndEndOffset PASSED
org.apache.kafka.streams.tools.StreamsResetterTest > testShiftOffsetByWhenAfterEndOffset STARTED
org.apache.kafka.streams.tools.StreamsResetterTest > testShiftOffsetByWhenAfterEndOffset PASSED
org.apache.kafka.streams.tools.StreamsResetterTest > testResetToSpecificOffsetWhenBeforeBeginningOffset STARTED
org.apache.kafka.streams.tools.StreamsResetterTest > testResetToSpecificOffsetWhenBeforeBeginningOffset PASSED
org.apache.kafka.streams.tools.StreamsResetterTest > shouldSeekToEndOffset STARTED
org.apache.kafka.streams.tools.StreamsResetterTest > shouldSeekToEndOffset PASSED
org.apache.kafka.streams.tools.StreamsResetterTest > testResetUsingPlanWhenBetweenBeginningAndEndOffset STARTED
org.apache.kafka.streams.tools.StreamsResetterTest > testResetUsingPlanWhenBetweenBeginningAndEndOffset PASSED
org.apache.kafka.streams.tools.StreamsResetterTest > testResetUsingPlanWhenBeforeBeginningOffset STARTED
org.apache.kafka.streams.tools.StreamsResetterTest > testResetUsingPlanWhenBeforeBeginningOffset PASSED
org.apache.kafka.streams.tools.StreamsResetterTest > shouldThrowOnInvalidDateFormat STARTED
org.apache.kafka.streams.tools.StreamsResetterTest > shouldThrowOnInvalidDateFormat PASSED
org.apache.kafka.streams.tools.StreamsResetterTest > testResetUsingPlanWhenAfterEndOffset STARTED
org.apache.kafka.streams.tools.StreamsResetterTest > testResetUsingPlanWhenAfterEndOffset PASSED
org.apache.kafka.streams.tools.StreamsResetterTest > testShiftOffsetByWhenBeforeBeginningOffset STARTED
org.apache.kafka.streams.tools.StreamsResetterTest > testShiftOffsetByWhenBeforeBeginningOffset PASSED
org.apache.kafka.streams.KeyValueTest > shouldHaveSaneEqualsAndHashCode STARTED
org.apache.kafka.streams.KeyValueTest > shouldHaveSaneEqualsAndHashCode PASSED
1907 tests completed, 2 failed
> Task :streams:test FAILED
FAILURE: Build failed with an exception.
* What went wrong:
Execution failed for task ':streams:test'.
> There were failing tests. See the report at: file://<https://builds.apache.org/job/kafka-trunk-jdk8/ws/streams/build/reports/tests/test/index.html>
* Try:
Run with --stacktrace option to get the stack trace. Run with --info or --debug option to get more log output. Run with --scan to get full insights.
* Get more help at https://help.gradle.org
BUILD FAILED in 4h 8m 15s
68 actionable tasks: 37 executed, 31 up-to-date
Build step 'Execute shell' marked build as failure
[FINDBUGS] Collecting findbugs analysis files...
Setting GRADLE_4_8_1_HOME=/home/jenkins/tools/gradle/4.8.1
[FINDBUGS] Searching for all files in <https://builds.apache.org/job/kafka-trunk-jdk8/ws/> that match the pattern **/build/reports/findbugs/*.xml
[FINDBUGS] Parsing 6 files in <https://builds.apache.org/job/kafka-trunk-jdk8/ws/>
[FINDBUGS] Successfully parsed file <https://builds.apache.org/job/kafka-trunk-jdk8/ws/clients/build/reports/findbugs/main.xml> with 0 unique warnings and 0 duplicates.
[FINDBUGS] Successfully parsed file <https://builds.apache.org/job/kafka-trunk-jdk8/ws/core/build/reports/findbugs/main.xml> with 0 unique warnings and 0 duplicates.
[FINDBUGS] Successfully parsed file <https://builds.apache.org/job/kafka-trunk-jdk8/ws/examples/build/reports/findbugs/main.xml> with 0 unique warnings and 0 duplicates.
[FINDBUGS] Successfully parsed file <https://builds.apache.org/job/kafka-trunk-jdk8/ws/log4j-appender/build/reports/findbugs/main.xml> with 0 unique warnings and 0 duplicates.
[FINDBUGS] Successfully parsed file <https://builds.apache.org/job/kafka-trunk-jdk8/ws/streams/build/reports/findbugs/main.xml> with 0 unique warnings and 0 duplicates.
[FINDBUGS] Successfully parsed file <https://builds.apache.org/job/kafka-trunk-jdk8/ws/streams/streams-scala/build/reports/findbugs/main.xml> with 0 unique warnings and 0 duplicates.
Setting GRADLE_4_8_1_HOME=/home/jenkins/tools/gradle/4.8.1
Setting GRADLE_4_8_1_HOME=/home/jenkins/tools/gradle/4.8.1
<Git Blamer> Using GitBlamer to create author and commit information for all warnings.
<Git Blamer> GIT_COMMIT=cf2c5e9ffc066aad37090fb6f2953a602cd8621b, workspace=<https://builds.apache.org/job/kafka-trunk-jdk8/ws/>
[FINDBUGS] Computing warning deltas based on reference build #2859
Recording test results
Setting GRADLE_4_8_1_HOME=/home/jenkins/tools/gradle/4.8.1
Setting GRADLE_4_8_1_HOME=/home/jenkins/tools/gradle/4.8.1
Not sending mail to unregistered user wangguoz@gmail.com
Not sending mail to unregistered user noreply@github.com
Build failed in Jenkins: kafka-trunk-jdk8 #2861
Posted by Apache Jenkins Server <je...@builds.apache.org>.
See <https://builds.apache.org/job/kafka-trunk-jdk8/2861/display/redirect?page=changes>
Changes:
[github] MINOR: Add Timer to simplify timeout bookkeeping and use it in the
------------------------------------------
[...truncated 2.48 MB...]
org.apache.kafka.streams.TopologyTest > multipleSourcesWithProcessorsShouldHaveDistinctSubtopologies STARTED
org.apache.kafka.streams.TopologyTest > multipleSourcesWithProcessorsShouldHaveDistinctSubtopologies PASSED
org.apache.kafka.streams.TopologyTest > shouldThrowOnUnassignedStateStoreAccess STARTED
org.apache.kafka.streams.TopologyTest > shouldThrowOnUnassignedStateStoreAccess PASSED
org.apache.kafka.streams.TopologyTest > shouldNotAllowNullProcessorNameWhenConnectingProcessorAndStateStores STARTED
org.apache.kafka.streams.TopologyTest > shouldNotAllowNullProcessorNameWhenConnectingProcessorAndStateStores PASSED
org.apache.kafka.streams.TopologyTest > kTableAnonymousMaterializedMapValuesShouldPreserveTopologyStructure STARTED
org.apache.kafka.streams.TopologyTest > kTableAnonymousMaterializedMapValuesShouldPreserveTopologyStructure PASSED
org.apache.kafka.streams.TopologyTest > sessionWindowZeroArgCountShouldPreserveTopologyStructure STARTED
org.apache.kafka.streams.TopologyTest > sessionWindowZeroArgCountShouldPreserveTopologyStructure PASSED
org.apache.kafka.streams.TopologyTest > tableAnonymousMaterializedCountShouldPreserveTopologyStructure STARTED
org.apache.kafka.streams.TopologyTest > tableAnonymousMaterializedCountShouldPreserveTopologyStructure PASSED
org.apache.kafka.streams.TopologyTest > shouldDescribeGlobalStoreTopology STARTED
org.apache.kafka.streams.TopologyTest > shouldDescribeGlobalStoreTopology PASSED
org.apache.kafka.streams.TopologyTest > kTableNonMaterializedMapValuesShouldPreserveTopologyStructure STARTED
org.apache.kafka.streams.TopologyTest > kTableNonMaterializedMapValuesShouldPreserveTopologyStructure PASSED
org.apache.kafka.streams.TopologyTest > kGroupedStreamAnonymousMaterializedCountShouldPreserveTopologyStructure STARTED
org.apache.kafka.streams.TopologyTest > kGroupedStreamAnonymousMaterializedCountShouldPreserveTopologyStructure PASSED
org.apache.kafka.streams.TopologyTest > shouldDescribeMultipleGlobalStoreTopology STARTED
org.apache.kafka.streams.TopologyTest > shouldDescribeMultipleGlobalStoreTopology PASSED
org.apache.kafka.streams.TopologyTest > shouldNotAllowToAddSinkWithSameName STARTED
org.apache.kafka.streams.TopologyTest > shouldNotAllowToAddSinkWithSameName PASSED
org.apache.kafka.streams.TopologyTest > shouldNotAllowToAddSinkWithNullParents STARTED
org.apache.kafka.streams.TopologyTest > shouldNotAllowToAddSinkWithNullParents PASSED
org.apache.kafka.streams.TopologyTest > shouldNotAllowNullProcessorSupplierWhenAddingProcessor STARTED
org.apache.kafka.streams.TopologyTest > shouldNotAllowNullProcessorSupplierWhenAddingProcessor PASSED
org.apache.kafka.streams.TopologyTest > timeWindowAnonymousMaterializedCountShouldPreserveTopologyStructure STARTED
org.apache.kafka.streams.TopologyTest > timeWindowAnonymousMaterializedCountShouldPreserveTopologyStructure PASSED
org.apache.kafka.streams.TopologyTest > shouldFailIfSinkIsParent STARTED
org.apache.kafka.streams.TopologyTest > shouldFailIfSinkIsParent PASSED
org.apache.kafka.streams.TopologyTest > shouldNotAllowToAddSourcesWithSameName STARTED
org.apache.kafka.streams.TopologyTest > shouldNotAllowToAddSourcesWithSameName PASSED
org.apache.kafka.streams.TopologyTest > sourceAndProcessorWithMultipleStatesShouldHaveSingleSubtopology STARTED
org.apache.kafka.streams.TopologyTest > sourceAndProcessorWithMultipleStatesShouldHaveSingleSubtopology PASSED
org.apache.kafka.streams.TopologyTest > shouldDescribeEmptyTopology STARTED
org.apache.kafka.streams.TopologyTest > shouldDescribeEmptyTopology PASSED
org.apache.kafka.streams.TopologyTest > shouldFailIfSinkIsItsOwnParent STARTED
org.apache.kafka.streams.TopologyTest > shouldFailIfSinkIsItsOwnParent PASSED
org.apache.kafka.streams.TopologyTest > testPatternMatchesAlreadyProvidedTopicSource STARTED
org.apache.kafka.streams.TopologyTest > testPatternMatchesAlreadyProvidedTopicSource PASSED
org.apache.kafka.streams.TopologyTest > singleSourcePatternShouldHaveSingleSubtopology STARTED
org.apache.kafka.streams.TopologyTest > singleSourcePatternShouldHaveSingleSubtopology PASSED
org.apache.kafka.streams.TopologyTest > kTableNonMaterializedFilterShouldPreserveTopologyStructure STARTED
org.apache.kafka.streams.TopologyTest > kTableNonMaterializedFilterShouldPreserveTopologyStructure PASSED
org.apache.kafka.streams.TopologyTest > singleSourceShouldHaveSingleSubtopology STARTED
org.apache.kafka.streams.TopologyTest > singleSourceShouldHaveSingleSubtopology PASSED
org.apache.kafka.streams.TopologyTest > shouldNotAllowNullTopicChooserWhenAddingSink STARTED
org.apache.kafka.streams.TopologyTest > shouldNotAllowNullTopicChooserWhenAddingSink PASSED
org.apache.kafka.streams.TopologyTest > processorsWithSameSinkShouldHaveSameSubtopology STARTED
org.apache.kafka.streams.TopologyTest > processorsWithSameSinkShouldHaveSameSubtopology PASSED
org.apache.kafka.streams.TopologyTest > shouldNotAllowNullTopicsWhenAddingSoureWithTopic STARTED
org.apache.kafka.streams.TopologyTest > shouldNotAllowNullTopicsWhenAddingSoureWithTopic PASSED
org.apache.kafka.streams.TopologyTest > shouldFailWithUnknownParent STARTED
org.apache.kafka.streams.TopologyTest > shouldFailWithUnknownParent PASSED
org.apache.kafka.streams.TopologyTest > kTableAnonymousMaterializedFilterShouldPreserveTopologyStructure STARTED
org.apache.kafka.streams.TopologyTest > kTableAnonymousMaterializedFilterShouldPreserveTopologyStructure PASSED
org.apache.kafka.streams.TopologyTest > shouldNotAllowToAddProcessorWithEmptyParents STARTED
org.apache.kafka.streams.TopologyTest > shouldNotAllowToAddProcessorWithEmptyParents PASSED
org.apache.kafka.streams.TopologyTest > sessionWindowAnonymousMaterializedCountShouldPreserveTopologyStructure STARTED
org.apache.kafka.streams.TopologyTest > sessionWindowAnonymousMaterializedCountShouldPreserveTopologyStructure PASSED
org.apache.kafka.streams.TopologyTest > shouldFailIfNodeIsItsOwnParent STARTED
org.apache.kafka.streams.TopologyTest > shouldFailIfNodeIsItsOwnParent PASSED
org.apache.kafka.streams.TopologyTest > shouldNotAllowToAddStateStoreToSource STARTED
org.apache.kafka.streams.TopologyTest > shouldNotAllowToAddStateStoreToSource PASSED
org.apache.kafka.streams.TopologyTest > shouldNotAllowNullNameWhenAddingProcessor STARTED
org.apache.kafka.streams.TopologyTest > shouldNotAllowNullNameWhenAddingProcessor PASSED
org.apache.kafka.streams.TopologyTest > shouldNotAllowToAddStoreWithSameName STARTED
org.apache.kafka.streams.TopologyTest > shouldNotAllowToAddStoreWithSameName PASSED
org.apache.kafka.streams.TopologyTest > shouldNotAllowToAddProcessorWithNullParents STARTED
org.apache.kafka.streams.TopologyTest > shouldNotAllowToAddProcessorWithNullParents PASSED
org.apache.kafka.streams.TopologyTest > shouldNotAllowNullNameWhenAddingSourceWithPattern STARTED
org.apache.kafka.streams.TopologyTest > shouldNotAllowNullNameWhenAddingSourceWithPattern PASSED
org.apache.kafka.streams.TopologyTest > multipleSourcesWithSinksShouldHaveDistinctSubtopologies STARTED
org.apache.kafka.streams.TopologyTest > multipleSourcesWithSinksShouldHaveDistinctSubtopologies PASSED
org.apache.kafka.streams.TopologyTest > kGroupedStreamZeroArgCountShouldPreserveTopologyStructure STARTED
org.apache.kafka.streams.TopologyTest > kGroupedStreamZeroArgCountShouldPreserveTopologyStructure PASSED
org.apache.kafka.streams.TopologyTest > sessionWindowNamedMaterializedCountShouldPreserveTopologyStructure STARTED
org.apache.kafka.streams.TopologyTest > sessionWindowNamedMaterializedCountShouldPreserveTopologyStructure PASSED
org.apache.kafka.streams.tools.StreamsResetterTest > testShiftOffsetByWhenBetweenBeginningAndEndOffset STARTED
org.apache.kafka.streams.tools.StreamsResetterTest > testShiftOffsetByWhenBetweenBeginningAndEndOffset PASSED
org.apache.kafka.streams.tools.StreamsResetterTest > testResetToSpecificOffsetWhenAfterEndOffset STARTED
org.apache.kafka.streams.tools.StreamsResetterTest > testResetToSpecificOffsetWhenAfterEndOffset PASSED
org.apache.kafka.streams.tools.StreamsResetterTest > shouldAcceptValidDateFormats STARTED
org.apache.kafka.streams.tools.StreamsResetterTest > shouldAcceptValidDateFormats PASSED
org.apache.kafka.streams.tools.StreamsResetterTest > shouldDeleteTopic STARTED
org.apache.kafka.streams.tools.StreamsResetterTest > shouldDeleteTopic PASSED
org.apache.kafka.streams.tools.StreamsResetterTest > testResetToSpecificOffsetWhenBetweenBeginningAndEndOffset STARTED
org.apache.kafka.streams.tools.StreamsResetterTest > testResetToSpecificOffsetWhenBetweenBeginningAndEndOffset PASSED
org.apache.kafka.streams.tools.StreamsResetterTest > testShiftOffsetByWhenAfterEndOffset STARTED
org.apache.kafka.streams.tools.StreamsResetterTest > testShiftOffsetByWhenAfterEndOffset PASSED
org.apache.kafka.streams.tools.StreamsResetterTest > testResetToSpecificOffsetWhenBeforeBeginningOffset STARTED
org.apache.kafka.streams.tools.StreamsResetterTest > testResetToSpecificOffsetWhenBeforeBeginningOffset PASSED
org.apache.kafka.streams.tools.StreamsResetterTest > shouldSeekToEndOffset STARTED
org.apache.kafka.streams.tools.StreamsResetterTest > shouldSeekToEndOffset PASSED
org.apache.kafka.streams.tools.StreamsResetterTest > testResetUsingPlanWhenBetweenBeginningAndEndOffset STARTED
org.apache.kafka.streams.tools.StreamsResetterTest > testResetUsingPlanWhenBetweenBeginningAndEndOffset PASSED
org.apache.kafka.streams.tools.StreamsResetterTest > testResetUsingPlanWhenBeforeBeginningOffset STARTED
org.apache.kafka.streams.tools.StreamsResetterTest > testResetUsingPlanWhenBeforeBeginningOffset PASSED
org.apache.kafka.streams.tools.StreamsResetterTest > shouldThrowOnInvalidDateFormat STARTED
org.apache.kafka.streams.tools.StreamsResetterTest > shouldThrowOnInvalidDateFormat PASSED
org.apache.kafka.streams.tools.StreamsResetterTest > testResetUsingPlanWhenAfterEndOffset STARTED
org.apache.kafka.streams.tools.StreamsResetterTest > testResetUsingPlanWhenAfterEndOffset PASSED
org.apache.kafka.streams.tools.StreamsResetterTest > testShiftOffsetByWhenBeforeBeginningOffset STARTED
org.apache.kafka.streams.tools.StreamsResetterTest > testShiftOffsetByWhenBeforeBeginningOffset PASSED
org.apache.kafka.streams.KeyValueTest > shouldHaveSaneEqualsAndHashCode STARTED
org.apache.kafka.streams.KeyValueTest > shouldHaveSaneEqualsAndHashCode PASSED
1907 tests completed, 1 failed
> Task :streams:test FAILED
FAILURE: Build failed with an exception.
* What went wrong:
Execution failed for task ':streams:test'.
> There were failing tests. See the report at: file://<https://builds.apache.org/job/kafka-trunk-jdk8/ws/streams/build/reports/tests/test/index.html>
* Try:
Run with --stacktrace option to get the stack trace. Run with --info or --debug option to get more log output. Run with --scan to get full insights.
* Get more help at https://help.gradle.org
BUILD FAILED in 4h 6m 17s
68 actionable tasks: 37 executed, 31 up-to-date
Build step 'Execute shell' marked build as failure
[FINDBUGS] Collecting findbugs analysis files...
Setting GRADLE_4_8_1_HOME=/home/jenkins/tools/gradle/4.8.1
[FINDBUGS] Searching for all files in <https://builds.apache.org/job/kafka-trunk-jdk8/ws/> that match the pattern **/build/reports/findbugs/*.xml
[FINDBUGS] Parsing 6 files in <https://builds.apache.org/job/kafka-trunk-jdk8/ws/>
[FINDBUGS] Successfully parsed file <https://builds.apache.org/job/kafka-trunk-jdk8/ws/clients/build/reports/findbugs/main.xml> with 0 unique warnings and 0 duplicates.
[FINDBUGS] Successfully parsed file <https://builds.apache.org/job/kafka-trunk-jdk8/ws/core/build/reports/findbugs/main.xml> with 0 unique warnings and 0 duplicates.
[FINDBUGS] Successfully parsed file <https://builds.apache.org/job/kafka-trunk-jdk8/ws/examples/build/reports/findbugs/main.xml> with 0 unique warnings and 0 duplicates.
[FINDBUGS] Successfully parsed file <https://builds.apache.org/job/kafka-trunk-jdk8/ws/log4j-appender/build/reports/findbugs/main.xml> with 0 unique warnings and 0 duplicates.
[FINDBUGS] Successfully parsed file <https://builds.apache.org/job/kafka-trunk-jdk8/ws/streams/build/reports/findbugs/main.xml> with 0 unique warnings and 0 duplicates.
[FINDBUGS] Successfully parsed file <https://builds.apache.org/job/kafka-trunk-jdk8/ws/streams/streams-scala/build/reports/findbugs/main.xml> with 0 unique warnings and 0 duplicates.
Setting GRADLE_4_8_1_HOME=/home/jenkins/tools/gradle/4.8.1
Setting GRADLE_4_8_1_HOME=/home/jenkins/tools/gradle/4.8.1
<Git Blamer> Using GitBlamer to create author and commit information for all warnings.
<Git Blamer> GIT_COMMIT=fc5f6b0e46ff81302b3e445fed0cdf454c942792, workspace=<https://builds.apache.org/job/kafka-trunk-jdk8/ws/>
[FINDBUGS] Computing warning deltas based on reference build #2859
Recording test results
Setting GRADLE_4_8_1_HOME=/home/jenkins/tools/gradle/4.8.1
Setting GRADLE_4_8_1_HOME=/home/jenkins/tools/gradle/4.8.1
Not sending mail to unregistered user noreply@github.com