You are viewing a plain text version of this content. The canonical link for it is here.
Posted to dev@geronimo.apache.org by ga...@apache.org on 2009/07/22 22:35:52 UTC

[BUILD] trunk: Failed for Revision: 796820

Geronimo Revision: 796820 built with tests included
 
See the full build-1500.log file at http://people.apache.org/builds/geronimo/server/binaries/trunk/20090722/build-1500.log
 
Download the binaries from http://people.apache.org/builds/geronimo/server/binaries/trunk/20090722
[INFO] BUILD SUCCESSFUL
[INFO] ------------------------------------------------------------------------
[INFO] Total time: 41 minutes 9 seconds
[INFO] Finished at: Wed Jul 22 15:45:36 EDT 2009
[INFO] Final Memory: 399M/1007M
[INFO] ------------------------------------------------------------------------
 
TESTSUITE RESULTS (Failures only)
=================================
 
Assembly: tomcat
=================================
See full test results and logs at http://people.apache.org/builds/geronimo/server/binaries/trunk/20090722/logs-1500-tomcat/
 
 
[INFO] Using geronimoHome: /home/geronimo/geronimo/trunk/testsuite/target/geronimo-tomcat6-javaee5-2.2-SNAPSHOT
[INFO] Installing assembly...
[INFO] Expanding: /home/geronimo/.m2/repository/org/apache/geronimo/assemblies/geronimo-tomcat6-javaee5/2.2-SNAPSHOT/geronimo-tomcat6-javaee5-2.2-SNAPSHOT-bin.zip into /home/geronimo/geronimo/trunk/testsuite/target
[INFO] Starting Geronimo server...
[INFO] Selected option set: default
[INFO] Redirecting output to: /home/geronimo/geronimo/trunk/testsuite/target/geronimo-logs/org.apache.geronimo.mavenplugins.geronimo.server.StartServerMojo.log
[INFO] Waiting for Geronimo server...
[INFO] Geronimo server started in 0:00:47.718
[INFO] [shitty:install {execution: default}]
[INFO] Installing /home/geronimo/geronimo/trunk/testsuite/pom.xml to /home/geronimo/.m2/repository/org/apache/geronimo/testsuite/testsuite/testing/testsuite-testing.pom
[INFO] [shitty:test {execution: default}]
[INFO] Starting 36 test builds
[INFO] 
[INFO] -------------------------------------------------------------------------------
[INFO] 
[INFO] commands-testsuite/deploy                  RUNNING
[INFO] commands-testsuite/deploy                  SUCCESS (0:01:18.350) 
[INFO] commands-testsuite/gshell                  RUNNING
[INFO] commands-testsuite/gshell                  SUCCESS (0:00:35.187) 
[INFO] commands-testsuite/jaxws                   RUNNING
[INFO] commands-testsuite/jaxws                   SUCCESS (0:00:41.352) 
[INFO] commands-testsuite/shutdown                RUNNING
[INFO] commands-testsuite/shutdown                SUCCESS (0:00:21.531) 
[INFO] concurrent-testsuite/concurrent-basic      RUNNING
[INFO] concurrent-testsuite/concurrent-basic      SUCCESS (0:06:39.483) 
[INFO] console-testsuite/advanced                 RUNNING
[INFO] console-testsuite/advanced                 SUCCESS (0:01:34.627) 
[INFO] console-testsuite/basic                    RUNNING
[INFO] console-testsuite/basic                    SUCCESS (0:02:02.703) 
[INFO] corba-testsuite/corba-helloworld           RUNNING
[INFO] corba-testsuite/corba-helloworld           SUCCESS (0:00:55.398) 
[INFO] corba-testsuite/corba-marshal              RUNNING
[INFO] corba-testsuite/corba-marshal              SUCCESS (0:01:04.841) 
[INFO] corba-testsuite/corba-mytime               RUNNING
[INFO] corba-testsuite/corba-mytime               SUCCESS (0:00:47.240) 
[INFO] deployment-testsuite/deployment-tests      RUNNING
[INFO] deployment-testsuite/deployment-tests      SUCCESS (0:00:33.819) 
[INFO] deployment-testsuite/jca-cms-tests         RUNNING
[INFO] deployment-testsuite/jca-cms-tests         SUCCESS (0:00:32.864) 
[INFO] deployment-testsuite/manifestcp-tests      RUNNING
[INFO] deployment-testsuite/manifestcp-tests      SUCCESS (0:00:35.549) 
[INFO] enterprise-testsuite/ejb-tests             RUNNING
[INFO] enterprise-testsuite/ejb-tests             SUCCESS (0:01:10.021) 
[INFO] enterprise-testsuite/jms-tests             RUNNING
[INFO] enterprise-testsuite/jms-tests             SUCCESS (0:01:00.260) 
[INFO] enterprise-testsuite/jpa-tests             RUNNING
[INFO] enterprise-testsuite/jpa-tests             SUCCESS (0:00:50.728) 
[INFO] enterprise-testsuite/sec-client            RUNNING
[INFO] enterprise-testsuite/sec-client            SUCCESS (0:00:30.964) 
[INFO] enterprise-testsuite/sec-tests             RUNNING
[INFO] enterprise-testsuite/sec-tests             SUCCESS (0:00:52.941) 
[INFO] security-testsuite/test-security           RUNNING
[INFO] security-testsuite/test-security           FAILURE (0:00:46.468) Java returned: 1
[INFO] web-testsuite/test-2.1-jsps                RUNNING
[INFO] web-testsuite/test-2.1-jsps                SUCCESS (0:00:33.116) 
[INFO] web-testsuite/test-2.5-servlets            RUNNING
[INFO] web-testsuite/test-2.5-servlets            SUCCESS (0:00:31.118) 
[INFO] web-testsuite/test-myfaces                 RUNNING
[INFO] web-testsuite/test-myfaces                 SUCCESS (0:00:33.759) 
[INFO] web-testsuite/test-tomcat                  RUNNING
[INFO] web-testsuite/test-tomcat                  SUCCESS (0:00:24.147) 
[INFO] web-testsuite/test-web-forward             RUNNING
[INFO] web-testsuite/test-web-forward             SUCCESS (0:00:37.956) 
[INFO] web-testsuite/test-web-references          RUNNING
[INFO] web-testsuite/test-web-references          SUCCESS (0:00:43.608) 
[INFO] webservices-testsuite/jaxb-tests           RUNNING
[INFO] webservices-testsuite/jaxb-tests           SUCCESS (0:01:06.219) 
[INFO] webservices-testsuite/jaxr-tests           RUNNING
[INFO] webservices-testsuite/jaxr-tests           SUCCESS (0:01:00.334) 
[INFO] webservices-testsuite/jaxrpc-jaxws-tests   RUNNING
[INFO] webservices-testsuite/jaxrpc-jaxws-tests   SUCCESS (0:00:38.015) 
[INFO] webservices-testsuite/jaxrpc-tests         RUNNING
[INFO] webservices-testsuite/jaxrpc-tests         SUCCESS (0:00:50.265) 
[INFO] webservices-testsuite/jaxws-catalog-tests  RUNNING
[INFO] webservices-testsuite/jaxws-catalog-tests  FAILURE (0:00:51.860) Java returned: 1
[INFO] webservices-testsuite/jaxws-mtom-tests     RUNNING
[INFO] webservices-testsuite/jaxws-mtom-tests     SUCCESS (0:01:01.376) 
[INFO] webservices-testsuite/jaxws-provider-tests RUNNING
[INFO] webservices-testsuite/jaxws-provider-tests SUCCESS (0:01:00.664) 
[INFO] webservices-testsuite/jaxws-tests          RUNNING
[INFO] webservices-testsuite/jaxws-tests          FAILURE (0:01:23.461) Java returned: 1
[INFO] webservices-testsuite/jaxws-wsa-tests      RUNNING
[INFO] webservices-testsuite/jaxws-wsa-tests      SUCCESS (0:01:00.429) 
[INFO] webservices-testsuite/saaj-tests           RUNNING
[INFO] webservices-testsuite/saaj-tests           SUCCESS (0:00:41.148) 
[INFO] webservices-testsuite/stax-tests           RUNNING
[INFO] webservices-testsuite/stax-tests           SUCCESS (0:01:00.995) 
[INFO] 
[INFO] -------------------------------------------------------------------------------
[INFO] Test Summary (0:36:53.043)
[INFO]     Passed: 33
[INFO]     Failed: 3
[INFO] -------------------------------------------------------------------------------
[INFO] 
[INFO] The following tests failed:
[INFO]     * security-testsuite/test-security - /home/geronimo/geronimo/trunk/testsuite/security-testsuite/test-security/build.log
[INFO]     * webservices-testsuite/jaxws-catalog-tests - /home/geronimo/geronimo/trunk/testsuite/webservices-testsuite/jaxws-catalog-tests/build.log
[INFO]     * webservices-testsuite/jaxws-tests - /home/geronimo/geronimo/trunk/testsuite/webservices-testsuite/jaxws-tests/build.log
[INFO] 
[INFO] ------------------------------------------------------------------------
[ERROR] BUILD ERROR
 
Assembly: jetty
=================================
See full test results and logs at http://people.apache.org/builds/geronimo/server/binaries/trunk/20090722/logs-1500-jetty/
 
 
[INFO] Using assembly artifact: org.apache.geronimo.assemblies:geronimo-jetty7-javaee5:zip:bin:2.2-SNAPSHOT:provided
[INFO] Using geronimoHome: /home/geronimo/geronimo/trunk/testsuite/target/geronimo-jetty7-javaee5-2.2-SNAPSHOT
[INFO] Installing assembly...
[INFO] Expanding: /home/geronimo/.m2/repository/org/apache/geronimo/assemblies/geronimo-jetty7-javaee5/2.2-SNAPSHOT/geronimo-jetty7-javaee5-2.2-SNAPSHOT-bin.zip into /home/geronimo/geronimo/trunk/testsuite/target
[INFO] Starting Geronimo server...
[INFO] Selected option set: default
[INFO] Redirecting output to: /home/geronimo/geronimo/trunk/testsuite/target/geronimo-logs/org.apache.geronimo.mavenplugins.geronimo.server.StartServerMojo.log
[INFO] Waiting for Geronimo server...
[INFO] Geronimo server started in 0:00:49.131
[INFO] [shitty:install {execution: default}]
[INFO] Installing /home/geronimo/geronimo/trunk/testsuite/pom.xml to /home/geronimo/.m2/repository/org/apache/geronimo/testsuite/testsuite/testing/testsuite-testing.pom
[INFO] [shitty:test {execution: default}]
[INFO] Starting 36 test builds
[INFO] 
[INFO] -------------------------------------------------------------------------------
[INFO] 
[INFO] commands-testsuite/deploy                  RUNNING
[INFO] commands-testsuite/deploy                  SUCCESS (0:01:19.094) 
[INFO] commands-testsuite/gshell                  RUNNING
[INFO] commands-testsuite/gshell                  SUCCESS (0:00:35.128) 
[INFO] commands-testsuite/jaxws                   RUNNING
[INFO] commands-testsuite/jaxws                   SUCCESS (0:00:39.475) 
[INFO] commands-testsuite/shutdown                RUNNING
[INFO] commands-testsuite/shutdown                SUCCESS (0:00:21.082) 
[INFO] concurrent-testsuite/concurrent-basic      RUNNING
[INFO] concurrent-testsuite/concurrent-basic      SUCCESS (0:06:23.595) 
[INFO] console-testsuite/advanced                 RUNNING
[INFO] console-testsuite/advanced                 SUCCESS (0:01:34.380) 
[INFO] console-testsuite/basic                    RUNNING
[INFO] console-testsuite/basic                    SUCCESS (0:02:07.483) 
[INFO] corba-testsuite/corba-helloworld           RUNNING
[INFO] corba-testsuite/corba-helloworld           SUCCESS (0:00:52.590) 
[INFO] corba-testsuite/corba-marshal              RUNNING
[INFO] corba-testsuite/corba-marshal              SUCCESS (0:01:14.751) 
[INFO] corba-testsuite/corba-mytime               RUNNING
[INFO] corba-testsuite/corba-mytime               SUCCESS (0:00:47.019) 
[INFO] deployment-testsuite/deployment-tests      RUNNING
[INFO] deployment-testsuite/deployment-tests      SUCCESS (0:00:33.803) 
[INFO] deployment-testsuite/jca-cms-tests         RUNNING
[INFO] deployment-testsuite/jca-cms-tests         SUCCESS (0:00:30.400) 
[INFO] deployment-testsuite/manifestcp-tests      RUNNING
[INFO] deployment-testsuite/manifestcp-tests      SUCCESS (0:00:35.700) 
[INFO] enterprise-testsuite/ejb-tests             RUNNING
[INFO] enterprise-testsuite/ejb-tests             SUCCESS (0:00:45.877) 
[INFO] enterprise-testsuite/jms-tests             RUNNING
[INFO] enterprise-testsuite/jms-tests             SUCCESS (0:01:00.767) 
[INFO] enterprise-testsuite/jpa-tests             RUNNING
[INFO] enterprise-testsuite/jpa-tests             SUCCESS (0:00:46.255) 
[INFO] enterprise-testsuite/sec-client            RUNNING
[INFO] enterprise-testsuite/sec-client            SUCCESS (0:00:31.762) 
[INFO] enterprise-testsuite/sec-tests             RUNNING
[INFO] enterprise-testsuite/sec-tests             SUCCESS (0:00:55.070) 
[INFO] security-testsuite/test-security           RUNNING
[INFO] security-testsuite/test-security           SUCCESS (0:00:50.478) 
[INFO] web-testsuite/test-2.1-jsps                RUNNING
[INFO] web-testsuite/test-2.1-jsps                SUCCESS (0:00:34.381) 
[INFO] web-testsuite/test-2.5-servlets            RUNNING
[INFO] web-testsuite/test-2.5-servlets            SUCCESS (0:00:32.137) 
[INFO] web-testsuite/test-jetty                   RUNNING
[INFO] web-testsuite/test-jetty                   SUCCESS (0:00:25.606) 
[INFO] web-testsuite/test-myfaces                 RUNNING
[INFO] web-testsuite/test-myfaces                 SUCCESS (0:00:33.635) 
[INFO] web-testsuite/test-web-forward             RUNNING
[INFO] web-testsuite/test-web-forward             SUCCESS (0:00:39.826) 
[INFO] web-testsuite/test-web-references          RUNNING
[INFO] web-testsuite/test-web-references          SUCCESS (0:00:43.650) 
[INFO] webservices-testsuite/jaxb-tests           RUNNING
[INFO] webservices-testsuite/jaxb-tests           SUCCESS (0:01:08.413) 
[INFO] webservices-testsuite/jaxr-tests           RUNNING
[INFO] webservices-testsuite/jaxr-tests           SUCCESS (0:01:01.109) 
[INFO] webservices-testsuite/jaxrpc-jaxws-tests   RUNNING
[INFO] webservices-testsuite/jaxrpc-jaxws-tests   SUCCESS (0:00:34.411) 
[INFO] webservices-testsuite/jaxrpc-tests         RUNNING
[INFO] webservices-testsuite/jaxrpc-tests         SUCCESS (0:00:50.729) 
[INFO] webservices-testsuite/jaxws-catalog-tests  RUNNING
[INFO] webservices-testsuite/jaxws-catalog-tests  FAILURE (0:00:50.415) Java returned: 1
[INFO] webservices-testsuite/jaxws-mtom-tests     RUNNING
[INFO] webservices-testsuite/jaxws-mtom-tests     SUCCESS (0:00:56.006) 
[INFO] webservices-testsuite/jaxws-provider-tests RUNNING
[INFO] webservices-testsuite/jaxws-provider-tests SUCCESS (0:01:04.510) 
[INFO] webservices-testsuite/jaxws-tests          RUNNING
[INFO] webservices-testsuite/jaxws-tests          FAILURE (0:01:14.934) Java returned: 1
[INFO] webservices-testsuite/jaxws-wsa-tests      RUNNING
[INFO] webservices-testsuite/jaxws-wsa-tests      SUCCESS (0:00:57.350) 
[INFO] webservices-testsuite/saaj-tests           RUNNING
[INFO] webservices-testsuite/saaj-tests           SUCCESS (0:00:41.359) 
[INFO] webservices-testsuite/stax-tests           RUNNING
[INFO] webservices-testsuite/stax-tests           SUCCESS (0:01:03.158) 
[INFO] 
[INFO] -------------------------------------------------------------------------------
[INFO] Test Summary (0:36:16.581)
[INFO]     Passed: 34
[INFO]     Failed: 2
[INFO] -------------------------------------------------------------------------------
[INFO] 
[INFO] The following tests failed:
[INFO]     * webservices-testsuite/jaxws-catalog-tests - /home/geronimo/geronimo/trunk/testsuite/webservices-testsuite/jaxws-catalog-tests/build.log
[INFO]     * webservices-testsuite/jaxws-tests - /home/geronimo/geronimo/trunk/testsuite/webservices-testsuite/jaxws-tests/build.log
[INFO] 
[INFO] ------------------------------------------------------------------------
[ERROR] BUILD ERROR
 
Samples: trunk
=================================
Log: http://people.apache.org/builds/geronimo/server/binaries/trunk/20090722/samples-1500.log
 
Build status: OK