You are viewing a plain text version of this content. The canonical link for it is here.
Posted to dev@lucene.apache.org by Policeman Jenkins Server <je...@thetaphi.de> on 2017/08/21 18:16:04 UTC

[JENKINS] Lucene-Solr-7.0-Windows (64bit/jdk1.8.0_144) - Build # 101 - Unstable!

Build: https://jenkins.thetaphi.de/job/Lucene-Solr-7.0-Windows/101/
Java: 64bit/jdk1.8.0_144 -XX:-UseCompressedOops -XX:+UseG1GC

1 tests failed.
FAILED:  org.apache.solr.update.AutoCommitTest.testCommitWithin

Error Message:
Exception during query

Stack Trace:
java.lang.RuntimeException: Exception during query
	at __randomizedtesting.SeedInfo.seed([9A2C05662E3D85FF:20FE6A1EAD136BEA]:0)
	at org.apache.solr.SolrTestCaseJ4.assertQ(SolrTestCaseJ4.java:879)
	at org.apache.solr.update.AutoCommitTest.testCommitWithin(AutoCommitTest.java:353)
	at sun.reflect.NativeMethodAccessorImpl.invoke0(Native Method)
	at sun.reflect.NativeMethodAccessorImpl.invoke(NativeMethodAccessorImpl.java:62)
	at sun.reflect.DelegatingMethodAccessorImpl.invoke(DelegatingMethodAccessorImpl.java:43)
	at java.lang.reflect.Method.invoke(Method.java:498)
	at com.carrotsearch.randomizedtesting.RandomizedRunner.invoke(RandomizedRunner.java:1713)
	at com.carrotsearch.randomizedtesting.RandomizedRunner$8.evaluate(RandomizedRunner.java:907)
	at com.carrotsearch.randomizedtesting.RandomizedRunner$9.evaluate(RandomizedRunner.java:943)
	at com.carrotsearch.randomizedtesting.RandomizedRunner$10.evaluate(RandomizedRunner.java:957)
	at com.carrotsearch.randomizedtesting.rules.SystemPropertiesRestoreRule$1.evaluate(SystemPropertiesRestoreRule.java:57)
	at org.apache.lucene.util.TestRuleSetupTeardownChained$1.evaluate(TestRuleSetupTeardownChained.java:49)
	at org.apache.lucene.util.AbstractBeforeAfterRule$1.evaluate(AbstractBeforeAfterRule.java:45)
	at org.apache.lucene.util.TestRuleThreadAndTestName$1.evaluate(TestRuleThreadAndTestName.java:48)
	at org.apache.lucene.util.TestRuleIgnoreAfterMaxFailures$1.evaluate(TestRuleIgnoreAfterMaxFailures.java:64)
	at org.apache.lucene.util.TestRuleMarkFailure$1.evaluate(TestRuleMarkFailure.java:47)
	at com.carrotsearch.randomizedtesting.rules.StatementAdapter.evaluate(StatementAdapter.java:36)
	at com.carrotsearch.randomizedtesting.ThreadLeakControl$StatementRunner.run(ThreadLeakControl.java:368)
	at com.carrotsearch.randomizedtesting.ThreadLeakControl.forkTimeoutingTask(ThreadLeakControl.java:817)
	at com.carrotsearch.randomizedtesting.ThreadLeakControl$3.evaluate(ThreadLeakControl.java:468)
	at com.carrotsearch.randomizedtesting.RandomizedRunner.runSingleTest(RandomizedRunner.java:916)
	at com.carrotsearch.randomizedtesting.RandomizedRunner$5.evaluate(RandomizedRunner.java:802)
	at com.carrotsearch.randomizedtesting.RandomizedRunner$6.evaluate(RandomizedRunner.java:852)
	at com.carrotsearch.randomizedtesting.RandomizedRunner$7.evaluate(RandomizedRunner.java:863)
	at com.carrotsearch.randomizedtesting.rules.StatementAdapter.evaluate(StatementAdapter.java:36)
	at com.carrotsearch.randomizedtesting.rules.SystemPropertiesRestoreRule$1.evaluate(SystemPropertiesRestoreRule.java:57)
	at org.apache.lucene.util.AbstractBeforeAfterRule$1.evaluate(AbstractBeforeAfterRule.java:45)
	at com.carrotsearch.randomizedtesting.rules.StatementAdapter.evaluate(StatementAdapter.java:36)
	at org.apache.lucene.util.TestRuleStoreClassName$1.evaluate(TestRuleStoreClassName.java:41)
	at com.carrotsearch.randomizedtesting.rules.NoShadowingOrOverridesOnMethodsRule$1.evaluate(NoShadowingOrOverridesOnMethodsRule.java:40)
	at com.carrotsearch.randomizedtesting.rules.NoShadowingOrOverridesOnMethodsRule$1.evaluate(NoShadowingOrOverridesOnMethodsRule.java:40)
	at com.carrotsearch.randomizedtesting.rules.StatementAdapter.evaluate(StatementAdapter.java:36)
	at com.carrotsearch.randomizedtesting.rules.StatementAdapter.evaluate(StatementAdapter.java:36)
	at com.carrotsearch.randomizedtesting.rules.StatementAdapter.evaluate(StatementAdapter.java:36)
	at org.apache.lucene.util.TestRuleAssertionsRequired$1.evaluate(TestRuleAssertionsRequired.java:53)
	at org.apache.lucene.util.TestRuleMarkFailure$1.evaluate(TestRuleMarkFailure.java:47)
	at org.apache.lucene.util.TestRuleIgnoreAfterMaxFailures$1.evaluate(TestRuleIgnoreAfterMaxFailures.java:64)
	at org.apache.lucene.util.TestRuleIgnoreTestSuites$1.evaluate(TestRuleIgnoreTestSuites.java:54)
	at com.carrotsearch.randomizedtesting.rules.StatementAdapter.evaluate(StatementAdapter.java:36)
	at com.carrotsearch.randomizedtesting.ThreadLeakControl$StatementRunner.run(ThreadLeakControl.java:368)
	at java.lang.Thread.run(Thread.java:748)
Caused by: java.lang.RuntimeException: REQUEST FAILED: xpath=//result[@numFound=1]
	xml response was: <?xml version="1.0" encoding="UTF-8"?>
<response>
<lst name="responseHeader"><int name="status">0</int><int name="QTime">0</int></lst><result name="response" numFound="0" start="0"></result>
</response>

	request was:q=id:529&qt=&start=0&rows=20&version=2.2
	at org.apache.solr.SolrTestCaseJ4.assertQ(SolrTestCaseJ4.java:872)
	... 40 more




Build Log:
[...truncated 12160 lines...]
   [junit4] Suite: org.apache.solr.update.AutoCommitTest
   [junit4]   2> Creating dataDir: C:\Users\jenkins\workspace\Lucene-Solr-7.0-Windows\solr\build\solr-core\test\J0\temp\solr.update.AutoCommitTest_9A2C05662E3D85FF-001\init-core-data-001
   [junit4]   2> 2000757 WARN  (SUITE-AutoCommitTest-seed#[9A2C05662E3D85FF]-worker) [    ] o.a.s.SolrTestCaseJ4 startTrackingSearchers: numOpens=1 numCloses=1
   [junit4]   2> 2000757 INFO  (SUITE-AutoCommitTest-seed#[9A2C05662E3D85FF]-worker) [    ] o.a.s.SolrTestCaseJ4 Using TrieFields (NUMERIC_POINTS_SYSPROP=false) w/NUMERIC_DOCVALUES_SYSPROP=true
   [junit4]   2> 2000765 INFO  (SUITE-AutoCommitTest-seed#[9A2C05662E3D85FF]-worker) [    ] o.a.s.SolrTestCaseJ4 Randomized ssl (false) and clientAuth (false) via: @org.apache.solr.util.RandomizeSSL(reason=, value=NaN, ssl=NaN, clientAuth=NaN)
   [junit4]   2> 2000766 INFO  (SUITE-AutoCommitTest-seed#[9A2C05662E3D85FF]-worker) [    ] o.a.s.SolrTestCaseJ4 ####initCore
   [junit4]   2> 2000767 INFO  (SUITE-AutoCommitTest-seed#[9A2C05662E3D85FF]-worker) [    ] o.a.s.c.SolrResourceLoader [null] Added 2 libs to classloader, from paths: [/C:/Users/jenkins/workspace/Lucene-Solr-7.0-Windows/solr/core/src/test-files/solr/collection1/lib, /C:/Users/jenkins/workspace/Lucene-Solr-7.0-Windows/solr/core/src/test-files/solr/collection1/lib/classes]
   [junit4]   2> 2000811 INFO  (SUITE-AutoCommitTest-seed#[9A2C05662E3D85FF]-worker) [    ] o.a.s.c.SolrConfig Using Lucene MatchVersion: 7.0.0
   [junit4]   2> 2000837 INFO  (SUITE-AutoCommitTest-seed#[9A2C05662E3D85FF]-worker) [    ] o.a.s.s.IndexSchema [null] Schema name=test
   [junit4]   2> 2000916 INFO  (SUITE-AutoCommitTest-seed#[9A2C05662E3D85FF]-worker) [    ] o.a.s.s.IndexSchema Loaded schema test/1.0 with uniqueid field id
   [junit4]   2> 2001020 INFO  (SUITE-AutoCommitTest-seed#[9A2C05662E3D85FF]-worker) [    ] o.a.s.m.r.SolrJmxReporter JMX monitoring for 'solr.node' (registry 'solr.node') enabled at server: com.sun.jmx.mbeanserver.JmxMBeanServer@30c42089
   [junit4]   2> 2001025 INFO  (SUITE-AutoCommitTest-seed#[9A2C05662E3D85FF]-worker) [    ] o.a.s.m.r.SolrJmxReporter JMX monitoring for 'solr.jvm' (registry 'solr.jvm') enabled at server: com.sun.jmx.mbeanserver.JmxMBeanServer@30c42089
   [junit4]   2> 2001025 INFO  (SUITE-AutoCommitTest-seed#[9A2C05662E3D85FF]-worker) [    ] o.a.s.m.r.SolrJmxReporter JMX monitoring for 'solr.jetty' (registry 'solr.jetty') enabled at server: com.sun.jmx.mbeanserver.JmxMBeanServer@30c42089
   [junit4]   2> 2001027 INFO  (coreLoadExecutor-5770-thread-1) [    x:collection1] o.a.s.c.SolrResourceLoader [null] Added 2 libs to classloader, from paths: [/C:/Users/jenkins/workspace/Lucene-Solr-7.0-Windows/solr/core/src/test-files/solr/collection1/lib, /C:/Users/jenkins/workspace/Lucene-Solr-7.0-Windows/solr/core/src/test-files/solr/collection1/lib/classes]
   [junit4]   2> 2001086 INFO  (coreLoadExecutor-5770-thread-1) [    x:collection1] o.a.s.c.SolrConfig Using Lucene MatchVersion: 7.0.0
   [junit4]   2> 2001102 INFO  (coreLoadExecutor-5770-thread-1) [    x:collection1] o.a.s.s.IndexSchema [collection1] Schema name=test
   [junit4]   2> 2001188 INFO  (coreLoadExecutor-5770-thread-1) [    x:collection1] o.a.s.s.IndexSchema Loaded schema test/1.0 with uniqueid field id
   [junit4]   2> 2001200 INFO  (coreLoadExecutor-5770-thread-1) [    x:collection1] o.a.s.c.CoreContainer Creating SolrCore 'collection1' using configuration from instancedir C:\Users\jenkins\workspace\Lucene-Solr-7.0-Windows\solr\core\src\test-files\solr\collection1, trusted=true
   [junit4]   2> 2001200 INFO  (coreLoadExecutor-5770-thread-1) [    x:collection1] o.a.s.m.r.SolrJmxReporter JMX monitoring for 'solr.core.collection1' (registry 'solr.core.collection1') enabled at server: com.sun.jmx.mbeanserver.JmxMBeanServer@30c42089
   [junit4]   2> 2001200 INFO  (coreLoadExecutor-5770-thread-1) [    x:collection1] o.a.s.c.SolrCore solr.RecoveryStrategy.Builder
   [junit4]   2> 2001200 INFO  (coreLoadExecutor-5770-thread-1) [    x:collection1] o.a.s.c.SolrCore [[collection1] ] Opening new SolrCore at [C:\Users\jenkins\workspace\Lucene-Solr-7.0-Windows\solr\core\src\test-files\solr\collection1], dataDir=[C:\Users\jenkins\workspace\Lucene-Solr-7.0-Windows\solr\build\solr-core\test\J0\temp\solr.update.AutoCommitTest_9A2C05662E3D85FF-001\init-core-data-001\]
   [junit4]   2> 2001202 INFO  (coreLoadExecutor-5770-thread-1) [    x:collection1] o.a.s.u.RandomMergePolicy RandomMergePolicy wrapping class org.apache.lucene.index.TieredMergePolicy: [TieredMergePolicy: maxMergeAtOnce=36, maxMergeAtOnceExplicit=46, maxMergedSegmentMB=40.486328125, floorSegmentMB=1.4228515625, forceMergeDeletesPctAllowed=14.734760247918475, segmentsPerTier=29.0, maxCFSSegmentSizeMB=8.796093022207999E12, noCFSRatio=1.0
   [junit4]   2> 2001291 INFO  (coreLoadExecutor-5770-thread-1) [    x:collection1] o.a.s.u.UpdateHandler Using UpdateLog implementation: org.apache.solr.update.UpdateLog
   [junit4]   2> 2001291 INFO  (coreLoadExecutor-5770-thread-1) [    x:collection1] o.a.s.u.UpdateLog Initializing UpdateLog: dataDir= defaultSyncLevel=FLUSH numRecordsToKeep=100 maxNumLogsToKeep=10 numVersionBuckets=65536
   [junit4]   2> 2001292 INFO  (coreLoadExecutor-5770-thread-1) [    x:collection1] o.a.s.u.CommitTracker Hard AutoCommit: disabled
   [junit4]   2> 2001292 INFO  (coreLoadExecutor-5770-thread-1) [    x:collection1] o.a.s.u.CommitTracker Soft AutoCommit: disabled
   [junit4]   2> 2001293 INFO  (coreLoadExecutor-5770-thread-1) [    x:collection1] o.a.s.u.RandomMergePolicy RandomMergePolicy wrapping class org.apache.lucene.index.AlcoholicMergePolicy: [AlcoholicMergePolicy: minMergeSize=0, mergeFactor=10, maxMergeSize=413391074, maxMergeSizeForForcedMerge=9223372036854775807, calibrateSizeByDeletes=true, maxMergeDocs=2147483647, maxCFSSegmentSizeMB=8.796093022207999E12, noCFSRatio=0.1]
   [junit4]   2> 2001293 INFO  (coreLoadExecutor-5770-thread-1) [    x:collection1] o.a.s.s.SolrIndexSearcher Opening [Searcher@58d39faf[collection1] main]
   [junit4]   2> 2001294 INFO  (coreLoadExecutor-5770-thread-1) [    x:collection1] o.a.s.h.c.SpellCheckComponent Initializing spell checkers
   [junit4]   2> 2001305 INFO  (coreLoadExecutor-5770-thread-1) [    x:collection1] o.a.s.s.DirectSolrSpellChecker init: {name=direct,classname=DirectSolrSpellChecker,field=lowerfilt,minQueryLength=3}
   [junit4]   2> 2001337 INFO  (coreLoadExecutor-5770-thread-1) [    x:collection1] o.a.s.h.ReplicationHandler Commits will be reserved for  10000
   [junit4]   2> 2001337 INFO  (searcherExecutor-5771-thread-1-processing-x:collection1) [    x:collection1] o.a.s.h.c.SpellCheckComponent Loading spell index for spellchecker: default
   [junit4]   2> 2001337 INFO  (coreLoadExecutor-5770-thread-1) [    x:collection1] o.a.s.u.UpdateLog Could not find max version in index or recent updates, using new clock 1576363132603858944
   [junit4]   2> 2001338 INFO  (searcherExecutor-5771-thread-1-processing-x:collection1) [    x:collection1] o.a.s.h.c.SpellCheckComponent Loading spell index for spellchecker: direct
   [junit4]   2> 2001338 INFO  (searcherExecutor-5771-thread-1-processing-x:collection1) [    x:collection1] o.a.s.h.c.SpellCheckComponent Loading spell index for spellchecker: wordbreak
   [junit4]   2> 2001338 INFO  (searcherExecutor-5771-thread-1-processing-x:collection1) [    x:collection1] o.a.s.h.c.SpellCheckComponent Loading spell index for spellchecker: multipleFields
   [junit4]   2> 2001338 INFO  (searcherExecutor-5771-thread-1-processing-x:collection1) [    x:collection1] o.a.s.h.c.SpellCheckComponent Loading spell index for spellchecker: jarowinkler
   [junit4]   2> 2001338 INFO  (searcherExecutor-5771-thread-1-processing-x:collection1) [    x:collection1] o.a.s.h.c.SpellCheckComponent Loading spell index for spellchecker: external
   [junit4]   2> 2001338 INFO  (searcherExecutor-5771-thread-1-processing-x:collection1) [    x:collection1] o.a.s.h.c.SpellCheckComponent Loading spell index for spellchecker: freq
   [junit4]   2> 2001338 INFO  (searcherExecutor-5771-thread-1-processing-x:collection1) [    x:collection1] o.a.s.h.c.SpellCheckComponent Loading spell index for spellchecker: fqcn
   [junit4]   2> 2001338 INFO  (searcherExecutor-5771-thread-1-processing-x:collection1) [    x:collection1] o.a.s.h.c.SpellCheckComponent Loading spell index for spellchecker: perDict
   [junit4]   2> 2001338 INFO  (SUITE-AutoCommitTest-seed#[9A2C05662E3D85FF]-worker) [    ] o.a.s.SolrTestCaseJ4 ####initCore end
   [junit4]   2> 2001343 INFO  (searcherExecutor-5771-thread-1-processing-x:collection1) [    x:collection1] o.a.s.c.SolrCore [collection1] Registered new searcher Searcher@58d39faf[collection1] main{ExitableDirectoryReader(UninvertingDirectoryReader())}
   [junit4]   2> 2001344 INFO  (TEST-AutoCommitTest.testCommitWithin-seed#[9A2C05662E3D85FF]) [    ] o.a.s.SolrTestCaseJ4 ###Starting testCommitWithin
   [junit4]   2> 2001344 INFO  (TEST-AutoCommitTest.testCommitWithin-seed#[9A2C05662E3D85FF]) [    ] o.a.s.u.DirectUpdateHandler2 [collection1] REMOVING ALL DOCUMENTS FROM INDEX
   [junit4]   2> 2001346 INFO  (TEST-AutoCommitTest.testCommitWithin-seed#[9A2C05662E3D85FF]) [    ] o.a.s.s.SolrIndexSearcher Opening [Searcher@324c5a88[collection1] realtime]
   [junit4]   2> 2001346 INFO  (TEST-AutoCommitTest.testCommitWithin-seed#[9A2C05662E3D85FF]) [    ] o.a.s.u.p.LogUpdateProcessorFactory [collection1]  webapp=null path=null params={_version_=-9223372036854775807&update.distrib=FROMLEADER&versions=true&wt=json&indent=true}{deleteByQuery=*:* (-9223372036854775807)} 0 1
   [junit4]   2> 2001347 ERROR (TEST-AutoCommitTest.testCommitWithin-seed#[9A2C05662E3D85FF]) [    ] o.a.s.c.CorePropertiesLocator Couldn't load core descriptor from C:\Users\jenkins\workspace\Lucene-Solr-7.0-Windows\solr\core\src\test-files\solr\collection1\core.properties:java.nio.file.NoSuchFileException: C:\Users\jenkins\workspace\Lucene-Solr-7.0-Windows\solr\core\src\test-files\solr\collection1\core.properties
   [junit4]   2> 2001348 INFO  (TEST-AutoCommitTest.testCommitWithin-seed#[9A2C05662E3D85FF]) [    ] o.a.s.c.SolrResourceLoader [null] Added 2 libs to classloader, from paths: [/C:/Users/jenkins/workspace/Lucene-Solr-7.0-Windows/solr/core/src/test-files/solr/collection1/lib, /C:/Users/jenkins/workspace/Lucene-Solr-7.0-Windows/solr/core/src/test-files/solr/collection1/lib/classes]
   [junit4]   2> 2001412 INFO  (TEST-AutoCommitTest.testCommitWithin-seed#[9A2C05662E3D85FF]) [    ] o.a.s.c.SolrConfig Using Lucene MatchVersion: 7.0.0
   [junit4]   2> 2001432 INFO  (TEST-AutoCommitTest.testCommitWithin-seed#[9A2C05662E3D85FF]) [    ] o.a.s.s.IndexSchema [collection1] Schema name=test
   [junit4]   2> 2001541 INFO  (TEST-AutoCommitTest.testCommitWithin-seed#[9A2C05662E3D85FF]) [    ] o.a.s.s.IndexSchema Loaded schema test/1.0 with uniqueid field id
   [junit4]   2> 2001553 INFO  (TEST-AutoCommitTest.testCommitWithin-seed#[9A2C05662E3D85FF]) [    ] o.a.s.c.CoreContainer Reloading SolrCore 'collection1' using configuration from instancedir C:\Users\jenkins\workspace\Lucene-Solr-7.0-Windows\solr\core\src\test-files\solr\collection1
   [junit4]   2> 2001582 INFO  (TEST-AutoCommitTest.testCommitWithin-seed#[9A2C05662E3D85FF]) [    x:collection1] o.a.s.m.r.SolrJmxReporter JMX monitoring for 'solr.core.collection1' (registry 'solr.core.collection1') enabled at server: com.sun.jmx.mbeanserver.JmxMBeanServer@30c42089
   [junit4]   2> 2001582 INFO  (TEST-AutoCommitTest.testCommitWithin-seed#[9A2C05662E3D85FF]) [    x:collection1] o.a.s.c.SolrCore [[collection1] ] Opening new SolrCore at [C:\Users\jenkins\workspace\Lucene-Solr-7.0-Windows\solr\core\src\test-files\solr\collection1], dataDir=[C:\Users\jenkins\workspace\Lucene-Solr-7.0-Windows\solr\build\solr-core\test\J0\temp\solr.update.AutoCommitTest_9A2C05662E3D85FF-001\init-core-data-001\]
   [junit4]   2> 2001683 INFO  (TEST-AutoCommitTest.testCommitWithin-seed#[9A2C05662E3D85FF]) [    x:collection1] o.a.s.u.CommitTracker Hard AutoCommit: disabled
   [junit4]   2> 2001683 INFO  (TEST-AutoCommitTest.testCommitWithin-seed#[9A2C05662E3D85FF]) [    x:collection1] o.a.s.u.CommitTracker Soft AutoCommit: disabled
   [junit4]   2> 2001685 INFO  (TEST-AutoCommitTest.testCommitWithin-seed#[9A2C05662E3D85FF]) [    x:collection1] o.a.s.s.SolrIndexSearcher Opening [Searcher@6439a1a4[collection1] main]
   [junit4]   2> 2001685 INFO  (TEST-AutoCommitTest.testCommitWithin-seed#[9A2C05662E3D85FF]) [    x:collection1] o.a.s.h.c.SpellCheckComponent Initializing spell checkers
   [junit4]   2> 2001687 INFO  (TEST-AutoCommitTest.testCommitWithin-seed#[9A2C05662E3D85FF]) [    x:collection1] o.a.s.s.DirectSolrSpellChecker init: {name=direct,classname=DirectSolrSpellChecker,field=lowerfilt,minQueryLength=3}
   [junit4]   2> 2001694 INFO  (TEST-AutoCommitTest.testCommitWithin-seed#[9A2C05662E3D85FF]) [    x:collection1] o.a.s.h.ReplicationHandler Commits will be reserved for  10000
   [junit4]   2> 2001694 INFO  (TEST-AutoCommitTest.testCommitWithin-seed#[9A2C05662E3D85FF]) [    x:collection1] o.a.s.u.UpdateLog Could not find max version in index or recent updates, using new clock 1576363132978200576
   [junit4]   2> 2001696 INFO  (searcherExecutor-5776-thread-1-processing-x:collection1) [    x:collection1] o.a.s.h.c.SpellCheckComponent Loading spell index for spellchecker: default
   [junit4]   2> 2001696 INFO  (searcherExecutor-5776-thread-1-processing-x:collection1) [    x:collection1] o.a.s.h.c.SpellCheckComponent Loading spell index for spellchecker: direct
   [junit4]   2> 2001696 INFO  (searcherExecutor-5776-thread-1-processing-x:collection1) [    x:collection1] o.a.s.h.c.SpellCheckComponent Loading spell index for spellchecker: wordbreak
   [junit4]   2> 2001696 INFO  (searcherExecutor-5776-thread-1-processing-x:collection1) [    x:collection1] o.a.s.h.c.SpellCheckComponent Loading spell index for spellchecker: multipleFields
   [junit4]   2> 2001699 INFO  (searcherExecutor-5776-thread-1-processing-x:collection1) [    x:collection1] o.a.s.h.c.SpellCheckComponent Loading spell index for spellchecker: jarowinkler
   [junit4]   2> 2001700 INFO  (searcherExecutor-5776-thread-1-processing-x:collection1) [    x:collection1] o.a.s.h.c.SpellCheckComponent Loading spell index for spellchecker: external
   [junit4]   2> 2001700 INFO  (TEST-AutoCommitTest.testCommitWithin-seed#[9A2C05662E3D85FF]) [    x:collection1] o.a.s.u.RandomMergePolicy RandomMergePolicy wrapping class org.apache.lucene.index.TieredMergePolicy: [TieredMergePolicy: maxMergeAtOnce=22, maxMergeAtOnceExplicit=37, maxMergedSegmentMB=85.7548828125, floorSegmentMB=0.3671875, forceMergeDeletesPctAllowed=3.6919094154065366, segmentsPerTier=21.0, maxCFSSegmentSizeMB=8.796093022207999E12, noCFSRatio=0.8637010826017233
   [junit4]   2> 2001701 INFO  (TEST-AutoCommitTest.testCommitWithin-seed#[9A2C05662E3D85FF]) [    x:collection1] o.a.s.u.DefaultSolrCoreState New IndexWriter is ready to be used.
   [junit4]   2> 2001701 INFO  (searcherExecutor-5776-thread-1-processing-x:collection1) [    x:collection1] o.a.s.h.c.SpellCheckComponent Loading spell index for spellchecker: freq
   [junit4]   2> 2001701 INFO  (searcherExecutor-5776-thread-1-processing-x:collection1) [    x:collection1] o.a.s.h.c.SpellCheckComponent Loading spell index for spellchecker: fqcn
   [junit4]   2> 2001701 INFO  (searcherExecutor-5776-thread-1-processing-x:collection1) [    x:collection1] o.a.s.h.c.SpellCheckComponent Loading spell index for spellchecker: perDict
   [junit4]   2> 2001710 INFO  (searcherExecutor-5776-thread-1-processing-x:collection1) [    x:collection1] o.a.s.c.SolrCore [collection1] Registered new searcher Searcher@6439a1a4[collection1] main{ExitableDirectoryReader(UninvertingDirectoryReader())}
   [junit4]   2> 2001710 INFO  (TEST-AutoCommitTest.testCommitWithin-seed#[9A2C05662E3D85FF]) [    x:collection1] o.a.s.s.SolrIndexSearcher Opening [Searcher@2a2ede2[collection1] main]
   [junit4]   2> 2001711 INFO  (TEST-AutoCommitTest.testCommitWithin-seed#[9A2C05662E3D85FF]) [    x:collection1] o.a.s.c.SolrCore [collection1]  CLOSING SolrCore org.apache.solr.core.SolrCore@ac9de50
   [junit4]   2> 2001711 INFO  (TEST-AutoCommitTest.testCommitWithin-seed#[9A2C05662E3D85FF]) [    x:collection1] o.a.s.m.SolrMetricManager Closing metric reporters for registry=solr.core.collection1, tag=181001808
   [junit4]   2> 2001711 INFO  (TEST-AutoCommitTest.testCommitWithin-seed#[9A2C05662E3D85FF]) [    x:collection1] o.a.s.m.r.SolrJmxReporter Closing reporter [org.apache.solr.metrics.reporters.SolrJmxReporter@4334fead: rootName = null, domain = solr.core.collection1, service url = null, agent id = null] for registry solr.core.collection1 / com.codahale.metrics.MetricRegistry@44c1985a
   [junit4]   2> 2001723 INFO  (searcherExecutor-5776-thread-1-processing-x:collection1) [    x:collection1] o.a.s.c.SolrCore [collection1] Registered new searcher Searcher@2a2ede2[collection1] main{ExitableDirectoryReader(UninvertingDirectoryReader())}
   [junit4]   2> 2001725 INFO  (TEST-AutoCommitTest.testCommitWithin-seed#[9A2C05662E3D85FF]) [    x:collection1] o.a.s.u.p.LogUpdateProcessorFactory [collection1] {add=[529 (1576363133007560704)]} 0 3
   [junit4]   2> 2001726 INFO  (TEST-AutoCommitTest.testCommitWithin-seed#[9A2C05662E3D85FF]) [    x:collection1] o.a.s.c.S.Request [collection1]  webapp=null path=null params={q=id:529&qt=&start=0&rows=20&version=2.2} hits=0 status=0 QTime=0
   [junit4]   2> 2001733 INFO  (TEST-AutoCommitTest.testCommitWithin-seed#[9A2C05662E3D85FF]) [    x:collection1] o.a.s.u.p.LogUpdateProcessorFactory [collection1] {add=[530 (1576363133019095040)]} 0 11
   [junit4]   2> 2001735 INFO  (TEST-AutoCommitTest.testCommitWithin-seed#[9A2C05662E3D85FF]) [    x:collection1] o.a.s.c.S.Request [collection1]  webapp=null path=null params={q=id:530&qt=&start=0&rows=20&version=2.2} hits=0 status=0 QTime=1
   [junit4]   2> 2001736 INFO  (TEST-AutoCommitTest.testCommitWithin-seed#[9A2C05662E3D85FF]) [    x:collection1] o.a.s.u.p.LogUpdateProcessorFactory [collection1] {delete=[529 (-1576363133022240768)]} 0 14
   [junit4]   2> 2001736 INFO  (TEST-AutoCommitTest.testCommitWithin-seed#[9A2C05662E3D85FF]) [    x:collection1] o.a.s.c.S.Request [collection1]  webapp=null path=null params={q=id:529&qt=&start=0&rows=20&version=2.2} hits=0 status=0 QTime=0
   [junit4]   2> 2001737 ERROR (TEST-AutoCommitTest.testCommitWithin-seed#[9A2C05662E3D85FF]) [    x:collection1] o.a.s.SolrTestCaseJ4 REQUEST FAILED: xpath=//result[@numFound=1]
   [junit4]   2> 	xml response was: <?xml version="1.0" encoding="UTF-8"?>
   [junit4]   2> <response>
   [junit4]   2> <lst name="responseHeader"><int name="status">0</int><int name="QTime">0</int></lst><result name="response" numFound="0" start="0"></result>
   [junit4]   2> </response>
   [junit4]   2> 
   [junit4]   2> 	request was:q=id:529&qt=&start=0&rows=20&version=2.2
   [junit4]   2> 2001737 ERROR (TEST-AutoCommitTest.testCommitWithin-seed#[9A2C05662E3D85FF]) [    x:collection1] o.a.s.SolrTestCaseJ4 REQUEST FAILED: q=id:529&qt=&start=0&rows=20&version=2.2:java.lang.RuntimeException: REQUEST FAILED: xpath=//result[@numFound=1]
   [junit4]   2> 	xml response was: <?xml version="1.0" encoding="UTF-8"?>
   [junit4]   2> <response>
   [junit4]   2> <lst name="responseHeader"><int name="status">0</int><int name="QTime">0</int></lst><result name="response" numFound="0" start="0"></result>
   [junit4]   2> </response>
   [junit4]   2> 
   [junit4]   2> 	request was:q=id:529&qt=&start=0&rows=20&version=2.2
   [junit4]   2> 	at org.apache.solr.SolrTestCaseJ4.assertQ(SolrTestCaseJ4.java:872)
   [junit4]   2> 	at org.apache.solr.update.AutoCommitTest.testCommitWithin(AutoCommitTest.java:353)
   [junit4]   2> 	at sun.reflect.NativeMethodAccessorImpl.invoke0(Native Method)
   [junit4]   2> 	at sun.reflect.NativeMethodAccessorImpl.invoke(NativeMethodAccessorImpl.java:62)
   [junit4]   2> 	at sun.reflect.DelegatingMethodAccessorImpl.invoke(DelegatingMethodAccessorImpl.java:43)
   [junit4]   2> 	at java.lang.reflect.Method.invoke(Method.java:498)
   [junit4]   2> 	at com.carrotsearch.randomizedtesting.RandomizedRunner.invoke(RandomizedRunner.java:1713)
   [junit4]   2> 	at com.carrotsearch.randomizedtesting.RandomizedRunner$8.evaluate(RandomizedRunner.java:907)
   [junit4]   2> 	at com.carrotsearch.randomizedtesting.RandomizedRunner$9.evaluate(RandomizedRunner.java:943)
   [junit4]   2> 	at com.carrotsearch.randomizedtesting.RandomizedRunner$10.evaluate(RandomizedRunner.java:957)
   [junit4]   2> 	at com.carrotsearch.randomizedtesting.rules.SystemPropertiesRestoreRule$1.evaluate(SystemPropertiesRestoreRule.java:57)
   [junit4]   2> 	at org.apache.lucene.util.TestRuleSetupTeardownChained$1.evaluate(TestRuleSetupTeardownChained.java:49)
   [junit4]   2> 	at org.apache.lucene.util.AbstractBeforeAfterRule$1.evaluate(AbstractBeforeAfterRule.java:45)
   [junit4]   2> 	at org.apache.lucene.util.TestRuleThreadAndTestName$1.evaluate(TestRuleThreadAndTestName.java:48)
   [junit4]   2> 	at org.apache.lucene.util.TestRuleIgnoreAfterMaxFailures$1.evaluate(TestRuleIgnoreAfterMaxFailures.java:64)
   [junit4]   2> 	at org.apache.lucene.util.TestRuleMarkFailure$1.evaluate(TestRuleMarkFailure.java:47)
   [junit4]   2> 	at com.carrotsearch.randomizedtesting.rules.StatementAdapter.evaluate(StatementAdapter.java:36)
   [junit4]   2> 	at com.carrotsearch.randomizedtesting.ThreadLeakControl$StatementRunner.run(ThreadLeakControl.java:368)
   [junit4]   2> 	at com.carrotsearch.randomizedtesting.ThreadLeakControl.forkTimeoutingTask(ThreadLeakControl.java:817)
   [junit4]   2> 	at com.carrotsearch.randomizedtesting.ThreadLeakControl$3.evaluate(ThreadLeakControl.java:468)
   [junit4]   2> 	at com.carrotsearch.randomizedtesting.RandomizedRunner.runSingleTest(RandomizedRunner.java:916)
   [junit4]   2> 	at com.carrotsearch.randomizedtesting.RandomizedRunner$5.evaluate(RandomizedRunner.java:802)
   [junit4]   2> 	at com.carrotsearch.randomizedtesting.RandomizedRunner$6.evaluate(RandomizedRunner.java:852)
   [junit4]   2> 	at com.carrotsearch.randomizedtesting.RandomizedRunner$7.evaluate(RandomizedRunner.java:863)
   [junit4]   2> 	at com.carrotsearch.randomizedtesting.rules.StatementAdapter.evaluate(StatementAdapter.java:36)
   [junit4]   2> 	at com.carrotsearch.randomizedtesting.rules.SystemPropertiesRestoreRule$1.evaluate(SystemPropertiesRestoreRule.java:57)
   [junit4]   2> 	at org.apache.lucene.util.AbstractBeforeAfterRule$1.evaluate(AbstractBeforeAfterRule.java:45)
   [junit4]   2> 	at com.carrotsearch.randomizedtesting.rules.StatementAdapter.evaluate(StatementAdapter.java:36)
   [junit4]   2> 	at org.apache.lucene.util.TestRuleStoreClassName$1.evaluate(TestRuleStoreClassName.java:41)
   [junit4]   2> 	at com.carrotsearch.randomizedtesting.rules.NoShadowingOrOverridesOnMethodsRule$1.evaluate(NoShadowingOrOverridesOnMethodsRule.java:40)
   [junit4]   2> 	at com.carrotsearch.randomizedtesting.rules.NoShadowingOrOverridesOnMethodsRule$1.evaluate(NoShadowingOrOverridesOnMethodsRule.java:40)
   [junit4]   2> 	at com.carrotsearch.randomizedtesting.rules.StatementAdapter.evaluate(StatementAdapter.java:36)
   [junit4]   2> 	at com.carrotsearch.randomizedtesting.rules.StatementAdapter.evaluate(StatementAdapter.java:36)
   [junit4]   2> 	at com.carrotsearch.randomizedtesting.rules.StatementAdapter.evaluate(StatementAdapter.java:36)
   [junit4]   2> 	at org.apache.lucene.util.TestRuleAssertionsRequired$1.evaluate(TestRuleAssertionsRequired.java:53)
   [junit4]   2> 	at org.apache.lucene.util.TestRuleMarkFailure$1.evaluate(TestRuleMarkFailure.java:47)
   [junit4]   2> 	at org.apache.lucene.util.TestRuleIgnoreAfterMaxFailures$1.evaluate(TestRuleIgnoreAfterMaxFailures.java:64)
   [junit4]   2> 	at org.apache.lucene.util.TestRuleIgnoreTestSuites$1.evaluate(TestRuleIgnoreTestSuites.java:54)
   [junit4]   2> 	at com.carrotsearch.randomizedtesting.rules.StatementAdapter.evaluate(StatementAdapter.java:36)
   [junit4]   2> 	at com.carrotsearch.randomizedtesting.ThreadLeakControl$StatementRunner.run(ThreadLeakControl.java:368)
   [junit4]   2> 	at java.lang.Thread.run(Thread.java:748)
   [junit4]   2> 
   [junit4]   2> 2001737 INFO  (TEST-AutoCommitTest.testCommitWithin-seed#[9A2C05662E3D85FF]) [    x:collection1] o.a.s.SolrTestCaseJ4 ###Ending testCommitWithin
   [junit4]   2> NOTE: reproduce with: ant test  -Dtestcase=AutoCommitTest -Dtests.method=testCommitWithin -Dtests.seed=9A2C05662E3D85FF -Dtests.slow=true -Dtests.locale=fr -Dtests.timezone=America/Dawson -Dtests.asserts=true -Dtests.file.encoding=Cp1252
   [junit4] ERROR   0.40s J0 | AutoCommitTest.testCommitWithin <<<
   [junit4]    > Throwable #1: java.lang.RuntimeException: Exception during query
   [junit4]    > 	at __randomizedtesting.SeedInfo.seed([9A2C05662E3D85FF:20FE6A1EAD136BEA]:0)
   [junit4]    > 	at org.apache.solr.SolrTestCaseJ4.assertQ(SolrTestCaseJ4.java:879)
   [junit4]    > 	at org.apache.solr.update.AutoCommitTest.testCommitWithin(AutoCommitTest.java:353)
   [junit4]    > 	at java.lang.Thread.run(Thread.java:748)
   [junit4]    > Caused by: java.lang.RuntimeException: REQUEST FAILED: xpath=//result[@numFound=1]
   [junit4]    > 	xml response was: <?xml version="1.0" encoding="UTF-8"?>
   [junit4]    > <response>
   [junit4]    > <lst name="responseHeader"><int name="status">0</int><int name="QTime">0</int></lst><result name="response" numFound="0" start="0"></result>
   [junit4]    > </response>
   [junit4]    > 	request was:q=id:529&qt=&start=0&rows=20&version=2.2
   [junit4]    > 	at org.apache.solr.SolrTestCaseJ4.assertQ(SolrTestCaseJ4.java:872)
   [junit4]    > 	... 40 more
   [junit4]   2> 2001743 INFO  (TEST-AutoCommitTest.testMaxTime-seed#[9A2C05662E3D85FF]) [    x:collection1] o.a.s.SolrTestCaseJ4 ###Starting testMaxTime
   [junit4]   2> 2001743 INFO  (TEST-AutoCommitTest.testMaxTime-seed#[9A2C05662E3D85FF]) [    x:collection1] o.a.s.u.DirectUpdateHandler2 [collection1] REMOVING ALL DOCUMENTS FROM INDEX
   [junit4]   2> 2001743 INFO  (TEST-AutoCommitTest.testMaxTime-seed#[9A2C05662E3D85FF]) [    x:collection1] o.a.s.s.SolrIndexSearcher Opening [Searcher@22490fc8[collection1] realtime]
   [junit4]   2> 2001743 INFO  (TEST-AutoCommitTest.testMaxTime-seed#[9A2C05662E3D85FF]) [    x:collection1] o.a.s.u.p.LogUpdateProcessorFactory [collection1]  webapp=null path=null params={_version_=-9223372036854775807&update.distrib=FROMLEADER&versions=true&wt=json&indent=true}{deleteByQuery=*:* (-9223372036854775807)} 0 0
   [junit4]   2> 2001744 ERROR (TEST-AutoCommitTest.testMaxTime-seed#[9A2C05662E3D85FF]) [    x:collection1] o.a.s.c.CorePropertiesLocator Couldn't load core descriptor from C:\Users\jenkins\workspace\Lucene-Solr-7.0-Windows\solr\core\src\test-files\solr\collection1\core.properties:java.nio.file.NoSuchFileException: C:\Users\jenkins\workspace\Lucene-Solr-7.0-Windows\solr\core\src\test-files\solr\collection1\core.properties
   [junit4]   2> 2001745 INFO  (TEST-AutoCommitTest.testMaxTime-seed#[9A2C05662E3D85FF]) [    x:collection1] o.a.s.c.SolrResourceLoader [null] Added 2 libs to classloader, from paths: [/C:/Users/jenkins/workspace/Lucene-Solr-7.0-Windows/solr/core/src/test-files/solr/collection1/lib, /C:/Users/jenkins/workspace/Lucene-Solr-7.0-Windows/solr/core/src/test-files/solr/collection1/lib/classes]
   [junit4]   2> 2001810 INFO  (TEST-AutoCommitTest.testMaxTime-seed#[9A2C05662E3D85FF]) [    x:collection1] o.a.s.c.SolrConfig Using Lucene MatchVersion: 7.0.0
   [junit4]   2> 2001826 INFO  (TEST-AutoCommitTest.testMaxTime-seed#[9A2C05662E3D85FF]) [    x:collection1] o.a.s.s.IndexSchema [collection1] Schema name=test
   [junit4]   2> 2001930 INFO  (TEST-AutoCommitTest.testMaxTime-seed#[9A2C05662E3D85FF]) [    x:collection1] o.a.s.s.IndexSchema Loaded schema test/1.0 with uniqueid field id
   [junit4]   2> 2001943 INFO  (TEST-AutoCommitTest.testMaxTime-seed#[9A2C05662E3D85FF]) [    x:collection1] o.a.s.c.CoreContainer Reloading SolrCore 'collection1' using configuration from instancedir C:\Users\jenkins\workspace\Lucene-Solr-7.0-Windows\solr\core\src\test-files\solr\collection1
   [junit4]   2> 2001993 INFO  (TEST-AutoCommitTest.testMaxTime-seed#[9A2C05662E3D85FF]) [    x:collection1] o.a.s.m.r.SolrJmxReporter JMX monitoring for 'solr.core.collection1' (registry 'solr.core.collection1') enabled at server: com.sun.jmx.mbeanserver.JmxMBeanServer@30c42089
   [junit4]   2> 2001993 INFO  (TEST-AutoCommitTest.testMaxTime-seed#[9A2C05662E3D85FF]) [    x:collection1] o.a.s.c.SolrCore [[collection1] ] Opening new SolrCore at [C:\Users\jenkins\workspace\Lucene-Solr-7.0-Windows\solr\core\src\test-files\solr\collection1], dataDir=[C:\Users\jenkins\workspace\Lucene-Solr-7.0-Windows\solr\build\solr-core\test\J0\temp\solr.update.AutoCommitTest_9A2C05662E3D85FF-001\init-core-data-001\]
   [junit4]   2> 2002077 INFO  (TEST-AutoCommitTest.testMaxTime-seed#[9A2C05662E3D85FF]) [    x:collection1] o.a.s.u.CommitTracker Hard AutoCommit: disabled
   [junit4]   2> 2002077 INFO  (TEST-AutoCommitTest.testMaxTime-seed#[9A2C05662E3D85FF]) [    x:collection1] o.a.s.u.CommitTracker Soft AutoCommit: disabled
   [junit4]   2> 2002078 INFO  (TEST-AutoCommitTest.testMaxTime-seed#[9A2C05662E3D85FF]) [    x:collection1] o.a.s.s.SolrIndexSearcher Opening [Searcher@7df7cc7e[collection1] main]
   [junit4]   2> 2002078 INFO  (TEST-AutoCommitTest.testMaxTime-seed#[9A2C05662E3D85FF]) [    x:collection1] o.a.s.h.c.SpellCheckComponent Initializing spell checkers
   [junit4]   2> 2002079 INFO  (TEST-AutoCommitTest.testMaxTime-seed#[9A2C05662E3D85FF]) [    x:collection1] o.a.s.s.DirectSolrSpellChecker init: {name=direct,classname=DirectSolrSpellChecker,field=lowerfilt,minQueryLength=3}
   [junit4]   2> 2002084 INFO  (TEST-AutoCommitTest.testMaxTime-seed#[9A2C05662E3D85FF]) [    x:collection1] o.a.s.h.ReplicationHandler Commits will be reserved for  10000
   [junit4]   2> 2002085 INFO  (searcherExecutor-5780-thread-1-processing-x:collection1) [    x:collection1] o.a.s.h.c.SpellCheckComponent Loading spell index for spellchecker: default
   [junit4]   2> 2002085 INFO  (searcherExecutor-5780-thread-1-processing-x:collection1) [    x:collection1] o.a.s.h.c.SpellCheckComponent Loading spell index for spellchecker: direct
   [junit4]   2> 2002085 INFO  (searcherExecutor-5780-thread-1-processing-x:collection1) [    x:collection1] o.a.s.h.c.SpellCheckComponent Loading spell index for spellchecker: wordbreak
   [junit4]   2> 2002085 INFO  (searcherExecutor-5780-thread-1-processing-x:collection1) [    x:collection1] o.a.s.h.c.SpellCheckComponent Loading spell index for spellchecker: multipleFields
   [junit4]   2> 2002085 INFO  (searcherExecutor-5780-thread-1-processing-x:collection1) [    x:collection1] o.a.s.h.c.SpellCheckComponent Loading spell index for spellchecker: jarowinkler
   [junit4]   2> 2002085 INFO  (searcherExecutor-5780-thread-1-processing-x:collection1) [    x:collection1] o.a.s.h.c.SpellCheckComponent Loading spell index for spellchecker: external
   [junit4]   2> 2002086 INFO  (searcherExecutor-5780-thread-1-processing-x:collection1) [    x:collection1] o.a.s.h.c.SpellCheckComponent Loading spell index for spellchecker: freq
   [junit4]   2> 2002086 INFO  (searcherExecutor-5780-thread-1-processing-x:collection1) [    x:collection1] o.a.s.h.c.SpellCheckComponent Loading spell index for spellchecker: fqcn
   [junit4]   2> 2002086 INFO  (searcherExecutor-5780-thread-1-processing-x:collection1) [    x:collection1] o.a.s.h.c.SpellCheckComponent Loading spell index for spellchecker: perDict
   [junit4]   2> 2002086 INFO  (TEST-AutoCommitTest.testMaxTime-seed#[9A2C05662E3D85FF]) [    x:collection1] o.a.s.u.RandomMergePolicy RandomMergePolicy wrapping class org.apache.lucene.index.TieredMergePolicy: [TieredMergePolicy: maxMergeAtOnce=10, maxMergeAtOnceExplicit=37, maxMergedSegmentMB=30.345703125, floorSegmentMB=2.0126953125, forceMergeDeletesPctAllowed=21.92373905437753, segmentsPerTier=41.0, maxCFSSegmentSizeMB=8.796093022207999E12, noCFSRatio=0.7621166806235224
   [junit4]   2> 2002086 INFO  (TEST-AutoCommitTest.testMaxTime-seed#[9A2C05662E3D85FF]) [    x:collection1] o.a.s.u.DefaultSolrCoreState New IndexWriter is ready to be used.
   [junit4]   2> 2002088 INFO  (searcherExecutor-5780-thread-1-processing-x:collection1) [    x:collection1] o.a.s.c.SolrCore [collection1] Registered new searcher Searcher@7df7cc7e[collection1] main{ExitableDirectoryReader(UninvertingDirectoryReader())}
   [junit4]   2> 2002088 INFO  (TEST-AutoCommitTest.testMaxTime-seed#[9A2C05662E3D85FF]) [    x:collection1] o.a.s.s.SolrIndexSearcher Opening [Searcher@749b85ce[collection1] main]
   [junit4]   2> 2002088 INFO  (TEST-AutoCommitTest.testMaxTime-seed#[9A2C05662E3D85FF]) [    x:collection1] o.a.s.c.SolrCore [collection1]  CLOSING SolrCore org.apache.solr.core.SolrCore@26ff7e50
   [junit4]   2> 2002088 INFO  (TEST-AutoCommitTest.testMaxTime-seed#[9A2C05662E3D85FF]) [    x:collection1] o.a.s.m.SolrMetricManager Closing metric reporters for registry=solr.core.collection1, tag=654278224
   [junit4]   2> 2002088 INFO  (TEST-AutoCommitTest.testMaxTime-seed#[9A2C05662E3D85FF]) [    x:collection1] o.a.s.m.r.SolrJmxReporter Closing reporter [org.apache.solr.metrics.reporters.SolrJmxReporter@6c491bdb: rootName = null, domain = solr.core.collection1, service url = null, agent id = null] for registry solr.core.collection1 / com.codahale.metrics.MetricRegistry@44c1985a
   [junit4]   2> 2002089 INFO  (searcherExecutor-5780-thread-1-processing-x:collection1) [    x:collection1] o.a.s.c.SolrCore [collection1] Registered new searcher Searcher@749b85ce[collection1] main{ExitableDirectoryReader(UninvertingDirectoryReader())}
   [junit4]   2> 2002097 INFO  (TEST-AutoCommitTest.testMaxTime-seed#[9A2C05662E3D85FF]) [    x:collection1] o.a.s.u.p.LogUpdateProcessorFactory [collection1] {add=[529 (1576363133400776704)]} 0 0
   [junit4]   2> 2002098 INFO  (TEST-AutoCommitTest.testMaxTime-seed#[9A2C05662E3D85FF]) [    x:collection1] o.a.s.c.S.Request [collection1]  webapp=null path=null params={q=id:529&qt=&start=0&rows=20&version=2.2} hits=0 status=0 QTime=0
   [junit4]   2> 2003599 INFO  (commitScheduler-5783-thread-1) [    x:collection1] o.a.s.u.DirectUpdateHandler2 start commit{,optimize=false,openSearcher=true,waitSearcher=true,expungeDeletes=false,softCommit=true,prepareCommit=false}
   [junit4]   2> 2003601 INFO  (commitScheduler-5783-thread-1) [    x:collection1] o.a.s.s.SolrIndexSearcher Opening [Searcher@655bb0b0[collection1] main]
   [junit4]   2> 2003601 INFO  (commitScheduler-5783-thread-1) [    x:collection1] o.a.s.u.DirectUpdateHandler2 end_commit_flush
   [junit4]   2> 2003603 INFO  (searcherExecutor-5780-thread-1-processing-x:collection1) [    x:collection1] o.a.s.c.SolrCore [collection1] Registered new searcher Searcher@655bb0b0[collection1] main{ExitableDirectoryReader(UninvertingDirectoryReader(Uninverting(_1(7.0.0):C1)))}
   [junit4]   2> 2003604 INFO  (TEST-AutoCommitTest.testMaxTime-seed#[9A2C05662E3D85FF]) [    x:collection1] o.a.s.u.p.LogUpdateProcessorFactory [collection1] {add=[530 (1576363134980980736)]} 0 1507
   [junit4]   2> 2003604 INFO  (TEST-AutoCommitTest.testMaxTime-seed#[9A2C05662E3D85FF]) [    x:collection1] o.a.s.c.S.Request [collection1]  webapp=null path=null params={q=id:529&qt=&start=0&rows=20&version=2.2} hits=1 status=0 QTime=0
   [junit4]   2> 2003605 INFO  (TEST-AutoCommitTest.testMaxTime-seed#[9A2C05662E3D85FF]) [    x:collection1] o.a.s.c.S.Request [collection1]  webapp=null path=null params={q=id:530&qt=&start=0&rows=20&version=2.2} hits=0 status=0 QTime=0
   [junit4]   2> 2003606 INFO  (TEST-AutoCommitTest.testMaxTime-seed#[9A2C05662E3D85FF]) [    x:collection1] o.a.s.u.p.LogUpdateProcessorFactory [collection1]  webapp=null path=null params={}{delete=[529 (-1576363134983077888)]} 0 0
   [junit4]   2> 2003606 INFO  (TEST-AutoCommitTest.testMaxTime-seed#[9A2C05662E3D85FF]) [    x:collection1] o.a.s.c.S.Request [collection1]  webapp=null path=null params={q=id:529&qt=&start=0&rows=20&version=2.2} hits=1 status=0 QTime=0
   [junit4]   2> 2005105 INFO  (commitScheduler-5783-thread-1) [    x:collection1] o.a.s.u.DirectUpdateHandler2 start commit{,optimize=false,openSearcher=true,waitSearcher=true,expungeDeletes=false,softCommit=true,prepareCommit=false}
   [junit4]   2> 2005163 INFO  (commitScheduler-5783-thread-1) [    x:collection1] o.a.s.s.SolrIndexSearcher Opening [Searcher@23b41f51[collection1] main]
   [junit4]   2> 2005169 INFO  (commitScheduler-5783-thread-1) [    x:collection1] o.a.s.u.DirectUpdateHandler2 end_commit_flush
   [junit4]   2> 2005169 INFO  (searcherExecutor-5780-thread-1-processing-x:collection1) [    x:collection1] o.a.s.c.SolrCore [collection1] Registered new searcher Searcher@23b41f51[collection1] main{ExitableDirectoryReader(UninvertingDirectoryReader(Uninverting(_2(7.0.0):C1)))}
   [junit4]   2> 2005412 INFO  (TEST-AutoCommitTest.testMaxTime-seed#[9A2C05662E3D85FF]) [    x:collection1] o.a.s.u.p.LogUpdateProcessorFactory [collection1] {add=[550 (1576363136876806144)]} 0 3314
   [junit4]   2> 2005412 INFO  (TEST-AutoCommitTest.testMaxTime-seed#[9A2C05662E3D85FF]) [    x:collection1] o.a.s.c.S.Request [collection1]  webapp=null path=null params={q=id:529&qt=&start=0&rows=20&version=2.2} hits=0 status=0 QTime=0
   [junit4]   2> 2005413 INFO  (TEST-AutoCommitTest.testMaxTime-seed#[9A2C05662E3D85FF]) [    x:collection1] o.a.s.u.p.LogUpdateProcessorFactory [collection1] {add=[500 (1576363136877854720)]} 0 3315
   [junit4]   2> 2005413 INFO  (TEST-AutoCommitTest.testMaxTime-seed#[9A2C05662E3D85FF]) [    x:collection1] o.a.s.u.p.LogUpdateProcessorFactory [collection1] {add=[500 (1576363136877854721)]} 0 3316
   [junit4]   2> 2005413 INFO  (TEST-AutoCommitTest.testMaxTime-seed#[9A2C05662E3D85FF]) [    x:collection1] o.a.s.u.p.LogUpdateProcessorFactory [collection1] {add=[500 (1576363136877854722)]} 0 3316
   [junit4]   2> 2005414 INFO  (TEST-AutoCommitTest.testMaxTime-seed#[9A2C05662E3D85FF]) [    x:collection1] o.a.s.u.p.LogUpdateProcessorFactory [collection1] {add=[500 (1576363136877854723)]} 0 3316
   [junit4]   2> 2005414 INFO  (TEST-AutoCommitTest.testMaxTime-seed#[9A2C05662E3D85FF]) [    x:collection1] o.a.s.u.p.LogUpdateProcessorFactory [collection1] {add=[500 (1576363136878903296)]} 0 3316
   [junit4]   2> 2005414 INFO  (TEST-AutoCommitTest.testMaxTime-seed#[9A2C05662E3D85FF]) [    x:collection1] o.a.s.u.p.LogUpdateProcessorFactory [collection1] {add=[500 (1576363136878903297)]} 0 3316
   [junit4]   2> 2005414 INFO  (TEST-AutoCommitTest.testMaxTime-seed#[9A2C05662E3D85FF]) [    x:collection1] o.a.s.u.p.LogUpdateProcessorFactory [collection1] {add=[500 (1576363136878903298)]} 0 3317
   [junit4]   2> 2005414 INFO  (TEST-AutoCommitTest.testMaxTime-seed#[9A2C05662E3D85FF]) [    x:collection1] o.a.s.u.p.LogUpdateProcessorFactory [collection1] {add=[500 (1576363136878903299)]} 0 3317
   [junit4]   2> 2005415 INFO  (TEST-AutoCommitTest.testMaxTime-seed#[9A2C05662E3D85FF]) [    x:collection1] o.a.s.u.p.LogUpdateProcessorFactory [collection1] {add=[500 (1576363136878903300)]} 0 3317
   [junit4]   2> 2005415 INFO  (TEST-AutoCommitTest.testMaxTime-seed#[9A2C05662E3D85FF]) [    x:collection1] o.a.s.u.p.LogUpdateProcessorFactory [collection1] {add=[500 (1576363136879951872)]} 0 3317
   [junit4]   2> 2005415 INFO  (TEST-AutoCommitTest.testMaxTime-seed#[9A2C05662E3D85FF]) [    x:collection1] o.a.s.c.S.Request [collection1]  webapp=null path=null params={q=id:500&qt=&start=0&rows=20&version=2.2} hits=0 status=0 QTime=0
   [junit4]   2> 2006912 INFO  (commitScheduler-5783-thread-1) [    x:collection1] o.a.s.u.DirectUpdateHandler2 start commit{,optimize=false,openSearcher=true,waitSearcher=true,expungeDeletes=false,softCommit=true,prepareCommit=false}
   [junit4]   2> 2006916 INFO  (commitScheduler-5783-thread-1) [    x:collection1] o.a.s.s.SolrIndexSearcher Opening [Searcher@600182d1[collection1] main]
   [junit4]   2> 2006916 INFO  (commitScheduler-5783-thread-1) [    x:collection1] o.a.s.u.DirectUpdateHandler2 end_commit_flush
   [junit4]   2> 2006920 INFO  (searcherExecutor-5780-thread-1-processing-x:collection1) [    x:collection1] o.a.s.c.SolrCore [collection1] Registered new searcher Searcher@600182d1[collection1] main{ExitableDirectoryReader(UninvertingDirectoryReader(Uninverting(_2(7.0.0):C1) Uninverting(_3(7.0.0):C11/9:delGen=1)))}
   [junit4]   2> 2006921 INFO  (TEST-AutoCommitTest.testMaxTime-seed#[9A2C05662E3D85FF]) [    x:collection1] o.a.s.u.p.LogUpdateProcessorFactory [collection1] {add=[531 (1576363138459107328)]} 0 4824
   [junit4]   2> 2006921 INFO  (TEST-AutoCommitTest.testMaxTime-seed#[9A2C05662E3D85FF]) [    x:collection1] o.a.s.c.S.Request [collection1]  webapp=null path=null params={q=id:500&qt=&start=0&rows=20&version=2.2} hits=1 status=0 QTime=0
   [junit4]   2> 2006922 INFO  (TEST-AutoCommitTest.testMaxTime-seed#[9A2C05662E3D85FF]) [    x:collection1] o.a.s.SolrTestCaseJ4 ###Ending testMaxTime
   [junit4]   2> 2006931 INFO  (TEST-AutoCommitTest.testMaxDocs-seed#[9A2C05662E3D85FF]) [    x:collection1] o.a.s.SolrTestCaseJ4 ###Starting testMaxDocs
   [junit4]   2> 2006931 INFO  (TEST-AutoCommitTest.testMaxDocs-seed#[9A2C05662E3D85FF]) [    x:collection1] o.a.s.u.DirectUpdateHandler2 [collection1] REMOVING ALL DOCUMENTS FROM INDEX
   [junit4]   2> 2006931 INFO  (TEST-AutoCommitTest.testMaxDocs-seed#[9A2C05662E3D85FF]) [    x:collection1] o.a.s.s.SolrIndexSearcher Opening [Searcher@1834f21f[collection1] realtime]
   [junit4]   2> 2006932 INFO  (TEST-AutoCommitTest.testMaxDocs-seed#[9A2C05662E3D85FF]) [    x:collection1] o.a.s.u.p.LogUpdateProcessorFactory [collection1]  webapp=null path=null params={_version_=-9223372036854775807&update.distrib=FROMLEADER&versions=true&wt=json&indent=true}{deleteByQuery=*:* (-9223372036854775807)} 0 1
   [junit4]   2> 2006933 ERROR (TEST-AutoCommitTest.testMaxDocs-seed#[9A2C05662E3D85FF]) [    x:collection1] o.a.s.c.CorePropertiesLocator Couldn't load core descriptor from C:\Users\jenkins\workspace\Lucene-Solr-7.0-Windows\solr\core\src\test-files\solr\collection1\core.properties:java.nio.file.NoSuchFileException: C:\Users\jenkins\workspace\Lucene-Solr-7.0-Windows\solr\core\src\test-files\solr\collection1\core.properties
   [junit4]   2> 2006935 INFO  (TEST-AutoCommitTest.testMaxDocs-seed#[9A2C05662E3D85FF]) [    x:collection1] o.a.s.c.SolrResourceLoader [null] Added 2 libs to classloader, from paths: [/C:/Users/jenkins/workspace/Lucene-Solr-7.0-Windows/solr/core/src/test-files/solr/collection1/lib, /C:/Users/jenkins/workspace/Lucene-Solr-7.0-Windows/solr/core/src/test-files/solr/collection1/lib/classes]
   [junit4]   2> 2006996 INFO  (TEST-AutoCommitTest.testMaxDocs-seed#[9A2C05662E3D85FF]) [    x:collection1] o.a.s.c.SolrConfig Using Lucene MatchVersion: 7.0.0
   [junit4]   2> 2007011 INFO  (TEST-AutoCommitTest.testMaxDocs-seed#[9A2C05662E3D85FF]) [    x:collection1] o.a.s.s.IndexSchema [collection1] Schema name=test
   [junit4]   2> 2007086 INFO  (TEST-AutoCommitTest.testMaxDocs-seed#[9A2C05662E3D85FF]) [    x:collection1] o.a.s.s.IndexSchema Loaded schema test/1.0 with uniqueid field id
   [junit4]   2> 2007095 INFO  (TEST-AutoCommitTest.testMaxDocs-seed#[9A2C05662E3D85FF]) [    x:collection1] o.a.s.c.CoreContainer Reloading SolrCore 'collection1' using configuration from instancedir C:\Users\jenkins\workspace\Lucene-Solr-7.0-Windows\solr\core\src\test-files\solr\collection1
   [junit4]   2> 2007117 INFO  (TEST-AutoCommitTest.testMaxDocs-seed#[9A2C05662E3D85FF]) [    x:collection1] o.a.s.m.r.SolrJmxReporter JMX monitoring for 'solr.core.collection1' (registry 'solr.core.collection1') enabled at server: com.sun.jmx.mbeanserver.JmxMBeanServer@30c42089
   [junit4]   2> 2007117 INFO  (TEST-AutoCommitTest.testMaxDocs-seed#[9A2C05662E3D85FF]) [    x:collection1] o.a.s.c.SolrCore [[collection1] ] Opening new SolrCore at [C:\Users\jenkins\workspace\Lucene-Solr-7.0-Windows\solr\core\src\test-files\solr\collection1], dataDir=[C:\Users\jenkins\workspace\Lucene-Solr-7.0-Windows\solr\build\solr-core\test\J0\temp\solr.update.AutoCommitTest_9A2C05662E3D85FF-001\init-core-data-001\]
   [junit4]   2> 2007193 INFO  (TEST-AutoCommitTest.testMaxDocs-seed#[9A2C05662E3D85FF]) [    x:collection1] o.a.s.u.CommitTracker Hard AutoCommit: disabled
   [junit4]   2> 2007193 INFO  (TEST-AutoCommitTest.testMaxDocs-seed#[9A2C05662E3D85FF]) [    x:collection1] o.a.s.u.CommitTracker Soft AutoCommit: disabled
   [junit4]   2> 2007194 INFO  (TEST-AutoCommitTest.testMaxDocs-seed#[9A2C05662E3D85FF]) [    x:collection1] o.a.s.s.SolrIndexSearcher Opening [Searcher@d3a3132[collection1] main]
   [junit4]   2> 2007194 INFO  (TEST-AutoCommitTest.testMaxDocs-seed#[9A2C05662E3D85FF]) [    x:collection1] o.a.s.h.c.SpellCheckComponent Initializing spell checkers
   [junit4]   2> 2007195 INFO  (TEST-AutoCommitTest.testMaxDocs-seed#[9A2C05662E3D85FF]) [    x:collection1] o.a.s.s.DirectSolrSpellChecker init: {name=direct,classname=DirectSolrSpellChecker,field=lowerfilt,minQueryLength=3}
   [junit4]   2> 2007200 INFO  (TEST-AutoCommitTest.testMaxDocs-seed#[9A2C05662E3D85FF]) [    x:collection1] o.a.s.h.ReplicationHandler Commits will be reserved for  10000
   [junit4]   2> 2007200 INFO  (searcherExecutor-5784-thread-1-processing-x:collection1) [    x:collection1] o.a.s.h.c.SpellCheckComponent Loading spell index for spellchecker: default
   [junit4]   2> 2007201 INFO  (searcherExecutor-5784-thread-1-processing-x:collection1) [    x:collection1] o.a.s.h.c.SpellCheckComponent Loading spell index for spellchecker: direct
   [junit4]   2> 2007201 INFO  (searcherExecutor-5784-thread-1-processing-x:collection1) [    x:collection1] o.a.s.h.c.SpellCheckComponent Loading spell index for spellchecker: wordbreak
   [junit4]   2> 2007201 INFO  (searcherExecutor-5784-thread-1-processing-x:collection1) [    x:collection1] o.a.s.h.c.SpellCheckComponent Loading spell index for spellchecker: multipleFields
   [junit4]   2> 2007201 INFO  (searcherExecutor-5784-thread-1-processing-x:collection1) [    x:collection1] o.a.s.h.c.SpellCheckComponent Loading spell index for spellchecker: jarowinkler
   [junit4]   2> 2007201 INFO  (searcherExecutor-5784-thread-1-processing-x:collection1) [    x:collection1] o.a.s.h.c.SpellCheckComponent Loading spell index for spellchecker: external
   [junit4]   2> 2007201 INFO  (searcherExecutor-5784-thread-1-processing-x:collection1) [    x:collection1] o.a.s.h.c.SpellCheckComponent Loading spell index for spellchecker: freq
   [junit4]   2> 2007203 INFO  (searcherExecutor-5784-thread-1-processing-x:collection1) [    x:collection1] o.a.s.h.c.SpellCheckComponent Loading spell index for spellchecker: fqcn
   [junit4]   2> 2007203 INFO  (TEST-AutoCommitTest.testMaxDocs-seed#[9A2C05662E3D85FF]) [    x:collection1] o.a.s.u.RandomMergePolicy RandomMergePolicy wrapping class org.apache.lucene.index.TieredMergePolicy: [TieredMergePolicy: maxMergeAtOnce=36, maxMergeAtOnceExplicit=13, maxMergedSegmentMB=99.029296875, floorSegmentMB=1.7890625, forceMergeDeletesPctAllowed=24.006037318731284, segmentsPerTier=17.0, maxCFSSegmentSizeMB=8.796093022207999E12, noCFSRatio=0.7246492066237957
   [junit4]   2> 2007203 INFO  (searcherExecutor-5784-thread-1-processing-x:collection1) [    x:collection1] o.a.s.h.c.SpellCheckComponent Loading spell index for spellchecker: perDict
   [junit4]   2> 2007203 INFO  (TEST-AutoCommitTest.testMaxDocs-seed#[9A2C05662E3D85FF]) [    x:collection1] o.a.s.u.DefaultSolrCoreState New IndexWriter is ready to be used.
   [junit4]   2> 2007205 INFO  (searcherExecutor-5784-thread-1-processing-x:collection1) [    x:collection1] o.a.s.c.SolrCore [collection1] Registered new searcher Searcher@d3a3132[collection1] main{ExitableDirectoryReader(UninvertingDirectoryReader())}
   [junit4]   2> 2007205 INFO  (TEST-AutoCommitTest.testMaxDocs-seed#[9A2C05662E3D85FF]) [    x:collection1] o.a.s.s.SolrIndexSearcher Opening [Searcher@373b0241[collection1] main]
   [junit4]   2> 2007205 INFO  (TEST-AutoCommitTest.testMaxDocs-seed#[9A2C05662E3D85FF]) [    x:collection1] o.a.s.c.SolrCore [collection1]  CLOSING SolrCore org.apache.solr.core.SolrCore@627005d3
   [junit4]   2> 2007205 INFO  (TEST-AutoCommitTest.testMaxDocs-seed#[9A2C05662E3D85FF]) [    x:collection1] o.a.s.m.SolrMetricManager Closing metric reporters for registry=solr.core.collection1, tag=1651508691
   [junit4]   2> 2007205 INFO  (TEST-AutoCommitTest.testMaxDocs-seed#[9A2C05662E3D85FF]) [    x:collection1] o.a.s.m.r.SolrJmxReporter Closing reporter [org.apache.solr.metrics.reporters.SolrJmxReporter@6eb790a1: rootName = null, domain = solr.core.collection1, service url = null, agent id = null] for registry solr.core.collection1 / com.codahale.metrics.MetricRegistry@44c1985a
   [junit4]   2> 2007206 INFO  (searcherExecutor-5784-thread-1-processing-x:collection1) [    x:collection1] o.a.s.c.SolrCore [collection1] Registered new searcher Searcher@373b0241[collection1] main{ExitableDirectoryReader(UninvertingDirectoryReader())}
   [junit4]   2> 2007214 INFO  (TEST-AutoCommitTest.testMaxDocs-seed#[9A2C05662E3D85FF]) [    x:collection1] o.a.s.u.p.LogUpdateProcessorFactory [collection1] {add=[0 (1576363138765291520)]} 0 0
   [junit4]   2> 2007214 INFO  (TEST-AutoCommitTest.testMaxDocs-seed#[9A2C05662E3D85FF]) [    x:collection1] o.a.s.u.p.LogUpdateProcessorFactory [collection1] {add=[1 (1576363138766340096)]} 0 0
   [junit4]   2> 2007214 INFO  (TEST-AutoCommitTest.testMaxDocs-seed#[9A2C05662E3D85FF]) [    x:collection1] o.a.s.u.p.LogUpdateProcessorFactory [collection1] {add=[2 (1576363138766340097)]} 0 0
   [junit4]   2> 2007214 INFO  (TEST-AutoCommitTest.testMaxDocs-seed#[9A2C05662E3D85FF]) [    x:collection1] o.a.s.u.p.LogUpdateProcessorFactory [collection1] {add=[3 (1576363138766340098)]} 0 0
   [junit4]   2> 2007214 INFO  (TEST-AutoCommitTest.testMaxDocs-seed#[9A2C05662E3D85FF]) [    x:collection1] o.a.s.u.p.LogUpdateProcessorFactory [collection1] {add=[4 (1576363138766340099)]} 0 0
   [junit4]   2> 2007214 INFO  (TEST-AutoCommitTest.testMaxDocs-seed#[9A2C05662E3D85FF]) [    x:collection1] o.a.s.u.p.LogUpdateProcessorFactory [collection1] {add=[5 (1576363138766340100)]} 0 1
   [junit4]   2> 2007214 INFO  (TEST-AutoCommitTest.testMaxDocs-seed#[9A2C05662E3D85FF]) [    x:collection1] o.a.s.u.p.LogUpdateProcessorFactory [collection1] {add=[6 (1576363138766340101)]} 0 1
   [junit4]   2> 2007214 INFO  (TEST-AutoCommitTest.testMaxDocs-seed#[9A2C05662E3D85FF]) [    x:collection1] o.a.s.u.p.LogUpdateProcessorFactory [collection1] {add=[7 (1576363138766340102)]} 0 1
   [junit4]   2> 2007214 INFO  (TEST-AutoCommitTest.testMaxDocs-seed#[9A2C05662E3D85FF]) [    x:collection1] o.a.s.u.p.LogUpdateProcessorFactory [collection1] {add=[8 (1576363138766340103)]} 0 1
   [junit4]   2> 2007215 INFO  (TEST-AutoCommitTest.testMaxDocs-seed#[9A2C05662E3D85FF]) [    x:collection1] o.a.s.u.p.LogUpdateProcessorFactory [collection1] {add=[9 (1576363138767388672)]} 0 1
   [junit4]   2> 2007215 INFO  (TEST-AutoCommitTest.testMaxDocs-seed#[9A2C05662E3D85FF]) [    x:collection1] o.a.s.u.p.LogUpdateProcessorFactory [collection1] {add=[10 (1576363138767388673)]} 0 1
   [junit4]   2> 2007215 INFO  (TEST-AutoCommitTest.testMaxDocs-seed#[9A2C05662E3D85FF]) [    x:collection1] o.a.s.u.p.LogUpdateProcessorFactory [collection1] {add=[11 (1576363138767388674)]} 0 1
   [junit4]   2> 2007215 INFO  (TEST-AutoCommitTest.testMaxDocs-seed#[9A2C05662E3D85FF]) [    x:collection1] o.a.s.u.p.LogUpdateProcessorFactory [collection1] {add=[12 (1576363138767388675)]} 0 1
   [junit4]   2> 2007215 INFO  (TEST-AutoCommitTest.testMaxDocs-seed#[9A2C05662E3D85FF]) [    x:collection1] o.a.s.u.p.LogUpdateProcessorFactory [collection1] {add=[13 (1576363138767388676)]} 0 1
   [junit4]   2> 2007215 INFO  (TEST-AutoCommitTest.testMaxDocs-seed#[9A2C05662E3D85FF]) [    x:collection1] o.a.s.c.S.Request [collection1]  webapp=null path=null params={q=id:1&qt=&start=0&rows=20&version=2.2} hits=0 status=0 QTime=0
   [junit4]   2> 2007216 INFO  (TEST-AutoCommitTest.testMaxDocs-seed#[9A2C05662E3D85FF]) [    x:collection1] o.a.s.u.p.LogUpdateProcessorFactory [collection1] {add=[14 (1576363138767388677)]} 0 2
   [junit4]   2> 2007218 INFO  (commitScheduler-5787-thread-1) [    x:collection1] o.a.s.u.DirectUpdateHandler2 start commit{,optimize=false,openSearcher=true,waitSearcher=true,expungeDeletes=false,softCommit=true,prepareCommit=false}
   [junit4]   2> 2007225 INFO  (commitScheduler-5787-thread-1) [    x:collection1] o.a.s.s.SolrIndexSearcher Opening [Searcher@7a4e09ef[collection1] main]
   [junit4]   2> 2007226 INFO  (searcherExecutor-5784-thread-1-processing-x:collection1) [    x:collection1] o.a.s.c.SolrCore [collection1] Registered new searcher Searcher@7a4e09ef[collection1] main{ExitableDirectoryReader(UninvertingDirectoryReader(Uninverting(_5(7.0.0):C15)))}
   [junit4]   2> 2007230 INFO  (commitScheduler-5787-thread-1) [    x:collection1] o.a.s.u.DirectUpdateHandler2 end_commit_flush
   [junit4]   2> 2007467 INFO  (TEST-AutoCommitTest.testMaxDocs-seed#[9A2C05662E3D85FF]) [    x:collection1] o.a.s.u.p.LogUpdateProcessorFactory [collection1] {add=[15 (1576363139031629824)]} 0 254
   [junit4]   2> 2007468 INFO  (TEST-AutoCommitTest.testMaxDocs-seed#[9A2C05662E3D85FF]) [    x:collection1] o.a.s.c.S.Request [collection1]  webapp=null path=null params={q=id:14&qt=&start=0&rows=20&version=2.2} hits=1 status=0 QTime=0
   [junit4]   2> 2007468 INFO  (TEST-AutoCommitTest.testMaxDocs-seed#[9A2C05662E3D85FF]) [    x:collection1] o.a.s.c.S.Request [collection1]  webapp=null path=null params={q=id:15&qt=&start=0&rows=20&version=2.2} hits=0 status=0 QTime=0
   [junit4]   2> 2007468 INFO  (TEST-AutoCommitTest.testMaxDocs-seed#[9A2C05662E3D85FF]) [    x:collection1] o.a.s.SolrTestCaseJ4 ###Ending testMaxDocs
   [junit4]   2> 2007468 INFO  (SUITE-AutoCommitTest-seed#[9A2C05662E3D85FF]-worker) [    x:collection1] o.a.s.SolrTestCaseJ4 ###deleteCore
   [junit4]   2> 2007468 INFO  (SUITE-AutoCommitTest-seed#[9A2C05662E3D85FF]-worker) [    x:collection1] o.a.s.c.CoreContainer Shutting down CoreContainer instance=125108044
   [junit4]   2> 2007468 INFO  (SUITE-AutoCommitTest-seed#[9A2C05662E3D85FF]-worker) [    x:collection1] o.a.s.m.SolrMetricManager Closing metric reporters for registry=solr.node, tag=null
   [junit4]   2> 2007468 INFO  (SUITE-AutoCommitTest-seed#[9A2C05662E3D85FF]-worker) [    x:collection1] o.a.s.m.r.SolrJmxReporter Closing reporter [org.apache.solr.metrics.reporters.SolrJmxReporter@676dd2fe: rootName = null, domain = solr.node, service url = null, agent id = null] for registry solr.node / com.codahale.metrics.MetricRegistry@59f795f
   [junit4]   2> 2007472 INFO  (SUITE-AutoCommitTest-seed#[9A2C05662E3D85FF]-worker) [    x:collection1] o.a.s.m.SolrMetricManager Closing metric reporters for registry=solr.jvm, tag=null
   [junit4]   2> 2007472 INFO  (SUITE-AutoCommitTest-seed#[9A2C05662E3D85FF]-worker) [    x:collection1] o.a.s.m.r.SolrJmxReporter Closing reporter [org.apache.solr.metrics.reporters.SolrJmxReporter@7693c307: rootName = null, domain = solr.jvm, service url = null, agent id = null] for registry solr.jvm / com.codahale.metrics.MetricRegistry@162a609d
   [junit4]   2> 2007475 INFO  (SUITE-AutoCommitTest-seed#[9A2C05662E3D85FF]-worker) [    x:collection1] o.a.s.m.SolrMetricManager Closing metric reporters for registry=solr.jetty, tag=null
   [junit4]   2> 2007475 INFO  (SUITE-AutoCommitTest-seed#[9A2C05662E3D85FF]-worker) [    x:collection1] o.a.s.m.r.SolrJmxReporter Closing reporter [org.apache.solr.metrics.reporters.SolrJmxReporter@6cae878d: rootName = null, domain = solr.jetty, service url = null, agent id = null] for registry solr.jetty / com.codahale.metrics.MetricRegistry@640112cd
   [junit4]   2> 2007476 INFO  (SUITE-AutoCommitTest-seed#[9A2C05662E3D85FF]-worker) [    x:collection1] o.a.s.c.TransientSolrCoreCacheDefault Allocating transient cache for 2147483647 transient cores
   [junit4]   2> 2007476 INFO  (coreCloseExecutor-5788-thread-1-processing-x:collection1) [    x:collection1] o.a.s.c.SolrCore [collection1]  CLOSING SolrCore org.apache.solr.core.SolrCore@233abc3
   [junit4]   2> 2007476 INFO  (coreCloseExecutor-5788-thread-1-processing-x:collection1) [    x:collection1] o.a.s.m.SolrMetricManager Closing metric reporters for registry=solr.core.collection1, tag=36940739
   [junit4]   2> 2007476 INFO  (coreCloseExecutor-5788-thread-1-processing-x:collection1) [    x:collection1] o.a.s.m.r.SolrJmxReporter Closing reporter [org.apache.solr.metrics.reporters.SolrJmxReporter@679463e6: rootName = null, domain = solr.core.collection1, service url = null, agent id = null] for registry solr.core.collection1 / com.codahale.metrics.MetricRegistry@44c1985a
   [junit4]   2> 2007484 INFO  (coreCloseExecutor-5788-thread-1-processing-x:collection1) [    x:collection1] o.a.s.u.DirectUpdateHandler2 Committing on IndexWriter close.
   [junit4]   2> 2007484 INFO  (coreCloseExecutor-5788-thread-1-processing-x:collection1) [    x:collection1] o.a.s.u.SolrIndexWriter Calling setCommitData with IW:org.apache.solr.update.SolrIndexWriter@3834b71 commitCommandVersion:0
   [junit4]   2> NOTE: leaving temporary files on disk at: C:\Users\jenkins\workspace\Lucene-Solr-7.0-Windows\solr\build\solr-core\test\J0\temp\solr.update.AutoCommitTest_9A2C05662E3D85FF-001
   [junit4]   2> NOTE: test params are: codec=Asserting(Lucene70): {range_facet_l_dv=PostingsFormat(name=Asserting), field_t=PostingsFormat(name=Memory), multiDefault=Lucene50(blocksize=128), subject=Lucene50(blocksize=128), intDefault=PostingsFormat(name=Memory), id_i1=Lucene50(blocksize=128), id=PostingsFormat(name=Asserting), range_facet_i_dv=PostingsFormat(name=Memory), text=PostingsFormat(name=Memory), range_facet_l=PostingsFormat(name=Memory), timestamp=PostingsFormat(name=Memory)}, docValues:{range_facet_l_dv=DocValuesFormat(name=Lucene70), _version_=DocValuesFormat(name=Lucene70), intDefault=DocValuesFormat(name=Lucene70), id_i1=DocValuesFormat(name=Memory), range_facet_i_dv=DocValuesFormat(name=Lucene70), intDvoDefault=DocValuesFormat(name=Direct), range_facet_l=DocValuesFormat(name=Lucene70), timestamp=DocValuesFormat(name=Lucene70)}, maxPointsInLeafNode=218, maxMBSortInHeap=7.307902366943717, sim=RandomSimilarity(queryNorm=true): {}, locale=fr, timezone=America/Dawson
   [junit4]   2> NOTE: Windows 10 10.0 amd64/Oracle Corporation 1.8.0_144 (64-bit)/cpus=3,threads=1,free=137164424,total=536870912
   [junit4]   2> NOTE: All tests run in this JVM: [SolrCLIZkUtilsTest, V2StandaloneTest, RegexBoostProcessorTest, TestCorePropertiesReload, TestSubQueryTransformerDistrib, TestCloudDeleteByQuery, SolrCloudReportersTest, HighlighterTest, CursorPagingTest, DirectUpdateHandlerTest, PrimitiveFieldTypeTest, ResourceLoaderTest, GraphQueryTest, TestFieldCacheVsDocValues, DistributedSpellCheckComponentTest, TestStandardQParsers, TestUpdate, CloudMLTQParserTest, BlobRepositoryCloudTest, DeleteShardTest, ConfigSetsAPITest, TestDocBasedVersionConstraints, TestRandomDVFaceting, SolrGraphiteReporterTest, ZkStateWriterTest, TestSolrConfigHandlerCloud, CoreAdminHandlerTest, SoftAutoCommitTest, CoreSorterTest, TestConfigSetsAPI, DistribCursorPagingTest, TestQueryWrapperFilter, TestSearcherReuse, TestCloudSchemaless, ExitableDirectoryReaderTest, TestHalfAndHalfDocValues, TestBlobHandler, TestClusterStateMutator, HardAutoCommitTest, SuggesterTest, TestStressRecovery, TestPayloadCheckQParserPlugin, TestExtendedDismaxParser, TestClusterProperties, OutOfBoxZkACLAndCredentialsProvidersTest, ReturnFieldsTest, SharedFSAutoReplicaFailoverUtilsTest, PathHierarchyTokenizerFactoryTest, TestReplicaProperties, ReplaceNodeTest, TestReversedWildcardFilterFactory, TestMissingGroups, TestFaceting, TestHighlightDedupGrouping, TestSolrConfigHandler, ShufflingReplicaListTransformerTest, PeerSyncWithIndexFingerprintCachingTest, ConnectionReuseTest, DistributedDebugComponentTest, TestGroupingSearch, TestReqParamsAPI, TestHashPartitioner, TestAddFieldRealTimeGet, TestSolrCloudSnapshots, TestCursorMarkWithoutUniqueKey, TestManagedResourceStorage, ChaosMonkeyNothingIsSafeTest, TestImpersonationWithHadoopAuth, SmileWriterTest, AlternateDirectoryTest, TestConfigsApi, TestHdfsBackupRestoreCore, SegmentsInfoRequestHandlerTest, ClusterStateTest, TestMiniSolrCloudClusterSSL, WordBreakSolrSpellCheckerTest, TestJsonFacets, TestUseDocValuesAsStored2, RankQueryTest, RecoveryZkTest, TestPHPSerializedResponseWriter, TestCloudManagedSchema, TestBlendedInfixSuggestions, BlockCacheTest, SolrIndexSplitterTest, TestSizeLimitedDistributedMap, TestLocalFSCloudBackupRestore, TestMacros, IndexSchemaTest, TestSurroundQueryParser, PropertiesRequestHandlerTest, TestLegacyNumericRangeQueryBuilder, BasicDistributedZkTest, TestFieldResource, SolrJmxReporterTest, TestSolrQueryResponse, TestNumericRangeQuery64, InfixSuggestersTest, LargeFieldTest, TestSchemaVersionResource, HdfsWriteToMultipleCollectionsTest, AnalyticsQueryTest, HdfsLockFactoryTest, TestTrieFacet, TestTolerantUpdateProcessorCloud, OverseerTest, SuggestComponentContextFilterQueryTest, TestScoreJoinQPScore, SliceStateTest, TestCustomSort, TestBulkSchemaAPI, QueryParsingTest, ChaosMonkeySafeLeaderWithPullReplicasTest, DistributedFacetPivotSmallTest, QueryResultKeyTest, UUIDUpdateProcessorFallbackTest, DistanceFunctionTest, URLClassifyProcessorTest, TestSolrCoreProperties, TestMaxTokenLenTokenizer, BigEndianAscendingWordSerializerTest, RestartWhileUpdatingTest, UniqFieldsUpdateProcessorFactoryTest, TestHdfsCloudBackupRestore, TestLFUCache, FastVectorHighlighterTest, LeaderElectionContextKeyTest, TestLeaderElectionZkExpiry, TestFieldCache, ResponseHeaderTest, TestComplexPhraseLeadingWildcard, TestPseudoReturnFields, ExplicitHLLTest, TestNRTOpen, XsltUpdateRequestHandlerTest, HdfsNNFailoverTest, TestStressLiveNodes, TestDistributedSearch, SSLMigrationTest, ClassificationUpdateProcessorTest, TestNumericTerms64, CdcrUpdateLogTest, SpellCheckCollatorWithCollapseTest, TestXIncludeConfig, OutputWriterTest, TestPointFields, AliasIntegrationTest, ClusterStateUpdateTest, TestCustomDocTransformer, TestDynamicLoading, TestFoldingMultitermQuery, TestConfigOverlay, UUIDFieldTest, HdfsChaosMonkeySafeLeaderTest, DateRangeFieldTest, SuggesterWFSTTest, TestXmlQParserPlugin, TestTolerantSearch, SpatialFilterTest, TestFreeTextSuggestions, TestDownShardTolerantSearch, DistributedQueryComponentCustomSortTest, TestGeoJSONResponseWriter, SyncSliceTest, TestBinaryField, XmlUpdateRequestHandlerTest, TimeZoneUtilsTest, DistributedVersionInfoTest, ZkCLITest, ShardRoutingTest, SolrMetricsIntegrationTest, LeaderFailureAfterFreshStartTest, TestLegacyFieldCache, IndexBasedSpellCheckerTest, TestSweetSpotSimilarityFactory, TestNamedUpdateProcessors, TestRandomFaceting, LeaderElectionTest, ZkSolrClientTest, AutoCommitTest]
   [junit4] Completed [374/729 (1!)] on J0 in 6.76s, 3 tests, 1 error <<< FAILURES!

[...truncated 44521 lines...]