You are viewing a plain text version of this content. The canonical link for it is here.
Posted to dev@lucene.apache.org by Policeman Jenkins Server <je...@thetaphi.de> on 2016/08/03 06:59:58 UTC
[JENKINS] Lucene-Solr-6.x-Linux (64bit/jdk1.8.0_102) - Build # 1353
- Still Unstable!
Build: http://jenkins.thetaphi.de/job/Lucene-Solr-6.x-Linux/1353/
Java: 64bit/jdk1.8.0_102 -XX:-UseCompressedOops -XX:+UseParallelGC
1 tests failed.
FAILED: org.apache.solr.cloud.LeaderFailoverAfterPartitionTest.test
Error Message:
No live SolrServers available to handle this request:[http://127.0.0.1:35402/vykd/ep/c8n_1x3_lf_shard1_replica1]
Stack Trace:
org.apache.solr.client.solrj.impl.CloudSolrClient$RouteException: No live SolrServers available to handle this request:[http://127.0.0.1:35402/vykd/ep/c8n_1x3_lf_shard1_replica1]
at __randomizedtesting.SeedInfo.seed([3EEB70CF45BA7790:B6BF4F15EB461A68]:0)
at org.apache.solr.client.solrj.impl.CloudSolrClient.directUpdate(CloudSolrClient.java:760)
at org.apache.solr.client.solrj.impl.CloudSolrClient.sendRequest(CloudSolrClient.java:1172)
at org.apache.solr.client.solrj.impl.CloudSolrClient.requestWithRetryOnStaleState(CloudSolrClient.java:1061)
at org.apache.solr.client.solrj.impl.CloudSolrClient.request(CloudSolrClient.java:997)
at org.apache.solr.client.solrj.SolrClient.request(SolrClient.java:1219)
at org.apache.solr.cloud.HttpPartitionTest.sendDoc(HttpPartitionTest.java:592)
at org.apache.solr.cloud.HttpPartitionTest.sendDoc(HttpPartitionTest.java:578)
at org.apache.solr.cloud.LeaderFailoverAfterPartitionTest.testRf3WithLeaderFailover(LeaderFailoverAfterPartitionTest.java:174)
at org.apache.solr.cloud.LeaderFailoverAfterPartitionTest.test(LeaderFailoverAfterPartitionTest.java:55)
at sun.reflect.NativeMethodAccessorImpl.invoke0(Native Method)
at sun.reflect.NativeMethodAccessorImpl.invoke(NativeMethodAccessorImpl.java:62)
at sun.reflect.DelegatingMethodAccessorImpl.invoke(DelegatingMethodAccessorImpl.java:43)
at java.lang.reflect.Method.invoke(Method.java:498)
at com.carrotsearch.randomizedtesting.RandomizedRunner.invoke(RandomizedRunner.java:1764)
at com.carrotsearch.randomizedtesting.RandomizedRunner$8.evaluate(RandomizedRunner.java:871)
at com.carrotsearch.randomizedtesting.RandomizedRunner$9.evaluate(RandomizedRunner.java:907)
at com.carrotsearch.randomizedtesting.RandomizedRunner$10.evaluate(RandomizedRunner.java:921)
at org.apache.solr.BaseDistributedSearchTestCase$ShardsRepeatRule$ShardsFixedStatement.callStatement(BaseDistributedSearchTestCase.java:992)
at org.apache.solr.BaseDistributedSearchTestCase$ShardsRepeatRule$ShardsStatement.evaluate(BaseDistributedSearchTestCase.java:967)
at com.carrotsearch.randomizedtesting.rules.SystemPropertiesRestoreRule$1.evaluate(SystemPropertiesRestoreRule.java:57)
at org.apache.lucene.util.TestRuleSetupTeardownChained$1.evaluate(TestRuleSetupTeardownChained.java:49)
at org.apache.lucene.util.AbstractBeforeAfterRule$1.evaluate(AbstractBeforeAfterRule.java:45)
at org.apache.lucene.util.TestRuleThreadAndTestName$1.evaluate(TestRuleThreadAndTestName.java:48)
at org.apache.lucene.util.TestRuleIgnoreAfterMaxFailures$1.evaluate(TestRuleIgnoreAfterMaxFailures.java:64)
at org.apache.lucene.util.TestRuleMarkFailure$1.evaluate(TestRuleMarkFailure.java:47)
at com.carrotsearch.randomizedtesting.rules.StatementAdapter.evaluate(StatementAdapter.java:36)
at com.carrotsearch.randomizedtesting.ThreadLeakControl$StatementRunner.run(ThreadLeakControl.java:367)
at com.carrotsearch.randomizedtesting.ThreadLeakControl.forkTimeoutingTask(ThreadLeakControl.java:809)
at com.carrotsearch.randomizedtesting.ThreadLeakControl$3.evaluate(ThreadLeakControl.java:460)
at com.carrotsearch.randomizedtesting.RandomizedRunner.runSingleTest(RandomizedRunner.java:880)
at com.carrotsearch.randomizedtesting.RandomizedRunner$5.evaluate(RandomizedRunner.java:781)
at com.carrotsearch.randomizedtesting.RandomizedRunner$6.evaluate(RandomizedRunner.java:816)
at com.carrotsearch.randomizedtesting.RandomizedRunner$7.evaluate(RandomizedRunner.java:827)
at com.carrotsearch.randomizedtesting.rules.StatementAdapter.evaluate(StatementAdapter.java:36)
at com.carrotsearch.randomizedtesting.rules.SystemPropertiesRestoreRule$1.evaluate(SystemPropertiesRestoreRule.java:57)
at org.apache.lucene.util.AbstractBeforeAfterRule$1.evaluate(AbstractBeforeAfterRule.java:45)
at com.carrotsearch.randomizedtesting.rules.StatementAdapter.evaluate(StatementAdapter.java:36)
at org.apache.lucene.util.TestRuleStoreClassName$1.evaluate(TestRuleStoreClassName.java:41)
at com.carrotsearch.randomizedtesting.rules.NoShadowingOrOverridesOnMethodsRule$1.evaluate(NoShadowingOrOverridesOnMethodsRule.java:40)
at com.carrotsearch.randomizedtesting.rules.NoShadowingOrOverridesOnMethodsRule$1.evaluate(NoShadowingOrOverridesOnMethodsRule.java:40)
at com.carrotsearch.randomizedtesting.rules.StatementAdapter.evaluate(StatementAdapter.java:36)
at com.carrotsearch.randomizedtesting.rules.StatementAdapter.evaluate(StatementAdapter.java:36)
at com.carrotsearch.randomizedtesting.rules.StatementAdapter.evaluate(StatementAdapter.java:36)
at org.apache.lucene.util.TestRuleAssertionsRequired$1.evaluate(TestRuleAssertionsRequired.java:53)
at org.apache.lucene.util.TestRuleMarkFailure$1.evaluate(TestRuleMarkFailure.java:47)
at org.apache.lucene.util.TestRuleIgnoreAfterMaxFailures$1.evaluate(TestRuleIgnoreAfterMaxFailures.java:64)
at org.apache.lucene.util.TestRuleIgnoreTestSuites$1.evaluate(TestRuleIgnoreTestSuites.java:54)
at com.carrotsearch.randomizedtesting.rules.StatementAdapter.evaluate(StatementAdapter.java:36)
at com.carrotsearch.randomizedtesting.ThreadLeakControl$StatementRunner.run(ThreadLeakControl.java:367)
at java.lang.Thread.run(Thread.java:745)
Caused by: org.apache.solr.client.solrj.SolrServerException: No live SolrServers available to handle this request:[http://127.0.0.1:35402/vykd/ep/c8n_1x3_lf_shard1_replica1]
at org.apache.solr.client.solrj.impl.LBHttpSolrClient.request(LBHttpSolrClient.java:383)
at org.apache.solr.client.solrj.impl.CloudSolrClient.lambda$directUpdate$0(CloudSolrClient.java:735)
at java.util.concurrent.FutureTask.run(FutureTask.java:266)
at org.apache.solr.common.util.ExecutorUtil$MDCAwareThreadPoolExecutor.lambda$execute$0(ExecutorUtil.java:229)
at java.util.concurrent.ThreadPoolExecutor.runWorker(ThreadPoolExecutor.java:1142)
at java.util.concurrent.ThreadPoolExecutor$Worker.run(ThreadPoolExecutor.java:617)
... 1 more
Caused by: org.apache.solr.client.solrj.SolrServerException: Server refused connection at: http://127.0.0.1:35402/vykd/ep/c8n_1x3_lf_shard1_replica1
at org.apache.solr.client.solrj.impl.HttpSolrClient.executeMethod(HttpSolrClient.java:599)
at org.apache.solr.client.solrj.impl.HttpSolrClient.request(HttpSolrClient.java:261)
at org.apache.solr.client.solrj.impl.HttpSolrClient.request(HttpSolrClient.java:250)
at org.apache.solr.client.solrj.impl.LBHttpSolrClient.doRequest(LBHttpSolrClient.java:403)
at org.apache.solr.client.solrj.impl.LBHttpSolrClient.request(LBHttpSolrClient.java:356)
... 6 more
Caused by: java.net.ConnectException: Connection refused
at java.net.PlainSocketImpl.socketConnect(Native Method)
at java.net.AbstractPlainSocketImpl.doConnect(AbstractPlainSocketImpl.java:350)
at java.net.AbstractPlainSocketImpl.connectToAddress(AbstractPlainSocketImpl.java:206)
at java.net.AbstractPlainSocketImpl.connect(AbstractPlainSocketImpl.java:188)
at java.net.SocksSocketImpl.connect(SocksSocketImpl.java:392)
at java.net.Socket.connect(Socket.java:589)
at org.apache.http.conn.scheme.PlainSocketFactory.connectSocket(PlainSocketFactory.java:117)
at org.apache.http.impl.conn.DefaultClientConnectionOperator.openConnection(DefaultClientConnectionOperator.java:177)
at org.apache.http.impl.conn.ManagedClientConnectionImpl.open(ManagedClientConnectionImpl.java:304)
at org.apache.http.impl.client.DefaultRequestDirector.tryConnect(DefaultRequestDirector.java:611)
at org.apache.http.impl.client.DefaultRequestDirector.execute(DefaultRequestDirector.java:446)
at org.apache.http.impl.client.AbstractHttpClient.doExecute(AbstractHttpClient.java:882)
at org.apache.http.impl.client.CloseableHttpClient.execute(CloseableHttpClient.java:82)
at org.apache.http.impl.client.CloseableHttpClient.execute(CloseableHttpClient.java:107)
at org.apache.http.impl.client.CloseableHttpClient.execute(CloseableHttpClient.java:55)
at org.apache.solr.client.solrj.impl.HttpSolrClient.executeMethod(HttpSolrClient.java:497)
... 10 more
Build Log:
[...truncated 10813 lines...]
[junit4] Suite: org.apache.solr.cloud.LeaderFailoverAfterPartitionTest
[junit4] 2> Creating dataDir: /home/jenkins/workspace/Lucene-Solr-6.x-Linux/solr/build/solr-core/test/J2/temp/solr.cloud.LeaderFailoverAfterPartitionTest_3EEB70CF45BA7790-001/init-core-data-001
[junit4] 2> 151416 INFO (SUITE-LeaderFailoverAfterPartitionTest-seed#[3EEB70CF45BA7790]-worker) [ ] o.a.s.SolrTestCaseJ4 Randomized ssl (false) and clientAuth (false) via: @org.apache.solr.SolrTestCaseJ4$SuppressSSL(bugUrl=https://issues.apache.org/jira/browse/SOLR-5776)
[junit4] 2> 151416 INFO (SUITE-LeaderFailoverAfterPartitionTest-seed#[3EEB70CF45BA7790]-worker) [ ] o.a.s.BaseDistributedSearchTestCase Setting hostContext system property: /vykd/ep
[junit4] 2> 151418 INFO (TEST-LeaderFailoverAfterPartitionTest.test-seed#[3EEB70CF45BA7790]) [ ] o.a.s.c.ZkTestServer STARTING ZK TEST SERVER
[junit4] 2> 151418 INFO (Thread-360) [ ] o.a.s.c.ZkTestServer client port:0.0.0.0/0.0.0.0:0
[junit4] 2> 151418 INFO (Thread-360) [ ] o.a.s.c.ZkTestServer Starting server
[junit4] 2> 151518 INFO (TEST-LeaderFailoverAfterPartitionTest.test-seed#[3EEB70CF45BA7790]) [ ] o.a.s.c.ZkTestServer start zk server on port:38526
[junit4] 2> 151518 INFO (TEST-LeaderFailoverAfterPartitionTest.test-seed#[3EEB70CF45BA7790]) [ ] o.a.s.c.c.SolrZkClient Using default ZkCredentialsProvider
[junit4] 2> 151519 INFO (TEST-LeaderFailoverAfterPartitionTest.test-seed#[3EEB70CF45BA7790]) [ ] o.a.s.c.c.ConnectionManager Waiting for client to connect to ZooKeeper
[junit4] 2> 151521 INFO (zkCallback-214-thread-1) [ ] o.a.s.c.c.ConnectionManager Watcher org.apache.solr.common.cloud.ConnectionManager@1170013e name:ZooKeeperConnection Watcher:127.0.0.1:38526 got event WatchedEvent state:SyncConnected type:None path:null path:null type:None
[junit4] 2> 151522 INFO (TEST-LeaderFailoverAfterPartitionTest.test-seed#[3EEB70CF45BA7790]) [ ] o.a.s.c.c.ConnectionManager Client is connected to ZooKeeper
[junit4] 2> 151522 INFO (TEST-LeaderFailoverAfterPartitionTest.test-seed#[3EEB70CF45BA7790]) [ ] o.a.s.c.c.SolrZkClient Using default ZkACLProvider
[junit4] 2> 151522 INFO (TEST-LeaderFailoverAfterPartitionTest.test-seed#[3EEB70CF45BA7790]) [ ] o.a.s.c.c.SolrZkClient makePath: /solr
[junit4] 2> 151524 INFO (TEST-LeaderFailoverAfterPartitionTest.test-seed#[3EEB70CF45BA7790]) [ ] o.a.s.c.c.SolrZkClient Using default ZkCredentialsProvider
[junit4] 2> 151525 INFO (TEST-LeaderFailoverAfterPartitionTest.test-seed#[3EEB70CF45BA7790]) [ ] o.a.s.c.c.ConnectionManager Waiting for client to connect to ZooKeeper
[junit4] 2> 151534 INFO (zkCallback-215-thread-1) [ ] o.a.s.c.c.ConnectionManager Watcher org.apache.solr.common.cloud.ConnectionManager@592134d5 name:ZooKeeperConnection Watcher:127.0.0.1:38526/solr got event WatchedEvent state:SyncConnected type:None path:null path:null type:None
[junit4] 2> 151535 INFO (TEST-LeaderFailoverAfterPartitionTest.test-seed#[3EEB70CF45BA7790]) [ ] o.a.s.c.c.ConnectionManager Client is connected to ZooKeeper
[junit4] 2> 151535 INFO (TEST-LeaderFailoverAfterPartitionTest.test-seed#[3EEB70CF45BA7790]) [ ] o.a.s.c.c.SolrZkClient Using default ZkACLProvider
[junit4] 2> 151535 INFO (TEST-LeaderFailoverAfterPartitionTest.test-seed#[3EEB70CF45BA7790]) [ ] o.a.s.c.c.SolrZkClient makePath: /collections/collection1
[junit4] 2> 151536 INFO (TEST-LeaderFailoverAfterPartitionTest.test-seed#[3EEB70CF45BA7790]) [ ] o.a.s.c.c.SolrZkClient makePath: /collections/collection1/shards
[junit4] 2> 151537 INFO (TEST-LeaderFailoverAfterPartitionTest.test-seed#[3EEB70CF45BA7790]) [ ] o.a.s.c.c.SolrZkClient makePath: /collections/control_collection
[junit4] 2> 151538 INFO (TEST-LeaderFailoverAfterPartitionTest.test-seed#[3EEB70CF45BA7790]) [ ] o.a.s.c.c.SolrZkClient makePath: /collections/control_collection/shards
[junit4] 2> 151538 INFO (TEST-LeaderFailoverAfterPartitionTest.test-seed#[3EEB70CF45BA7790]) [ ] o.a.s.c.AbstractZkTestCase put /home/jenkins/workspace/Lucene-Solr-6.x-Linux/solr/core/src/test-files/solr/collection1/conf/solrconfig-tlog.xml to /configs/conf1/solrconfig.xml
[junit4] 2> 151538 INFO (TEST-LeaderFailoverAfterPartitionTest.test-seed#[3EEB70CF45BA7790]) [ ] o.a.s.c.c.SolrZkClient makePath: /configs/conf1/solrconfig.xml
[junit4] 2> 151539 INFO (TEST-LeaderFailoverAfterPartitionTest.test-seed#[3EEB70CF45BA7790]) [ ] o.a.s.c.AbstractZkTestCase put /home/jenkins/workspace/Lucene-Solr-6.x-Linux/solr/core/src/test-files/solr/collection1/conf/schema.xml to /configs/conf1/schema.xml
[junit4] 2> 151539 INFO (TEST-LeaderFailoverAfterPartitionTest.test-seed#[3EEB70CF45BA7790]) [ ] o.a.s.c.c.SolrZkClient makePath: /configs/conf1/schema.xml
[junit4] 2> 151540 INFO (TEST-LeaderFailoverAfterPartitionTest.test-seed#[3EEB70CF45BA7790]) [ ] o.a.s.c.AbstractZkTestCase put /home/jenkins/workspace/Lucene-Solr-6.x-Linux/solr/core/src/test-files/solr/collection1/conf/solrconfig.snippet.randomindexconfig.xml to /configs/conf1/solrconfig.snippet.randomindexconfig.xml
[junit4] 2> 151540 INFO (TEST-LeaderFailoverAfterPartitionTest.test-seed#[3EEB70CF45BA7790]) [ ] o.a.s.c.c.SolrZkClient makePath: /configs/conf1/solrconfig.snippet.randomindexconfig.xml
[junit4] 2> 151541 INFO (TEST-LeaderFailoverAfterPartitionTest.test-seed#[3EEB70CF45BA7790]) [ ] o.a.s.c.AbstractZkTestCase put /home/jenkins/workspace/Lucene-Solr-6.x-Linux/solr/core/src/test-files/solr/collection1/conf/stopwords.txt to /configs/conf1/stopwords.txt
[junit4] 2> 151541 INFO (TEST-LeaderFailoverAfterPartitionTest.test-seed#[3EEB70CF45BA7790]) [ ] o.a.s.c.c.SolrZkClient makePath: /configs/conf1/stopwords.txt
[junit4] 2> 151542 INFO (TEST-LeaderFailoverAfterPartitionTest.test-seed#[3EEB70CF45BA7790]) [ ] o.a.s.c.AbstractZkTestCase put /home/jenkins/workspace/Lucene-Solr-6.x-Linux/solr/core/src/test-files/solr/collection1/conf/protwords.txt to /configs/conf1/protwords.txt
[junit4] 2> 151542 INFO (TEST-LeaderFailoverAfterPartitionTest.test-seed#[3EEB70CF45BA7790]) [ ] o.a.s.c.c.SolrZkClient makePath: /configs/conf1/protwords.txt
[junit4] 2> 151543 INFO (TEST-LeaderFailoverAfterPartitionTest.test-seed#[3EEB70CF45BA7790]) [ ] o.a.s.c.AbstractZkTestCase put /home/jenkins/workspace/Lucene-Solr-6.x-Linux/solr/core/src/test-files/solr/collection1/conf/currency.xml to /configs/conf1/currency.xml
[junit4] 2> 151543 INFO (TEST-LeaderFailoverAfterPartitionTest.test-seed#[3EEB70CF45BA7790]) [ ] o.a.s.c.c.SolrZkClient makePath: /configs/conf1/currency.xml
[junit4] 2> 151543 INFO (TEST-LeaderFailoverAfterPartitionTest.test-seed#[3EEB70CF45BA7790]) [ ] o.a.s.c.AbstractZkTestCase put /home/jenkins/workspace/Lucene-Solr-6.x-Linux/solr/core/src/test-files/solr/collection1/conf/enumsConfig.xml to /configs/conf1/enumsConfig.xml
[junit4] 2> 151543 INFO (TEST-LeaderFailoverAfterPartitionTest.test-seed#[3EEB70CF45BA7790]) [ ] o.a.s.c.c.SolrZkClient makePath: /configs/conf1/enumsConfig.xml
[junit4] 2> 151545 INFO (TEST-LeaderFailoverAfterPartitionTest.test-seed#[3EEB70CF45BA7790]) [ ] o.a.s.c.AbstractZkTestCase put /home/jenkins/workspace/Lucene-Solr-6.x-Linux/solr/core/src/test-files/solr/collection1/conf/open-exchange-rates.json to /configs/conf1/open-exchange-rates.json
[junit4] 2> 151546 INFO (TEST-LeaderFailoverAfterPartitionTest.test-seed#[3EEB70CF45BA7790]) [ ] o.a.s.c.c.SolrZkClient makePath: /configs/conf1/open-exchange-rates.json
[junit4] 2> 151547 INFO (TEST-LeaderFailoverAfterPartitionTest.test-seed#[3EEB70CF45BA7790]) [ ] o.a.s.c.AbstractZkTestCase put /home/jenkins/workspace/Lucene-Solr-6.x-Linux/solr/core/src/test-files/solr/collection1/conf/mapping-ISOLatin1Accent.txt to /configs/conf1/mapping-ISOLatin1Accent.txt
[junit4] 2> 151547 INFO (TEST-LeaderFailoverAfterPartitionTest.test-seed#[3EEB70CF45BA7790]) [ ] o.a.s.c.c.SolrZkClient makePath: /configs/conf1/mapping-ISOLatin1Accent.txt
[junit4] 2> 151548 INFO (TEST-LeaderFailoverAfterPartitionTest.test-seed#[3EEB70CF45BA7790]) [ ] o.a.s.c.AbstractZkTestCase put /home/jenkins/workspace/Lucene-Solr-6.x-Linux/solr/core/src/test-files/solr/collection1/conf/old_synonyms.txt to /configs/conf1/old_synonyms.txt
[junit4] 2> 151548 INFO (TEST-LeaderFailoverAfterPartitionTest.test-seed#[3EEB70CF45BA7790]) [ ] o.a.s.c.c.SolrZkClient makePath: /configs/conf1/old_synonyms.txt
[junit4] 2> 151549 INFO (TEST-LeaderFailoverAfterPartitionTest.test-seed#[3EEB70CF45BA7790]) [ ] o.a.s.c.AbstractZkTestCase put /home/jenkins/workspace/Lucene-Solr-6.x-Linux/solr/core/src/test-files/solr/collection1/conf/synonyms.txt to /configs/conf1/synonyms.txt
[junit4] 2> 151549 INFO (TEST-LeaderFailoverAfterPartitionTest.test-seed#[3EEB70CF45BA7790]) [ ] o.a.s.c.c.SolrZkClient makePath: /configs/conf1/synonyms.txt
[junit4] 2> 151614 INFO (TEST-LeaderFailoverAfterPartitionTest.test-seed#[3EEB70CF45BA7790]) [ ] o.a.s.SolrTestCaseJ4 Writing core.properties file to /home/jenkins/workspace/Lucene-Solr-6.x-Linux/solr/build/solr-core/test/J2/temp/solr.cloud.LeaderFailoverAfterPartitionTest_3EEB70CF45BA7790-001/control-001/cores/collection1
[junit4] 2> 151618 INFO (TEST-LeaderFailoverAfterPartitionTest.test-seed#[3EEB70CF45BA7790]) [ ] o.e.j.s.Server jetty-9.3.8.v20160314
[junit4] 2> 151619 INFO (TEST-LeaderFailoverAfterPartitionTest.test-seed#[3EEB70CF45BA7790]) [ ] o.e.j.s.h.ContextHandler Started o.e.j.s.ServletContextHandler@777e667{/vykd/ep,null,AVAILABLE}
[junit4] 2> 151621 INFO (TEST-LeaderFailoverAfterPartitionTest.test-seed#[3EEB70CF45BA7790]) [ ] o.e.j.s.ServerConnector Started ServerConnector@396e7509{HTTP/1.1,[http/1.1]}{127.0.0.1:35591}
[junit4] 2> 151621 INFO (TEST-LeaderFailoverAfterPartitionTest.test-seed#[3EEB70CF45BA7790]) [ ] o.e.j.s.Server Started @153825ms
[junit4] 2> 151621 INFO (TEST-LeaderFailoverAfterPartitionTest.test-seed#[3EEB70CF45BA7790]) [ ] o.a.s.c.s.e.JettySolrRunner Jetty properties: {solr.data.dir=/home/jenkins/workspace/Lucene-Solr-6.x-Linux/solr/build/solr-core/test/J2/temp/solr.cloud.LeaderFailoverAfterPartitionTest_3EEB70CF45BA7790-001/tempDir-001/control/data, hostContext=/vykd/ep, hostPort=39134, coreRootDirectory=/home/jenkins/workspace/Lucene-Solr-6.x-Linux/solr/build/solr-core/test/J2/temp/solr.cloud.LeaderFailoverAfterPartitionTest_3EEB70CF45BA7790-001/control-001/cores}
[junit4] 2> 151622 INFO (TEST-LeaderFailoverAfterPartitionTest.test-seed#[3EEB70CF45BA7790]) [ ] o.a.s.s.SolrDispatchFilter SolrDispatchFilter.init(): sun.misc.Launcher$AppClassLoader@73d16e93
[junit4] 2> 151622 INFO (TEST-LeaderFailoverAfterPartitionTest.test-seed#[3EEB70CF45BA7790]) [ ] o.a.s.c.SolrResourceLoader new SolrResourceLoader for directory: '/home/jenkins/workspace/Lucene-Solr-6.x-Linux/solr/build/solr-core/test/J2/temp/solr.cloud.LeaderFailoverAfterPartitionTest_3EEB70CF45BA7790-001/control-001'
[junit4] 2> 151622 INFO (TEST-LeaderFailoverAfterPartitionTest.test-seed#[3EEB70CF45BA7790]) [ ] o.a.s.c.SolrResourceLoader JNDI not configured for solr (NoInitialContextEx)
[junit4] 2> 151622 INFO (TEST-LeaderFailoverAfterPartitionTest.test-seed#[3EEB70CF45BA7790]) [ ] o.a.s.c.SolrResourceLoader solr home defaulted to 'solr/' (could not find system property or JNDI)
[junit4] 2> 151622 INFO (TEST-LeaderFailoverAfterPartitionTest.test-seed#[3EEB70CF45BA7790]) [ ] o.a.s.c.c.SolrZkClient Using default ZkCredentialsProvider
[junit4] 2> 151624 INFO (TEST-LeaderFailoverAfterPartitionTest.test-seed#[3EEB70CF45BA7790]) [ ] o.a.s.c.c.ConnectionManager Waiting for client to connect to ZooKeeper
[junit4] 2> 151625 INFO (zkCallback-216-thread-1) [ ] o.a.s.c.c.ConnectionManager Watcher org.apache.solr.common.cloud.ConnectionManager@5d3e2a45 name:ZooKeeperConnection Watcher:127.0.0.1:38526/solr got event WatchedEvent state:SyncConnected type:None path:null path:null type:None
[junit4] 2> 151625 INFO (TEST-LeaderFailoverAfterPartitionTest.test-seed#[3EEB70CF45BA7790]) [ ] o.a.s.c.c.ConnectionManager Client is connected to ZooKeeper
[junit4] 2> 151625 INFO (TEST-LeaderFailoverAfterPartitionTest.test-seed#[3EEB70CF45BA7790]) [ ] o.a.s.c.c.SolrZkClient Using default ZkACLProvider
[junit4] 2> 151626 INFO (TEST-LeaderFailoverAfterPartitionTest.test-seed#[3EEB70CF45BA7790]) [ ] o.a.s.s.SolrDispatchFilter Loading solr.xml from SolrHome (not found in ZooKeeper)
[junit4] 2> 151626 INFO (TEST-LeaderFailoverAfterPartitionTest.test-seed#[3EEB70CF45BA7790]) [ ] o.a.s.c.SolrXmlConfig Loading container configuration from /home/jenkins/workspace/Lucene-Solr-6.x-Linux/solr/build/solr-core/test/J2/temp/solr.cloud.LeaderFailoverAfterPartitionTest_3EEB70CF45BA7790-001/control-001/solr.xml
[junit4] 2> 151634 INFO (TEST-LeaderFailoverAfterPartitionTest.test-seed#[3EEB70CF45BA7790]) [ ] o.a.s.c.CorePropertiesLocator Config-defined core root directory: /home/jenkins/workspace/Lucene-Solr-6.x-Linux/solr/build/solr-core/test/J2/temp/solr.cloud.LeaderFailoverAfterPartitionTest_3EEB70CF45BA7790-001/control-001/cores
[junit4] 2> 151634 INFO (TEST-LeaderFailoverAfterPartitionTest.test-seed#[3EEB70CF45BA7790]) [ ] o.a.s.c.CoreContainer New CoreContainer 870556654
[junit4] 2> 151634 INFO (TEST-LeaderFailoverAfterPartitionTest.test-seed#[3EEB70CF45BA7790]) [ ] o.a.s.c.CoreContainer Loading cores into CoreContainer [instanceDir=/home/jenkins/workspace/Lucene-Solr-6.x-Linux/solr/build/solr-core/test/J2/temp/solr.cloud.LeaderFailoverAfterPartitionTest_3EEB70CF45BA7790-001/control-001]
[junit4] 2> 151634 WARN (TEST-LeaderFailoverAfterPartitionTest.test-seed#[3EEB70CF45BA7790]) [ ] o.a.s.c.CoreContainer Couldn't add files from /home/jenkins/workspace/Lucene-Solr-6.x-Linux/solr/build/solr-core/test/J2/temp/solr.cloud.LeaderFailoverAfterPartitionTest_3EEB70CF45BA7790-001/control-001/lib to classpath: /home/jenkins/workspace/Lucene-Solr-6.x-Linux/solr/build/solr-core/test/J2/temp/solr.cloud.LeaderFailoverAfterPartitionTest_3EEB70CF45BA7790-001/control-001/lib
[junit4] 2> 151634 INFO (TEST-LeaderFailoverAfterPartitionTest.test-seed#[3EEB70CF45BA7790]) [ ] o.a.s.h.c.HttpShardHandlerFactory created with socketTimeout : 90000,urlScheme : ,connTimeout : 15000,maxConnectionsPerHost : 20,maxConnections : 10000,corePoolSize : 0,maximumPoolSize : 2147483647,maxThreadIdleTime : 5,sizeOfQueue : -1,fairnessPolicy : false,useRetries : false,connectionsEvictorSleepDelay : 5000,maxConnectionIdleTime : 40000,
[junit4] 2> 151636 INFO (TEST-LeaderFailoverAfterPartitionTest.test-seed#[3EEB70CF45BA7790]) [ ] o.a.s.u.UpdateShardHandler Creating UpdateShardHandler HTTP client with params: socketTimeout=340000&connTimeout=45000&retry=true
[junit4] 2> 151637 INFO (TEST-LeaderFailoverAfterPartitionTest.test-seed#[3EEB70CF45BA7790]) [ ] o.a.s.l.LogWatcher SLF4J impl is org.slf4j.impl.Log4jLoggerFactory
[junit4] 2> 151637 INFO (TEST-LeaderFailoverAfterPartitionTest.test-seed#[3EEB70CF45BA7790]) [ ] o.a.s.l.LogWatcher Registering Log Listener [Log4j (org.slf4j.impl.Log4jLoggerFactory)]
[junit4] 2> 151637 INFO (TEST-LeaderFailoverAfterPartitionTest.test-seed#[3EEB70CF45BA7790]) [ ] o.a.s.c.ZkContainer Zookeeper client=127.0.0.1:38526/solr
[junit4] 2> 151637 INFO (TEST-LeaderFailoverAfterPartitionTest.test-seed#[3EEB70CF45BA7790]) [ ] o.a.s.c.ZkController zkHost includes chroot
[junit4] 2> 151637 INFO (TEST-LeaderFailoverAfterPartitionTest.test-seed#[3EEB70CF45BA7790]) [ ] o.a.s.c.c.SolrZkClient Using default ZkCredentialsProvider
[junit4] 2> 151641 INFO (TEST-LeaderFailoverAfterPartitionTest.test-seed#[3EEB70CF45BA7790]) [ ] o.a.s.c.c.ConnectionManager Waiting for client to connect to ZooKeeper
[junit4] 2> 151641 INFO (zkCallback-219-thread-1) [ ] o.a.s.c.c.ConnectionManager Watcher org.apache.solr.common.cloud.ConnectionManager@7c843356 name:ZooKeeperConnection Watcher:127.0.0.1:38526 got event WatchedEvent state:SyncConnected type:None path:null path:null type:None
[junit4] 2> 151642 INFO (TEST-LeaderFailoverAfterPartitionTest.test-seed#[3EEB70CF45BA7790]) [ ] o.a.s.c.c.ConnectionManager Client is connected to ZooKeeper
[junit4] 2> 151642 INFO (TEST-LeaderFailoverAfterPartitionTest.test-seed#[3EEB70CF45BA7790]) [ ] o.a.s.c.c.SolrZkClient Using default ZkACLProvider
[junit4] 2> 151643 INFO (TEST-LeaderFailoverAfterPartitionTest.test-seed#[3EEB70CF45BA7790]) [n:127.0.0.1:39134_vykd%2Fep ] o.a.s.c.ZkController Added new OnReconnect listener org.apache.solr.cloud.ZkController$$Lambda$107/2073146622@5531e026
[junit4] 2> 151648 INFO (TEST-LeaderFailoverAfterPartitionTest.test-seed#[3EEB70CF45BA7790]) [n:127.0.0.1:39134_vykd%2Fep ] o.a.s.c.c.ConnectionManager Waiting for client to connect to ZooKeeper
[junit4] 2> 151649 INFO (zkCallback-220-thread-1-processing-n:127.0.0.1:39134_vykd%2Fep) [n:127.0.0.1:39134_vykd%2Fep ] o.a.s.c.c.ConnectionManager Watcher org.apache.solr.common.cloud.ConnectionManager@1b957d52 name:ZooKeeperConnection Watcher:127.0.0.1:38526/solr got event WatchedEvent state:SyncConnected type:None path:null path:null type:None
[junit4] 2> 151649 INFO (TEST-LeaderFailoverAfterPartitionTest.test-seed#[3EEB70CF45BA7790]) [n:127.0.0.1:39134_vykd%2Fep ] o.a.s.c.c.ConnectionManager Client is connected to ZooKeeper
[junit4] 2> 151650 INFO (TEST-LeaderFailoverAfterPartitionTest.test-seed#[3EEB70CF45BA7790]) [n:127.0.0.1:39134_vykd%2Fep ] o.a.s.c.c.SolrZkClient makePath: /overseer/queue
[junit4] 2> 151651 INFO (TEST-LeaderFailoverAfterPartitionTest.test-seed#[3EEB70CF45BA7790]) [n:127.0.0.1:39134_vykd%2Fep ] o.a.s.c.c.SolrZkClient makePath: /overseer/collection-queue-work
[junit4] 2> 151653 INFO (TEST-LeaderFailoverAfterPartitionTest.test-seed#[3EEB70CF45BA7790]) [n:127.0.0.1:39134_vykd%2Fep ] o.a.s.c.c.SolrZkClient makePath: /overseer/collection-map-running
[junit4] 2> 151654 INFO (TEST-LeaderFailoverAfterPartitionTest.test-seed#[3EEB70CF45BA7790]) [n:127.0.0.1:39134_vykd%2Fep ] o.a.s.c.c.SolrZkClient makePath: /overseer/collection-map-completed
[junit4] 2> 151655 INFO (TEST-LeaderFailoverAfterPartitionTest.test-seed#[3EEB70CF45BA7790]) [n:127.0.0.1:39134_vykd%2Fep ] o.a.s.c.c.SolrZkClient makePath: /overseer/collection-map-failure
[junit4] 2> 151655 INFO (TEST-LeaderFailoverAfterPartitionTest.test-seed#[3EEB70CF45BA7790]) [n:127.0.0.1:39134_vykd%2Fep ] o.a.s.c.c.SolrZkClient makePath: /live_nodes
[junit4] 2> 151656 INFO (TEST-LeaderFailoverAfterPartitionTest.test-seed#[3EEB70CF45BA7790]) [n:127.0.0.1:39134_vykd%2Fep ] o.a.s.c.c.SolrZkClient makePath: /aliases.json
[junit4] 2> 151656 INFO (TEST-LeaderFailoverAfterPartitionTest.test-seed#[3EEB70CF45BA7790]) [n:127.0.0.1:39134_vykd%2Fep ] o.a.s.c.c.SolrZkClient makePath: /clusterstate.json
[junit4] 2> 151657 INFO (TEST-LeaderFailoverAfterPartitionTest.test-seed#[3EEB70CF45BA7790]) [n:127.0.0.1:39134_vykd%2Fep ] o.a.s.c.c.SolrZkClient makePath: /security.json
[junit4] 2> 151657 INFO (TEST-LeaderFailoverAfterPartitionTest.test-seed#[3EEB70CF45BA7790]) [n:127.0.0.1:39134_vykd%2Fep ] o.a.s.c.c.ZkStateReader Updating cluster state from ZooKeeper...
[junit4] 2> 151658 INFO (TEST-LeaderFailoverAfterPartitionTest.test-seed#[3EEB70CF45BA7790]) [n:127.0.0.1:39134_vykd%2Fep ] o.a.s.c.c.ZkStateReader Loaded empty cluster properties
[junit4] 2> 151658 INFO (TEST-LeaderFailoverAfterPartitionTest.test-seed#[3EEB70CF45BA7790]) [n:127.0.0.1:39134_vykd%2Fep ] o.a.s.c.c.ZkStateReader Updated live nodes from ZooKeeper... (0) -> (0)
[junit4] 2> 151659 INFO (TEST-LeaderFailoverAfterPartitionTest.test-seed#[3EEB70CF45BA7790]) [n:127.0.0.1:39134_vykd%2Fep ] o.a.s.c.c.SolrZkClient makePath: /overseer_elect
[junit4] 2> 151660 INFO (TEST-LeaderFailoverAfterPartitionTest.test-seed#[3EEB70CF45BA7790]) [n:127.0.0.1:39134_vykd%2Fep ] o.a.s.c.c.SolrZkClient makePath: /overseer_elect/election
[junit4] 2> 151660 INFO (TEST-LeaderFailoverAfterPartitionTest.test-seed#[3EEB70CF45BA7790]) [n:127.0.0.1:39134_vykd%2Fep ] o.a.s.c.Overseer Overseer (id=null) closing
[junit4] 2> 151660 INFO (TEST-LeaderFailoverAfterPartitionTest.test-seed#[3EEB70CF45BA7790]) [n:127.0.0.1:39134_vykd%2Fep ] o.a.s.c.LeaderElector Joined leadership election with path: /overseer_elect/election/96351344273326084-127.0.0.1:39134_vykd%2Fep-n_0000000000
[junit4] 2> 151661 INFO (TEST-LeaderFailoverAfterPartitionTest.test-seed#[3EEB70CF45BA7790]) [n:127.0.0.1:39134_vykd%2Fep ] o.a.s.c.OverseerElectionContext I am going to be the leader 127.0.0.1:39134_vykd%2Fep
[junit4] 2> 151661 INFO (TEST-LeaderFailoverAfterPartitionTest.test-seed#[3EEB70CF45BA7790]) [n:127.0.0.1:39134_vykd%2Fep ] o.a.s.c.c.SolrZkClient makePath: /overseer_elect/leader
[junit4] 2> 151661 INFO (TEST-LeaderFailoverAfterPartitionTest.test-seed#[3EEB70CF45BA7790]) [n:127.0.0.1:39134_vykd%2Fep ] o.a.s.c.Overseer Overseer (id=96351344273326084-127.0.0.1:39134_vykd%2Fep-n_0000000000) starting
[junit4] 2> 151662 INFO (TEST-LeaderFailoverAfterPartitionTest.test-seed#[3EEB70CF45BA7790]) [n:127.0.0.1:39134_vykd%2Fep ] o.a.s.c.c.SolrZkClient makePath: /overseer/queue-work
[junit4] 2> 151665 INFO (TEST-LeaderFailoverAfterPartitionTest.test-seed#[3EEB70CF45BA7790]) [n:127.0.0.1:39134_vykd%2Fep ] o.a.s.c.OverseerAutoReplicaFailoverThread Starting OverseerAutoReplicaFailoverThread autoReplicaFailoverWorkLoopDelay=10000 autoReplicaFailoverWaitAfterExpiration=10000 autoReplicaFailoverBadNodeExpiration=60000
[junit4] 2> 151666 INFO (OverseerCollectionConfigSetProcessor-96351344273326084-127.0.0.1:39134_vykd%2Fep-n_0000000000) [n:127.0.0.1:39134_vykd%2Fep ] o.a.s.c.OverseerTaskProcessor Process current queue of overseer operations
[junit4] 2> 151666 INFO (TEST-LeaderFailoverAfterPartitionTest.test-seed#[3EEB70CF45BA7790]) [n:127.0.0.1:39134_vykd%2Fep ] o.a.s.c.ZkController Register node as live in ZooKeeper:/live_nodes/127.0.0.1:39134_vykd%2Fep
[junit4] 2> 151666 INFO (TEST-LeaderFailoverAfterPartitionTest.test-seed#[3EEB70CF45BA7790]) [n:127.0.0.1:39134_vykd%2Fep ] o.a.s.c.c.SolrZkClient makePath: /live_nodes/127.0.0.1:39134_vykd%2Fep
[junit4] 2> 151666 INFO (OverseerStateUpdate-96351344273326084-127.0.0.1:39134_vykd%2Fep-n_0000000000) [n:127.0.0.1:39134_vykd%2Fep ] o.a.s.c.Overseer Starting to work on the main queue
[junit4] 2> 151669 INFO (zkCallback-220-thread-1-processing-n:127.0.0.1:39134_vykd%2Fep) [n:127.0.0.1:39134_vykd%2Fep ] o.a.s.c.c.ZkStateReader A live node change: [WatchedEvent state:SyncConnected type:NodeChildrenChanged path:/live_nodes], has occurred - updating... (live nodes size: [0])
[junit4] 2> 151674 INFO (OverseerStateUpdate-96351344273326084-127.0.0.1:39134_vykd%2Fep-n_0000000000) [n:127.0.0.1:39134_vykd%2Fep ] o.a.s.c.c.ZkStateReader Updated live nodes from ZooKeeper... (0) -> (1)
[junit4] 2> 151681 INFO (TEST-LeaderFailoverAfterPartitionTest.test-seed#[3EEB70CF45BA7790]) [n:127.0.0.1:39134_vykd%2Fep ] o.a.s.c.CoreContainer Security conf doesn't exist. Skipping setup for authorization module.
[junit4] 2> 151681 INFO (TEST-LeaderFailoverAfterPartitionTest.test-seed#[3EEB70CF45BA7790]) [n:127.0.0.1:39134_vykd%2Fep ] o.a.s.c.CoreContainer No authentication plugin used.
[junit4] 2> 151681 INFO (TEST-LeaderFailoverAfterPartitionTest.test-seed#[3EEB70CF45BA7790]) [n:127.0.0.1:39134_vykd%2Fep ] o.a.s.c.CorePropertiesLocator Looking for core definitions underneath /home/jenkins/workspace/Lucene-Solr-6.x-Linux/solr/build/solr-core/test/J2/temp/solr.cloud.LeaderFailoverAfterPartitionTest_3EEB70CF45BA7790-001/control-001/cores
[junit4] 2> 151682 INFO (TEST-LeaderFailoverAfterPartitionTest.test-seed#[3EEB70CF45BA7790]) [n:127.0.0.1:39134_vykd%2Fep ] o.a.s.c.CoreDescriptor Created CoreDescriptor: {name=collection1, config=solrconfig.xml, transient=false, schema=schema.xml, loadOnStartup=true, configSetProperties=configsetprops.json, collection=control_collection, coreNodeName=, dataDir=data/, shard=}
[junit4] 2> 151682 INFO (TEST-LeaderFailoverAfterPartitionTest.test-seed#[3EEB70CF45BA7790]) [n:127.0.0.1:39134_vykd%2Fep ] o.a.s.c.CorePropertiesLocator Found core collection1 in /home/jenkins/workspace/Lucene-Solr-6.x-Linux/solr/build/solr-core/test/J2/temp/solr.cloud.LeaderFailoverAfterPartitionTest_3EEB70CF45BA7790-001/control-001/cores/collection1
[junit4] 2> 151682 INFO (TEST-LeaderFailoverAfterPartitionTest.test-seed#[3EEB70CF45BA7790]) [n:127.0.0.1:39134_vykd%2Fep ] o.a.s.c.CorePropertiesLocator Found 1 core definitions
[junit4] 2> 151683 INFO (TEST-LeaderFailoverAfterPartitionTest.test-seed#[3EEB70CF45BA7790]) [n:127.0.0.1:39134_vykd%2Fep ] o.a.s.s.SolrDispatchFilter user.dir=/home/jenkins/workspace/Lucene-Solr-6.x-Linux/solr/build/solr-core/test/J2
[junit4] 2> 151683 INFO (TEST-LeaderFailoverAfterPartitionTest.test-seed#[3EEB70CF45BA7790]) [n:127.0.0.1:39134_vykd%2Fep ] o.a.s.s.SolrDispatchFilter SolrDispatchFilter.init() done
[junit4] 2> 151683 INFO (coreLoadExecutor-704-thread-1-processing-n:127.0.0.1:39134_vykd%2Fep) [n:127.0.0.1:39134_vykd%2Fep c:control_collection x:collection1] o.a.s.c.ZkController publishing state=down
[junit4] 2> 151683 INFO (coreLoadExecutor-704-thread-1-processing-n:127.0.0.1:39134_vykd%2Fep) [n:127.0.0.1:39134_vykd%2Fep c:control_collection x:collection1] o.a.s.c.ZkController numShards not found on descriptor - reading it from system property
[junit4] 2> 151691 INFO (coreLoadExecutor-704-thread-1-processing-n:127.0.0.1:39134_vykd%2Fep) [n:127.0.0.1:39134_vykd%2Fep c:control_collection x:collection1] o.a.s.c.ZkController Collection control_collection not visible yet, but flagging it so a watch is registered when it becomes visible
[junit4] 2> 151691 INFO (OverseerStateUpdate-96351344273326084-127.0.0.1:39134_vykd%2Fep-n_0000000000) [n:127.0.0.1:39134_vykd%2Fep ] o.a.s.c.Overseer processMessage: queueSize: 1, message = {
[junit4] 2> "core":"collection1",
[junit4] 2> "roles":null,
[junit4] 2> "base_url":"http://127.0.0.1:39134/vykd/ep",
[junit4] 2> "node_name":"127.0.0.1:39134_vykd%2Fep",
[junit4] 2> "numShards":"1",
[junit4] 2> "state":"down",
[junit4] 2> "shard":null,
[junit4] 2> "collection":"control_collection",
[junit4] 2> "operation":"state"} current state version: 0
[junit4] 2> 151691 INFO (coreLoadExecutor-704-thread-1-processing-n:127.0.0.1:39134_vykd%2Fep) [n:127.0.0.1:39134_vykd%2Fep c:control_collection x:collection1] o.a.s.c.c.ZkStateReader Deleting data for [control_collection]
[junit4] 2> 151692 INFO (OverseerStateUpdate-96351344273326084-127.0.0.1:39134_vykd%2Fep-n_0000000000) [n:127.0.0.1:39134_vykd%2Fep ] o.a.s.c.o.ReplicaMutator Update state numShards=1 message={
[junit4] 2> "core":"collection1",
[junit4] 2> "roles":null,
[junit4] 2> "base_url":"http://127.0.0.1:39134/vykd/ep",
[junit4] 2> "node_name":"127.0.0.1:39134_vykd%2Fep",
[junit4] 2> "numShards":"1",
[junit4] 2> "state":"down",
[junit4] 2> "shard":null,
[junit4] 2> "collection":"control_collection",
[junit4] 2> "operation":"state"}
[junit4] 2> 151692 INFO (OverseerStateUpdate-96351344273326084-127.0.0.1:39134_vykd%2Fep-n_0000000000) [n:127.0.0.1:39134_vykd%2Fep ] o.a.s.c.o.ClusterStateMutator building a new cName: control_collection
[junit4] 2> 151692 INFO (OverseerStateUpdate-96351344273326084-127.0.0.1:39134_vykd%2Fep-n_0000000000) [n:127.0.0.1:39134_vykd%2Fep ] o.a.s.c.o.ReplicaMutator Assigning new node to shard shard=shard1
[junit4] 2> 151693 INFO (coreLoadExecutor-704-thread-1-processing-n:127.0.0.1:39134_vykd%2Fep) [n:127.0.0.1:39134_vykd%2Fep c:control_collection x:collection1] o.a.s.c.ZkController look for our core node name
[junit4] 2> 151694 INFO (zkCallback-220-thread-1-processing-n:127.0.0.1:39134_vykd%2Fep) [n:127.0.0.1:39134_vykd%2Fep ] o.a.s.c.c.ZkStateReader A cluster state change: [WatchedEvent state:SyncConnected type:NodeDataChanged path:/clusterstate.json], has occurred - updating... (live nodes size: [1])
[junit4] 2> 152693 INFO (coreLoadExecutor-704-thread-1-processing-n:127.0.0.1:39134_vykd%2Fep) [n:127.0.0.1:39134_vykd%2Fep c:control_collection x:collection1] o.a.s.c.ZkController waiting to find shard id in clusterstate for collection1
[junit4] 2> 152693 INFO (coreLoadExecutor-704-thread-1-processing-n:127.0.0.1:39134_vykd%2Fep) [n:127.0.0.1:39134_vykd%2Fep c:control_collection x:collection1] o.a.s.c.ZkController Check for collection zkNode:control_collection
[junit4] 2> 152693 INFO (coreLoadExecutor-704-thread-1-processing-n:127.0.0.1:39134_vykd%2Fep) [n:127.0.0.1:39134_vykd%2Fep c:control_collection x:collection1] o.a.s.c.ZkController Collection zkNode exists
[junit4] 2> 152693 INFO (coreLoadExecutor-704-thread-1-processing-n:127.0.0.1:39134_vykd%2Fep) [n:127.0.0.1:39134_vykd%2Fep c:control_collection x:collection1] o.a.s.c.c.ZkStateReader Load collection config from: [/collections/control_collection]
[junit4] 2> 152694 INFO (coreLoadExecutor-704-thread-1-processing-n:127.0.0.1:39134_vykd%2Fep) [n:127.0.0.1:39134_vykd%2Fep c:control_collection x:collection1] o.a.s.c.c.ZkStateReader path=[/collections/control_collection] [configName]=[conf1] specified config exists in ZooKeeper
[junit4] 2> 152694 INFO (coreLoadExecutor-704-thread-1-processing-n:127.0.0.1:39134_vykd%2Fep) [n:127.0.0.1:39134_vykd%2Fep c:control_collection x:collection1] o.a.s.c.SolrResourceLoader new SolrResourceLoader for directory: '/home/jenkins/workspace/Lucene-Solr-6.x-Linux/solr/build/solr-core/test/J2/temp/solr.cloud.LeaderFailoverAfterPartitionTest_3EEB70CF45BA7790-001/control-001/cores/collection1'
[junit4] 2> 152694 INFO (coreLoadExecutor-704-thread-1-processing-n:127.0.0.1:39134_vykd%2Fep) [n:127.0.0.1:39134_vykd%2Fep c:control_collection x:collection1] o.a.s.c.SolrResourceLoader JNDI not configured for solr (NoInitialContextEx)
[junit4] 2> 152694 INFO (coreLoadExecutor-704-thread-1-processing-n:127.0.0.1:39134_vykd%2Fep) [n:127.0.0.1:39134_vykd%2Fep c:control_collection x:collection1] o.a.s.c.SolrResourceLoader solr home defaulted to 'solr/' (could not find system property or JNDI)
[junit4] 2> 152695 INFO (coreLoadExecutor-704-thread-1-processing-n:127.0.0.1:39134_vykd%2Fep) [n:127.0.0.1:39134_vykd%2Fep c:control_collection x:collection1] o.a.s.c.Config loaded config solrconfig.xml with version 0
[junit4] 2> 152699 INFO (coreLoadExecutor-704-thread-1-processing-n:127.0.0.1:39134_vykd%2Fep) [n:127.0.0.1:39134_vykd%2Fep c:control_collection x:collection1] o.a.s.c.SolrConfig current version of requestparams : -1
[junit4] 2> 152702 WARN (coreLoadExecutor-704-thread-1-processing-n:127.0.0.1:39134_vykd%2Fep) [n:127.0.0.1:39134_vykd%2Fep c:control_collection x:collection1] o.a.s.c.Config Beginning with Solr 5.5, <mergePolicy> is deprecated, use <mergePolicyFactory> instead.
[junit4] 2> 152702 INFO (coreLoadExecutor-704-thread-1-processing-n:127.0.0.1:39134_vykd%2Fep) [n:127.0.0.1:39134_vykd%2Fep c:control_collection x:collection1] o.a.s.c.SolrConfig Using Lucene MatchVersion: 6.2.0
[junit4] 2> 152709 INFO (coreLoadExecutor-704-thread-1-processing-n:127.0.0.1:39134_vykd%2Fep) [n:127.0.0.1:39134_vykd%2Fep c:control_collection x:collection1] o.a.s.c.SolrConfig Loaded SolrConfig: solrconfig.xml
[junit4] 2> 152713 INFO (coreLoadExecutor-704-thread-1-processing-n:127.0.0.1:39134_vykd%2Fep) [n:127.0.0.1:39134_vykd%2Fep c:control_collection x:collection1] o.a.s.s.IndexSchema [collection1] Schema name=test
[junit4] 2> 152779 INFO (coreLoadExecutor-704-thread-1-processing-n:127.0.0.1:39134_vykd%2Fep) [n:127.0.0.1:39134_vykd%2Fep c:control_collection x:collection1] o.a.s.s.OpenExchangeRatesOrgProvider Initialized with rates=open-exchange-rates.json, refreshInterval=1440.
[junit4] 2> 152784 INFO (coreLoadExecutor-704-thread-1-processing-n:127.0.0.1:39134_vykd%2Fep) [n:127.0.0.1:39134_vykd%2Fep c:control_collection x:collection1] o.a.s.s.IndexSchema default search field in schema is text
[junit4] 2> 152785 INFO (coreLoadExecutor-704-thread-1-processing-n:127.0.0.1:39134_vykd%2Fep) [n:127.0.0.1:39134_vykd%2Fep c:control_collection x:collection1] o.a.s.s.IndexSchema unique key field: id
[junit4] 2> 152789 INFO (coreLoadExecutor-704-thread-1-processing-n:127.0.0.1:39134_vykd%2Fep) [n:127.0.0.1:39134_vykd%2Fep c:control_collection x:collection1] o.a.s.s.FileExchangeRateProvider Reloading exchange rates from file currency.xml
[junit4] 2> 152791 INFO (coreLoadExecutor-704-thread-1-processing-n:127.0.0.1:39134_vykd%2Fep) [n:127.0.0.1:39134_vykd%2Fep c:control_collection x:collection1] o.a.s.s.FileExchangeRateProvider Reloading exchange rates from file currency.xml
[junit4] 2> 152792 INFO (coreLoadExecutor-704-thread-1-processing-n:127.0.0.1:39134_vykd%2Fep) [n:127.0.0.1:39134_vykd%2Fep c:control_collection x:collection1] o.a.s.s.OpenExchangeRatesOrgProvider Reloading exchange rates from open-exchange-rates.json
[junit4] 2> 152793 INFO (coreLoadExecutor-704-thread-1-processing-n:127.0.0.1:39134_vykd%2Fep) [n:127.0.0.1:39134_vykd%2Fep c:control_collection x:collection1] o.a.s.s.OpenExchangeRatesOrgProvider Reloading exchange rates from open-exchange-rates.json
[junit4] 2> 152794 INFO (coreLoadExecutor-704-thread-1-processing-n:127.0.0.1:39134_vykd%2Fep) [n:127.0.0.1:39134_vykd%2Fep c:control_collection x:collection1] o.a.s.c.ConfigSetProperties Did not find ConfigSet properties, assuming default properties: Can't find resource 'configsetprops.json' in classpath or '/configs/conf1', cwd=/home/jenkins/workspace/Lucene-Solr-6.x-Linux/solr/build/solr-core/test/J2
[junit4] 2> 152794 INFO (coreLoadExecutor-704-thread-1-processing-n:127.0.0.1:39134_vykd%2Fep) [n:127.0.0.1:39134_vykd%2Fep c:control_collection x:collection1] o.a.s.c.CoreContainer Creating SolrCore 'collection1' using configuration from collection control_collection
[junit4] 2> 152794 INFO (coreLoadExecutor-704-thread-1-processing-n:127.0.0.1:39134_vykd%2Fep) [n:127.0.0.1:39134_vykd%2Fep c:control_collection s:shard1 r:core_node1 x:collection1] o.a.s.c.SolrCore org.apache.solr.core.MockDirectoryFactory
[junit4] 2> 152794 INFO (coreLoadExecutor-704-thread-1-processing-n:127.0.0.1:39134_vykd%2Fep) [n:127.0.0.1:39134_vykd%2Fep c:control_collection s:shard1 r:core_node1 x:collection1] o.a.s.c.SolrCore [[collection1] ] Opening new SolrCore at [/home/jenkins/workspace/Lucene-Solr-6.x-Linux/solr/build/solr-core/test/J2/temp/solr.cloud.LeaderFailoverAfterPartitionTest_3EEB70CF45BA7790-001/control-001/cores/collection1], dataDir=[/home/jenkins/workspace/Lucene-Solr-6.x-Linux/solr/build/solr-core/test/J2/temp/solr.cloud.LeaderFailoverAfterPartitionTest_3EEB70CF45BA7790-001/control-001/cores/collection1/data/]
[junit4] 2> 152794 INFO (coreLoadExecutor-704-thread-1-processing-n:127.0.0.1:39134_vykd%2Fep) [n:127.0.0.1:39134_vykd%2Fep c:control_collection s:shard1 r:core_node1 x:collection1] o.a.s.c.JmxMonitoredMap JMX monitoring is enabled. Adding Solr mbeans to JMX Server: com.sun.jmx.mbeanserver.JmxMBeanServer@57e89edb
[junit4] 2> 152794 INFO (coreLoadExecutor-704-thread-1-processing-n:127.0.0.1:39134_vykd%2Fep) [n:127.0.0.1:39134_vykd%2Fep c:control_collection s:shard1 r:core_node1 x:collection1] o.a.s.c.CachingDirectoryFactory return new directory for /home/jenkins/workspace/Lucene-Solr-6.x-Linux/solr/build/solr-core/test/J2/temp/solr.cloud.LeaderFailoverAfterPartitionTest_3EEB70CF45BA7790-001/control-001/cores/collection1/data/snapshot_metadata
[junit4] 2> 152794 INFO (coreLoadExecutor-704-thread-1-processing-n:127.0.0.1:39134_vykd%2Fep) [n:127.0.0.1:39134_vykd%2Fep c:control_collection s:shard1 r:core_node1 x:collection1] o.a.s.c.s.SolrSnapshotMetaDataManager Loading from snapshot metadata file...
[junit4] 2> 152795 INFO (coreLoadExecutor-704-thread-1-processing-n:127.0.0.1:39134_vykd%2Fep) [n:127.0.0.1:39134_vykd%2Fep c:control_collection s:shard1 r:core_node1 x:collection1] o.a.s.c.CachingDirectoryFactory return new directory for /home/jenkins/workspace/Lucene-Solr-6.x-Linux/solr/build/solr-core/test/J2/temp/solr.cloud.LeaderFailoverAfterPartitionTest_3EEB70CF45BA7790-001/control-001/cores/collection1/data
[junit4] 2> 152795 INFO (coreLoadExecutor-704-thread-1-processing-n:127.0.0.1:39134_vykd%2Fep) [n:127.0.0.1:39134_vykd%2Fep c:control_collection s:shard1 r:core_node1 x:collection1] o.a.s.c.SolrCore New index directory detected: old=null new=/home/jenkins/workspace/Lucene-Solr-6.x-Linux/solr/build/solr-core/test/J2/temp/solr.cloud.LeaderFailoverAfterPartitionTest_3EEB70CF45BA7790-001/control-001/cores/collection1/data/index/
[junit4] 2> 152795 WARN (coreLoadExecutor-704-thread-1-processing-n:127.0.0.1:39134_vykd%2Fep) [n:127.0.0.1:39134_vykd%2Fep c:control_collection s:shard1 r:core_node1 x:collection1] o.a.s.c.SolrCore [collection1] Solr index directory '/home/jenkins/workspace/Lucene-Solr-6.x-Linux/solr/build/solr-core/test/J2/temp/solr.cloud.LeaderFailoverAfterPartitionTest_3EEB70CF45BA7790-001/control-001/cores/collection1/data/index' doesn't exist. Creating new index...
[junit4] 2> 152795 INFO (coreLoadExecutor-704-thread-1-processing-n:127.0.0.1:39134_vykd%2Fep) [n:127.0.0.1:39134_vykd%2Fep c:control_collection s:shard1 r:core_node1 x:collection1] o.a.s.c.CachingDirectoryFactory return new directory for /home/jenkins/workspace/Lucene-Solr-6.x-Linux/solr/build/solr-core/test/J2/temp/solr.cloud.LeaderFailoverAfterPartitionTest_3EEB70CF45BA7790-001/control-001/cores/collection1/data/index
[junit4] 2> 152795 INFO (coreLoadExecutor-704-thread-1-processing-n:127.0.0.1:39134_vykd%2Fep) [n:127.0.0.1:39134_vykd%2Fep c:control_collection s:shard1 r:core_node1 x:collection1] o.a.s.u.RandomMergePolicy RandomMergePolicy wrapping class org.apache.lucene.index.AlcoholicMergePolicy: [AlcoholicMergePolicy: minMergeSize=0, mergeFactor=10, maxMergeSize=920768958, maxMergeSizeForForcedMerge=9223372036854775807, calibrateSizeByDeletes=true, maxMergeDocs=2147483647, maxCFSSegmentSizeMB=8.796093022207999E12, noCFSRatio=0.1]
[junit4] 2> 152796 INFO (coreLoadExecutor-704-thread-1-processing-n:127.0.0.1:39134_vykd%2Fep) [n:127.0.0.1:39134_vykd%2Fep c:control_collection s:shard1 r:core_node1 x:collection1] o.a.s.c.SolrDeletionPolicy SolrDeletionPolicy.onCommit: commits: num=1
[junit4] 2> commit{dir=MockDirectoryWrapper(RAMDirectory@67bd8464 lockFactory=org.apache.lucene.store.SingleInstanceLockFactory@6392c91a),segFN=segments_1,generation=1}
[junit4] 2> 152796 INFO (coreLoadExecutor-704-thread-1-processing-n:127.0.0.1:39134_vykd%2Fep) [n:127.0.0.1:39134_vykd%2Fep c:control_collection s:shard1 r:core_node1 x:collection1] o.a.s.c.SolrDeletionPolicy newest commit generation = 1
[junit4] 2> 152796 INFO (OldIndexDirectoryCleanupThreadForCore-collection1) [n:127.0.0.1:39134_vykd%2Fep c:control_collection s:shard1 r:core_node1 x:collection1] o.a.s.c.SolrCore Looking for old index directories to cleanup for core collection1 in /home/jenkins/workspace/Lucene-Solr-6.x-Linux/solr/build/solr-core/test/J2/temp/solr.cloud.LeaderFailoverAfterPartitionTest_3EEB70CF45BA7790-001/control-001/cores/collection1/data/
[junit4] 2> 152796 WARN (OldIndexDirectoryCleanupThreadForCore-collection1) [n:127.0.0.1:39134_vykd%2Fep c:control_collection s:shard1 r:core_node1 x:collection1] o.a.s.c.DirectoryFactory /home/jenkins/workspace/Lucene-Solr-6.x-Linux/solr/build/solr-core/test/J2/temp/solr.cloud.LeaderFailoverAfterPartitionTest_3EEB70CF45BA7790-001/control-001/cores/collection1/data/ does not point to a valid data directory; skipping clean-up of old index directories.
[junit4] 2> 152798 INFO (coreLoadExecutor-704-thread-1-processing-n:127.0.0.1:39134_vykd%2Fep) [n:127.0.0.1:39134_vykd%2Fep c:control_collection s:shard1 r:core_node1 x:collection1] o.a.s.u.p.UpdateRequestProcessorChain creating updateRequestProcessorChain "nodistrib"
[junit4] 2> 152798 INFO (coreLoadExecutor-704-thread-1-processing-n:127.0.0.1:39134_vykd%2Fep) [n:127.0.0.1:39134_vykd%2Fep c:control_collection s:shard1 r:core_node1 x:collection1] o.a.s.u.p.UpdateRequestProcessorChain creating updateRequestProcessorChain "dedupe"
[junit4] 2> 152798 INFO (coreLoadExecutor-704-thread-1-processing-n:127.0.0.1:39134_vykd%2Fep) [n:127.0.0.1:39134_vykd%2Fep c:control_collection s:shard1 r:core_node1 x:collection1] o.a.s.u.p.UpdateRequestProcessorChain inserting DistributedUpdateProcessorFactory into updateRequestProcessorChain "dedupe"
[junit4] 2> 152798 INFO (coreLoadExecutor-704-thread-1-processing-n:127.0.0.1:39134_vykd%2Fep) [n:127.0.0.1:39134_vykd%2Fep c:control_collection s:shard1 r:core_node1 x:collection1] o.a.s.u.p.UpdateRequestProcessorChain creating updateRequestProcessorChain "stored_sig"
[junit4] 2> 152798 INFO (coreLoadExecutor-704-thread-1-processing-n:127.0.0.1:39134_vykd%2Fep) [n:127.0.0.1:39134_vykd%2Fep c:control_collection s:shard1 r:core_node1 x:collection1] o.a.s.u.p.UpdateRequestProcessorChain inserting DistributedUpdateProcessorFactory into updateRequestProcessorChain "stored_sig"
[junit4] 2> 152798 INFO (coreLoadExecutor-704-thread-1-processing-n:127.0.0.1:39134_vykd%2Fep) [n:127.0.0.1:39134_vykd%2Fep c:control_collection s:shard1 r:core_node1 x:collection1] o.a.s.u.p.UpdateRequestProcessorChain creating updateRequestProcessorChain "distrib-dup-test-chain-explicit"
[junit4] 2> 152798 INFO (coreLoadExecutor-704-thread-1-processing-n:127.0.0.1:39134_vykd%2Fep) [n:127.0.0.1:39134_vykd%2Fep c:control_collection s:shard1 r:core_node1 x:collection1] o.a.s.u.p.UpdateRequestProcessorChain creating updateRequestProcessorChain "distrib-dup-test-chain-implicit"
[junit4] 2> 152798 INFO (coreLoadExecutor-704-thread-1-processing-n:127.0.0.1:39134_vykd%2Fep) [n:127.0.0.1:39134_vykd%2Fep c:control_collection s:shard1 r:core_node1 x:collection1] o.a.s.u.p.UpdateRequestProcessorChain inserting DistributedUpdateProcessorFactory into updateRequestProcessorChain "distrib-dup-test-chain-implicit"
[junit4] 2> 152798 INFO (coreLoadExecutor-704-thread-1-processing-n:127.0.0.1:39134_vykd%2Fep) [n:127.0.0.1:39134_vykd%2Fep c:control_collection s:shard1 r:core_node1 x:collection1] o.a.s.c.SolrCore no updateRequestProcessorChain defined as default, creating implicit default
[junit4] 2> 152798 WARN (coreLoadExecutor-704-thread-1-processing-n:127.0.0.1:39134_vykd%2Fep) [n:127.0.0.1:39134_vykd%2Fep c:control_collection s:shard1 r:core_node1 x:collection1] o.a.s.c.RequestHandlers INVALID paramSet a in requestHandler {type = requestHandler,name = /dump,class = DumpRequestHandler,args = {defaults={a=A,b=B}}}
[junit4] 2> 152800 INFO (coreLoadExecutor-704-thread-1-processing-n:127.0.0.1:39134_vykd%2Fep) [n:127.0.0.1:39134_vykd%2Fep c:control_collection s:shard1 r:core_node1 x:collection1] o.a.s.h.l.XMLLoader xsltCacheLifetimeSeconds=60
[junit4] 2> 152801 INFO (coreLoadExecutor-704-thread-1-processing-n:127.0.0.1:39134_vykd%2Fep) [n:127.0.0.1:39134_vykd%2Fep c:control_collection s:shard1 r:core_node1 x:collection1] o.a.s.h.l.XMLLoader xsltCacheLifetimeSeconds=60
[junit4] 2> 152801 INFO (coreLoadExecutor-704-thread-1-processing-n:127.0.0.1:39134_vykd%2Fep) [n:127.0.0.1:39134_vykd%2Fep c:control_collection s:shard1 r:core_node1 x:collection1] o.a.s.h.l.XMLLoader xsltCacheLifetimeSeconds=60
[junit4] 2> 152802 INFO (coreLoadExecutor-704-thread-1-processing-n:127.0.0.1:39134_vykd%2Fep) [n:127.0.0.1:39134_vykd%2Fep c:control_collection s:shard1 r:core_node1 x:collection1] o.a.s.h.l.XMLLoader xsltCacheLifetimeSeconds=60
[junit4] 2> 152804 INFO (coreLoadExecutor-704-thread-1-processing-n:127.0.0.1:39134_vykd%2Fep) [n:127.0.0.1:39134_vykd%2Fep c:control_collection s:shard1 r:core_node1 x:collection1] o.a.s.c.RequestHandlers Registered paths: /admin/mbeans,standard,/update/json/docs,/admin/luke,/export,/get,/admin/properties,/update/json,/admin/threads,/dump,/update/csv,/sql,/graph,/admin/segments,/admin/system,/replication,/config,/stream,/schema,/admin/plugins,/admin/logging,/admin/ping,/update,/admin/file,/terms
[junit4] 2> 152804 INFO (coreLoadExecutor-704-thread-1-processing-n:127.0.0.1:39134_vykd%2Fep) [n:127.0.0.1:39134_vykd%2Fep c:control_collection s:shard1 r:core_node1 x:collection1] o.a.s.c.SolrCore Using default statsCache cache: org.apache.solr.search.stats.LocalStatsCache
[junit4] 2> 152805 INFO (coreLoadExecutor-704-thread-1-processing-n:127.0.0.1:39134_vykd%2Fep) [n:127.0.0.1:39134_vykd%2Fep c:control_collection s:shard1 r:core_node1 x:collection1] o.a.s.u.UpdateHandler Using UpdateLog implementation: org.apache.solr.update.UpdateLog
[junit4] 2> 152805 INFO (coreLoadExecutor-704-thread-1-processing-n:127.0.0.1:39134_vykd%2Fep) [n:127.0.0.1:39134_vykd%2Fep c:control_collection s:shard1 r:core_node1 x:collection1] o.a.s.u.UpdateLog Initializing UpdateLog: dataDir= defaultSyncLevel=FLUSH numRecordsToKeep=100 maxNumLogsToKeep=10 numVersionBuckets=65536
[junit4] 2> 152805 INFO (coreLoadExecutor-704-thread-1-processing-n:127.0.0.1:39134_vykd%2Fep) [n:127.0.0.1:39134_vykd%2Fep c:control_collection s:shard1 r:core_node1 x:collection1] o.a.s.u.CommitTracker Hard AutoCommit: disabled
[junit4] 2> 152805 INFO (coreLoadExecutor-704-thread-1-processing-n:127.0.0.1:39134_vykd%2Fep) [n:127.0.0.1:39134_vykd%2Fep c:control_collection s:shard1 r:core_node1 x:collection1] o.a.s.u.CommitTracker Soft AutoCommit: disabled
[junit4] 2> 152805 INFO (coreLoadExecutor-704-thread-1-processing-n:127.0.0.1:39134_vykd%2Fep) [n:127.0.0.1:39134_vykd%2Fep c:control_collection s:shard1 r:core_node1 x:collection1] o.a.s.u.RandomMergePolicy RandomMergePolicy wrapping class org.apache.lucene.index.LogByteSizeMergePolicy: [LogByteSizeMergePolicy: minMergeSize=1677721, mergeFactor=26, maxMergeSize=2147483648, maxMergeSizeForForcedMerge=9223372036854775807, calibrateSizeByDeletes=true, maxMergeDocs=2147483647, maxCFSSegmentSizeMB=8.796093022207999E12, noCFSRatio=1.0]
[junit4] 2> 152806 INFO (coreLoadExecutor-704-thread-1-processing-n:127.0.0.1:39134_vykd%2Fep) [n:127.0.0.1:39134_vykd%2Fep c:control_collection s:shard1 r:core_node1 x:collection1] o.a.s.c.SolrDeletionPolicy SolrDeletionPolicy.onInit: commits: num=1
[junit4] 2> commit{dir=MockDirectoryWrapper(RAMDirectory@67bd8464 lockFactory=org.apache.lucene.store.SingleInstanceLockFactory@6392c91a),segFN=segments_1,generation=1}
[junit4] 2> 152806 INFO (coreLoadExecutor-704-thread-1-processing-n:127.0.0.1:39134_vykd%2Fep) [n:127.0.0.1:39134_vykd%2Fep c:control_collection s:shard1 r:core_node1 x:collection1] o.a.s.c.SolrDeletionPolicy newest commit generation = 1
[junit4] 2> 152806 INFO (coreLoadExecutor-704-thread-1-processing-n:127.0.0.1:39134_vykd%2Fep) [n:127.0.0.1:39134_vykd%2Fep c:control_collection s:shard1 r:core_node1 x:collection1] o.a.s.s.SolrIndexSearcher Opening [Searcher@6970537a[collection1] main]
[junit4] 2> 152806 INFO (coreLoadExecutor-704-thread-1-processing-n:127.0.0.1:39134_vykd%2Fep) [n:127.0.0.1:39134_vykd%2Fep c:control_collection s:shard1 r:core_node1 x:collection1] o.a.s.c.c.ZkStateReader Load collection config from: [/collections/control_collection]
[junit4] 2> 152806 INFO (coreLoadExecutor-704-thread-1-processing-n:127.0.0.1:39134_vykd%2Fep) [n:127.0.0.1:39134_vykd%2Fep c:control_collection s:shard1 r:core_node1 x:collection1] o.a.s.c.c.ZkStateReader path=[/collections/control_collection] [configName]=[conf1] specified config exists in ZooKeeper
[junit4] 2> 152806 INFO (coreLoadExecutor-704-thread-1-processing-n:127.0.0.1:39134_vykd%2Fep) [n:127.0.0.1:39134_vykd%2Fep c:control_collection s:shard1 r:core_node1 x:collection1] o.a.s.r.ManagedResourceStorage Setting up ZooKeeper-based storage for the RestManager with znodeBase: /configs/conf1
[junit4] 2> 152806 INFO (coreLoadExecutor-704-thread-1-processing-n:127.0.0.1:39134_vykd%2Fep) [n:127.0.0.1:39134_vykd%2Fep c:control_collection s:shard1 r:core_node1 x:collection1] o.a.s.r.ManagedResourceStorage Configured ZooKeeperStorageIO with znodeBase: /configs/conf1
[junit4] 2> 152806 INFO (coreLoadExecutor-704-thread-1-processing-n:127.0.0.1:39134_vykd%2Fep) [n:127.0.0.1:39134_vykd%2Fep c:control_collection s:shard1 r:core_node1 x:collection1] o.a.s.r.RestManager Initializing RestManager with initArgs: {}
[junit4] 2> 152806 INFO (coreLoadExecutor-704-thread-1-processing-n:127.0.0.1:39134_vykd%2Fep) [n:127.0.0.1:39134_vykd%2Fep c:control_collection s:shard1 r:core_node1 x:collection1] o.a.s.r.ManagedResourceStorage Reading _rest_managed.json using ZooKeeperStorageIO:path=/configs/conf1
[junit4] 2> 152807 INFO (coreLoadExecutor-704-thread-1-processing-n:127.0.0.1:39134_vykd%2Fep) [n:127.0.0.1:39134_vykd%2Fep c:control_collection s:shard1 r:core_node1 x:collection1] o.a.s.r.ManagedResourceStorage No data found for znode /configs/conf1/_rest_managed.json
[junit4] 2> 152807 INFO (coreLoadExecutor-704-thread-1-processing-n:127.0.0.1:39134_vykd%2Fep) [n:127.0.0.1:39134_vykd%2Fep c:control_collection s:shard1 r:core_node1 x:collection1] o.a.s.r.ManagedResourceStorage Loaded null at path _rest_managed.json using ZooKeeperStorageIO:path=/configs/conf1
[junit4] 2> 152807 INFO (coreLoadExecutor-704-thread-1-processing-n:127.0.0.1:39134_vykd%2Fep) [n:127.0.0.1:39134_vykd%2Fep c:control_collection s:shard1 r:core_node1 x:collection1] o.a.s.r.RestManager Initializing 0 registered ManagedResources
[junit4] 2> 152807 INFO (coreLoadExecutor-704-thread-1-processing-n:127.0.0.1:39134_vykd%2Fep) [n:127.0.0.1:39134_vykd%2Fep c:control_collection s:shard1 r:core_node1 x:collection1] o.a.s.h.ReplicationHandler Commits will be reserved for 10000
[junit4] 2> 152808 INFO (searcherExecutor-705-thread-1-processing-n:127.0.0.1:39134_vykd%2Fep x:collection1 s:shard1 c:control_collection r:core_node1) [n:127.0.0.1:39134_vykd%2Fep c:control_collection s:shard1 r:core_node1 x:collection1] o.a.s.c.SolrCore [collection1] Registered new searcher Searcher@6970537a[collection1] main{ExitableDirectoryReader(UninvertingDirectoryReader())}
[junit4] 2> 152808 INFO (coreLoadExecutor-704-thread-1-processing-n:127.0.0.1:39134_vykd%2Fep) [n:127.0.0.1:39134_vykd%2Fep c:control_collection s:shard1 r:core_node1 x:collection1] o.a.s.u.UpdateLog Looking up max value of version field to seed version buckets
[junit4] 2> 152808 INFO (coreLoadExecutor-704-thread-1-processing-n:127.0.0.1:39134_vykd%2Fep) [n:127.0.0.1:39134_vykd%2Fep c:control_collection s:shard1 r:core_node1 x:collection1] o.a.s.u.VersionInfo Refreshing highest value of _version_ for 65536 version buckets from index
[junit4] 2> 152808 INFO (coreLoadExecutor-704-thread-1-processing-n:127.0.0.1:39134_vykd%2Fep) [n:127.0.0.1:39134_vykd%2Fep c:control_collection s:shard1 r:core_node1 x:collection1] o.a.s.u.VersionInfo No terms found for _version_, cannot seed version bucket highest value from index
[junit4] 2> 152808 INFO (coreLoadExecutor-704-thread-1-processing-n:127.0.0.1:39134_vykd%2Fep) [n:127.0.0.1:39134_vykd%2Fep c:control_collection s:shard1 r:core_node1 x:collection1] o.a.s.u.UpdateLog Could not find max version in index or recent updates, using new clock 1541621509829689344
[junit4] 2> 152810 INFO (coreLoadExecutor-704-thread-1-processing-n:127.0.0.1:39134_vykd%2Fep) [n:127.0.0.1:39134_vykd%2Fep c:control_collection s:shard1 r:core_node1 x:collection1] o.a.s.u.UpdateLog Took 1.0ms to seed version buckets with highest version 1541621509829689344
[junit4] 2> 152810 INFO (coreLoadExecutor-704-thread-1-processing-n:127.0.0.1:39134_vykd%2Fep) [n:127.0.0.1:39134_vykd%2Fep c:control_collection s:shard1 r:core_node1 x:collection1] o.a.s.c.ZkController watch zkdir /configs/conf1
[junit4] 2> 152810 INFO (coreLoadExecutor-704-thread-1-processing-n:127.0.0.1:39134_vykd%2Fep) [n:127.0.0.1:39134_vykd%2Fep c:control_collection s:shard1 r:core_node1 x:collection1] o.a.s.c.CoreContainer registering core: collection1
[junit4] 2> 152810 INFO (coreZkRegister-698-thread-1-processing-n:127.0.0.1:39134_vykd%2Fep x:collection1 s:shard1 c:control_collection r:core_node1) [n:127.0.0.1:39134_vykd%2Fep c:control_collection s:shard1 r:core_node1 x:collection1] o.a.s.c.ZkController Register replica - core:collection1 address:http://127.0.0.1:39134/vykd/ep collection:control_collection shard:shard1
[junit4] 2> 152811 INFO (coreZkRegister-698-thread-1-processing-n:127.0.0.1:39134_vykd%2Fep x:collection1 s:shard1 c:control_collection r:core_node1) [n:127.0.0.1:39134_vykd%2Fep c:control_collection s:shard1 r:core_node1 x:collection1] o.a.s.c.c.SolrZkClient makePath: /collections/control_collection/leader_elect/shard1/election
[junit4] 2> 152812 INFO (coreZkRegister-698-thread-1-processing-n:127.0.0.1:39134_vykd%2Fep x:collection1 s:shard1 c:control_collection r:core_node1) [n:127.0.0.1:39134_vykd%2Fep c:control_collection s:shard1 r:core_node1 x:collection1] o.a.s.c.LeaderElector Joined leadership election with path: /collections/control_collection/leader_elect/shard1/election/96351344273326084-core_node1-n_0000000000
[junit4] 2> 152812 INFO (coreZkRegister-698-thread-1-processing-n:127.0.0.1:39134_vykd%2Fep x:collection1 s:shard1 c:control_collection r:core_node1) [n:127.0.0.1:39134_vykd%2Fep c:control_collection s:shard1 r:core_node1 x:collection1] o.a.s.c.ShardLeaderElectionContext Running the leader process for shard=shard1 and weAreReplacement=false and leaderVoteWait=10000
[junit4] 2> 152813 INFO (coreZkRegister-698-thread-1-processing-n:127.0.0.1:39134_vykd%2Fep x:collection1 s:shard1 c:control_collection r:core_node1) [n:127.0.0.1:39134_vykd%2Fep c:control_collection s:shard1 r:core_node1 x:collection1] o.a.s.c.ShardLeaderElectionContext Enough replicas found to continue.
[junit4] 2> 152813 INFO (coreZkRegister-698-thread-1-processing-n:127.0.0.1:39134_vykd%2Fep x:collection1 s:shard1 c:control_collection r:core_node1) [n:127.0.0.1:39134_vykd%2Fep c:control_collection s:shard1 r:core_node1 x:collection1] o.a.s.c.ShardLeaderElectionContext I may be the new leader - try and sync
[junit4] 2> 152813 INFO (coreZkRegister-698-thread-1-processing-n:127.0.0.1:39134_vykd%2Fep x:collection1 s:shard1 c:control_collection r:core_node1) [n:127.0.0.1:39134_vykd%2Fep c:control_collection s:shard1 r:core_node1 x:collection1] o.a.s.c.SyncStrategy Sync replicas to http://127.0.0.1:39134/vykd/ep/collection1/
[junit4] 2> 152813 INFO (OverseerStateUpdate-96351344273326084-127.0.0.1:39134_vykd%2Fep-n_0000000000) [n:127.0.0.1:39134_vykd%2Fep ] o.a.s.c.Overseer processMessage: queueSize: 1, message = {
[junit4] 2> "operation":"leader",
[junit4] 2> "shard":"shard1",
[junit4] 2> "collection":"control_collection"} current state version: 1
[junit4] 2> 152813 INFO (coreZkRegister-698-thread-1-processing-n:127.0.0.1:39134_vykd%2Fep x:collection1 s:shard1 c:control_collection r:core_node1) [n:127.0.0.1:39134_vykd%2Fep c:control_collection s:shard1 r:core_node1 x:collection1] o.a.s.c.SyncStrategy Sync Success - now sync replicas to me
[junit4] 2> 152813 INFO (coreZkRegister-698-thread-1-processing-n:127.0.0.1:39134_vykd%2Fep x:collection1 s:shard1 c:control_collection r:core_node1) [n:127.0.0.1:39134_vykd%2Fep c:control_collection s:shard1 r:core_node1 x:collection1] o.a.s.c.SyncStrategy http://127.0.0.1:39134/vykd/ep/collection1/ has no replicas
[junit4] 2> 152813 INFO (coreZkRegister-698-thread-1-processing-n:127.0.0.1:39134_vykd%2Fep x:collection1 s:shard1 c:control_collection r:core_node1) [n:127.0.0.1:39134_vykd%2Fep c:control_collection s:shard1 r:core_node1 x:collection1] o.a.s.c.c.SolrZkClient makePath: /collections/control_collection/leaders/shard1
[junit4] 2> 152817 INFO (coreZkRegister-698-thread-1-processing-n:127.0.0.1:39134_vykd%2Fep x:collection1 s:shard1 c:control_collection r:core_node1) [n:127.0.0.1:39134_vykd%2Fep c:control_collection s:shard1 r:core_node1 x:collection1] o.a.s.c.ShardLeaderElectionContextBase Creating leader registration node /collections/control_collection/leaders/shard1/leader after winning as /collections/control_collection/leader_elect/shard1/election/96351344273326084-core_node1-n_0000000000
[junit4] 2> 152818 INFO (coreZkRegister-698-thread-1-processing-n:127.0.0.1:39134_vykd%2Fep x:collection1 s:shard1 c:control_collection r:core_node1) [n:127.0.0.1:39134_vykd%2Fep c:control_collection s:shard1 r:core_node1 x:collection1] o.a.s.c.ShardLeaderElectionContext I am the new leader: http://127.0.0.1:39134/vykd/ep/collection1/ shard1
[junit4] 2> 152819 INFO (OverseerStateUpdate-96351344273326084-127.0.0.1:39134_vykd%2Fep-n_0000000000) [n:127.0.0.1:39134_vykd%2Fep ] o.a.s.c.Overseer processMessage: queueSize: 1, message = {
[junit4] 2> "operation":"leader",
[junit4] 2> "shard":"shard1",
[junit4] 2> "collection":"control_collection",
[junit4] 2> "base_url":"http://127.0.0.1:39134/vykd/ep",
[junit4] 2> "core":"collection1",
[junit4] 2> "state":"active"} current state version: 1
[junit4] 2> 152920 INFO (zkCallback-220-thread-1-processing-n:127.0.0.1:39134_vykd%2Fep) [n:127.0.0.1:39134_vykd%2Fep ] o.a.s.c.c.ZkStateReader A cluster state change: [WatchedEvent state:SyncConnected type:NodeDataChanged path:/clusterstate.json], has occurred - updating... (live nodes size: [1])
[junit4] 2> 152969 INFO (coreZkRegister-698-thread-1-processing-n:127.0.0.1:39134_vykd%2Fep x:collection1 s:shard1 c:control_collection r:core_node1) [n:127.0.0.1:39134_vykd%2Fep c:control_collection s:shard1 r:core_node1 x:collection1] o.a.s.c.ZkController We are http://127.0.0.1:39134/vykd/ep/collection1/ and leader is http://127.0.0.1:39134/vykd/ep/collection1/
[junit4] 2> 152969 INFO (coreZkRegister-698-thread-1-processing-n:127.0.0.1:39134_vykd%2Fep x:collection1 s:shard1 c:control_collection r:core_node1) [n:127.0.0.1:39134_vykd%2Fep c:control_collection s:shard1 r:core_node1 x:collection1] o.a.s.c.ZkController No LogReplay needed for core=collection1 baseURL=http://127.0.0.1:39134/vykd/ep
[junit4] 2> 152969 INFO (coreZkRegister-698-thread-1-processing-n:127.0.0.1:39134_vykd%2Fep x:collection1 s:shard1 c:control_collection r:core_node1) [n:127.0.0.1:39134_vykd%2Fep c:control_collection s:shard1 r:core_node1 x:collection1] o.a.s.c.ZkController I am the leader, no recovery necessary
[junit4] 2> 152969 INFO (coreZkRegister-698-thread-1-processing-n:127.0.0.1:39134_vykd%2Fep x:collection1 s:shard1 c:control_collection r:core_node1) [n:127.0.0.1:39134_vykd%2Fep c:control_collection s:shard1 r:core_node1 x:collection1] o.a.s.c.ZkController publishing state=active
[junit4] 2> 152969 INFO (coreZkRegister-698-thread-1-processing-n:127.0.0.1:39134_vykd%2Fep x:collection1 s:shard1 c:control_collection r:core_node1) [n:127.0.0.1:39134_vykd%2Fep c:control_collection s:shard1 r:core_node1 x:collection1] o.a.s.c.ZkController numShards not found on descriptor - reading it from system property
[junit4] 2> 152970 INFO (coreZkRegister-698-thread-1-processing-n:127.0.0.1:39134_vykd%2Fep x:collection1 s:shard1 c:control_collection r:core_node1) [n:127.0.0.1:39134_vykd%2Fep c:control_collection s:shard1 r:core_node1 x:collection1] o.a.s.c.c.ZkStateReader Checking legacy cluster state for collection control_collection
[junit4] 2> 152971 INFO (OverseerStateUpdate-96351344273326084-127.0.0.1:39134_vykd%2Fep-n_0000000000) [n:127.0.0.1:39134_vykd%2Fep ] o.a.s.c.Overseer processMessage: queueSize: 1, message = {
[junit4] 2> "core":"collection1",
[junit4] 2> "core_node_name":"core_node1",
[junit4] 2> "roles":null,
[junit4] 2> "base_url":"http://127.0.0.1:39134/vykd/ep",
[junit4] 2> "node_name":"127.0.0.1:39134_vykd%2Fep",
[junit4] 2> "numShards":"1",
[junit4] 2> "state":"active",
[junit4] 2> "shard":"shard1",
[junit4] 2> "collection":"control_collection",
[junit4] 2> "operation":"state"} current state version: 2
[junit4] 2> 152971 INFO (OverseerStateUpdate-96351344273326084-127.0.0.1:39134_vykd%2Fep-n_0000000000) [n:127.0.0.1:39134_vykd%2Fep ] o.a.s.c.o.ReplicaMutator Update state numShards=1 message={
[junit4] 2> "core":"collection1",
[junit4] 2> "core_node_name":"core_node1",
[junit4] 2> "roles":null,
[junit4] 2> "base_url":"http://127.0.0.1:39134/vykd/ep",
[junit4] 2> "node_name":"127.0.0.1:39134_vykd%2Fep",
[junit4] 2> "numShards":"1",
[junit4] 2> "state":"active",
[junit4] 2> "shard":"shard1",
[junit4] 2> "collection":"control_collection",
[junit4] 2> "operation":"state"}
[junit4] 2> 153072 INFO (zkCallback-220-thread-2-processing-n:127.0.0.1:39134_vykd%2Fep) [n:127.0.0.1:39134_vykd%2Fep ] o.a.s.c.c.ZkStateReader A cluster state change: [WatchedEvent state:SyncConnected type:NodeDataChanged path:/clusterstate.json], has occurred - updating... (live nodes size: [1])
[junit4] 2> 153185 INFO (TEST-LeaderFailoverAfterPartitionTest.test-seed#[3EEB70CF45BA7790]) [ ] o.a.s.c.c.SolrZkClient Using default ZkCredentialsProvider
[junit4] 2> 153185 INFO (TEST-LeaderFailoverAfterPartitionTest.test-seed#[3EEB70CF45BA7790]) [ ] o.a.s.c.c.ConnectionManager Waiting for client to connect to ZooKeeper
[junit4] 2> 153186 INFO (zkCallback-224-thread-1) [ ] o.a.s.c.c.ConnectionManager Watcher org.apache.solr.common.cloud.ConnectionManager@22537332 name:ZooKeeperConnection Watcher:127.0.0.1:38526/solr got event WatchedEvent state:SyncConnected type:None path:null path:null type:None
[junit4] 2> 153186 INFO (TEST-LeaderFailoverAfterPartitionTest.test-seed#[3EEB70CF45BA7790]) [ ] o.a.s.c.c.ConnectionManager Client is connected to ZooKeeper
[junit4] 2> 153186 INFO (TEST-LeaderFailoverAfterPartitionTest.test-seed#[3EEB70CF45BA7790]) [ ] o.a.s.c.c.SolrZkClient Using default ZkACLProvider
[junit4] 2> 153186 INFO (TEST-LeaderFailoverAfterPartitionTest.test-seed#[3EEB70CF45BA7790]) [ ] o.a.s.c.c.ZkStateReader Updating cluster state from ZooKeeper...
[junit4] 2> 153187 INFO (TEST-LeaderFailoverAfterPartitionTest.test-seed#[3EEB70CF45BA7790]) [ ] o.a.s.c.c.ZkStateReader Loaded empty cluster properties
[junit4] 2> 153187 INFO (TEST-LeaderFailoverAfterPartitionTest.test-seed#[3EEB70CF45BA7790]) [ ] o.a.s.c.c.ZkStateReader Updated live nodes from ZooKeeper... (0) -> (1)
[junit4] 2> 153187 INFO (TEST-LeaderFailoverAfterPartitionTest.test-seed#[3EEB70CF45BA7790]) [ ] o.a.s.c.ChaosMonkey monkey: init - expire sessions:false cause connection loss:false
[junit4] 2> 153187 INFO (TEST-LeaderFailoverAfterPartitionTest.test-seed#[3EEB70CF45BA7790]) [ ] o.a.s.c.AbstractFullDistribZkTestBase Creating collection1 with stateFormat=2
[junit4] 2> 153188 INFO (TEST-LeaderFailoverAfterPartitionTest.test-seed#[3EEB70CF45BA7790]) [ ] o.a.s.c.c.SolrZkClient Using default ZkCredentialsProvider
[junit4] 2> 153188 INFO (TEST-LeaderFailoverAfterPartitionTest.test-seed#[3EEB70CF45BA7790]) [ ] o.a.s.c.c.ConnectionManager Waiting for client to connect to ZooKeeper
[junit4] 2> 153189 INFO (zkCallback-225-thread-1) [ ] o.a.s.c.c.ConnectionManager Watcher org.apache.solr.common.cloud.ConnectionManager@54e1c9d9 name:ZooKeeperConnection Watcher:127.0.0.1:38526/solr got event WatchedEvent state:SyncConnected type:None path:null path:null type:None
[junit4] 2> 153189 INFO (TEST-LeaderFailoverAfterPartitionTest.test-seed#[3EEB70CF45BA7790]) [ ] o.a.s.c.c.ConnectionManager Client is connected to ZooKeeper
[junit4] 2> 153189 INFO (TEST-LeaderFailoverAfterPartitionTest.test-seed#[3EEB70CF45BA7790]) [ ] o.a.s.c.c.SolrZkClient Using default ZkACLProvider
[junit4] 2> 153192 INFO (OverseerStateUpdate-96351344273326084-127.0.0.1:39134_vykd%2Fep-n_0000000000) [n:127.0.0.1:39134_vykd%2Fep ] o.a.s.c.Overseer processMessage: queueSize: 1, message = {
[junit4] 2> "operation":"create",
[junit4] 2> "name":"collection1",
[junit4] 2> "numShards":"2",
[junit4] 2> "stateFormat":"2"} current state version: 3
[junit4] 2> 153192 INFO (OverseerStateUpdate-96351344273326084-127.0.0.1:39134_vykd%2Fep-n_0000000000) [n:127.0.0.1:39134_vykd%2Fep ] o.a.s.c.o.ClusterStateMutator building a new cName: collection1
[junit4] 2> 153240 INFO (TEST-LeaderFailoverAfterPartitionTest.test-seed#[3EEB70CF45BA7790]) [ ] o.a.s.SolrTestCaseJ4 Writing core.properties file to /home/jenkins/workspace/Lucene-Solr-6.x-Linux/solr/build/solr-core/test/J2/temp/solr.cloud.LeaderFailoverAfterPartitionTest_3EEB70CF45BA7790-001/shard-1-001/cores/collection1
[junit4] 2> 153241 INFO (TEST-LeaderFailoverAfterPartitionTest.test-seed#[3EEB70CF45BA7790]) [ ] o.a.s.c.AbstractFullDistribZkTestBase create jetty 1 in directory /home/jenkins/workspace/Lucene-Solr-6.x-Linux/solr/build/solr-core/test/J2/temp/solr.cloud.LeaderFailoverAfterPartitionTest_3EEB70CF45BA7790-001/shard-1-001
[junit4] 2> 153241 INFO (TEST-LeaderFailoverAfterPartitionTest.test-seed#[3EEB70CF45BA7790]) [ ] o.e.j.s.Server jetty-9.3.8.v20160314
[junit4] 2> 153242 INFO (TEST-LeaderFailoverAfterPartitionTest.test-seed#[3EEB70CF45BA7790]) [ ] o.e.j.s.h.ContextHandler Started o.e.j.s.ServletContextHandler@28bf1a42{/vykd/ep,null,AVAILABLE}
[junit4] 2> 153243 INFO (TEST-LeaderFailoverAfterPartitionTest.test-seed#[3EEB70CF45BA7790]) [ ] o.e.j.s.ServerConnector Started ServerConnector@79bd8b70{HTTP/1.1,[http/1.1]}{127.0.0.1:36253}
[junit4] 2> 153243 INFO (TEST-LeaderFailoverAfterPartitionTest.test-seed#[3EEB70CF45BA7790]) [ ] o.e.j.s.Server Started @155447ms
[junit4] 2> 153243 INFO (TEST-LeaderFailoverAfterPartitionTest.test-seed#[3EEB70CF45BA7790]) [ ] o.a.s.c.s.e.JettySolrRunner Jetty properties: {solr.data.dir=/home/jenkins/workspace/Lucene-Solr-6.x-Linux/solr/build/solr-core/test/J2/temp/solr.cloud.LeaderFailoverAfterPartitionTest_3EEB70CF45BA7790-001/tempDir-001/jetty1, solrconfig=solrconfig.xml, hostContext=/vykd/ep, hostPort=37249, coreRootDirectory=/home/jenkins/workspace/Lucene-Solr-6.x-Linux/solr/build/solr-core/test/J2/temp/solr.cloud.LeaderFailoverAfterPartitionTest_3EEB70CF45BA7790-001/shard-1-001/cores}
[junit4] 2> 153244 INFO (TEST-LeaderFailoverAfterPartitionTest.test-seed#[3EEB70CF45BA7790]) [ ] o.a.s.s.SolrDispatchFilter SolrDispatchFilter.init(): sun.misc.Launcher$AppClassLoader@73d16e93
[junit4] 2> 153244 INFO (TEST-LeaderFailoverAfterPartitionTest.test-seed#[3EEB70CF45BA7790]) [ ] o.a.s.c.SolrResourceLoader new SolrResourceLoader for directory: '/home/jenkins/workspace/Lucene-Solr-6.x-Linux/solr/build/solr-core/test/J2/temp/solr.cloud.LeaderFailoverAfterPartitionTest_3EEB70CF45BA7790-001/shard-1-001'
[junit4] 2> 153244 INFO (TEST-LeaderFailoverAfterPartitionTest.test-seed#[3EEB70CF45BA7790]) [ ] o.a.s.c.SolrResourceLoader JNDI not configured for solr (NoInitialContextEx)
[junit4] 2> 153244 INFO (TEST-LeaderFailoverAfterPartitionTest.test-seed#[3EEB70CF45BA7790]) [ ] o.a.s.c.SolrResourceLoader solr home defaulted to 'solr/' (could not find system property or JNDI)
[junit4] 2> 153244 INFO (TEST-LeaderFailoverAfterPartitionTest.test-seed#[3EEB70CF45BA7790]) [ ] o.a.s.c.c.SolrZkClient Using default ZkCredentialsProvider
[junit4] 2> 153244 INFO (TEST-LeaderFailoverAfterPartitionTest.test-seed#[3EEB70CF45BA7790]) [ ] o.a.s.c.c.ConnectionManager Waiting for client to connect to ZooKeeper
[junit4] 2> 153246 INFO (zkCallback-226-thread-1) [ ] o.a.s.c.c.ConnectionManager Watcher org.apache.solr.common.cloud.ConnectionManager@3fad0083 name:ZooKeeperConnection Watcher:127.0.0.1:38526/solr got event WatchedEvent state:SyncConnected type:None path:null path:null type:None
[junit4] 2> 153246 INFO (TEST-LeaderFailoverAfterPartitionTest.test-seed#[3EEB70CF45BA7790]) [ ] o.a.s.c.c.ConnectionManager Client is connected to ZooKeeper
[junit4] 2> 153246 INFO (TEST-LeaderFailoverAfterPartitionTest.test-seed#[3EEB70CF45BA7790]) [ ] o.a.s.c.c.SolrZkClient Using default ZkACLProvider
[junit4] 2> 153246 INFO (TEST-LeaderFailoverAfterPartitionTest.test-seed#[3EEB70CF45BA7790]) [ ] o.a.s.s.SolrDispatchFilter Loading solr.xml from SolrHome (not found in ZooKeeper)
[junit4] 2> 153247 INFO (TEST-LeaderFailoverAfterPartitionTest.test-seed#[3EEB70CF45BA7790]) [ ] o.a.s.c.SolrXmlConfig Loading container configuration from /home/jenkins/workspace/Lucene-Solr-6.x-Linux/solr/build/solr-core/test/J2/temp/solr.cloud.LeaderFailoverAfterPartitionTest_3EEB70CF45BA7790-001/shard-1-001/solr.xml
[junit4] 2> 153250 INFO (TEST-LeaderFailoverAfterPartitionTest.test-seed#[3EEB70CF45BA7790]) [ ] o.a.s.c.CorePropertiesLocator Config-defined core root directory: /home/jenkins/workspace/Lucene-Solr-6.x-Linux/solr/build/solr-core/test/J2/temp/solr.cloud.LeaderFailoverAfterPartitionTest_3EEB70CF45BA7790-001/shard-1-001/cores
[junit4] 2> 153250 INFO (TEST-LeaderFailoverAfterPartitionTest.test-seed#[3EEB70CF45BA7790]) [ ] o.a.s.c.CoreContainer New CoreContainer 551641863
[junit4] 2> 153250 INFO (TEST-LeaderFailoverAfterPartitionTest.test-seed#[3EEB70CF45BA7790]) [ ] o.a.s.c.CoreContainer Loading cores into CoreContainer [instanceDir=/home/jenkins/workspace/Lucene-Solr-6.x-Linux/solr/build/solr-core/test/J2/temp/solr.cloud.LeaderFailoverAfterPartitionTest_3EEB70CF45BA7790-001/shard-1-001]
[junit4] 2> 153251 WARN (TEST-LeaderFailoverAfterPartitionTest.test-seed#[3EEB70CF45BA7790]) [ ] o.a.s.c.CoreContainer Couldn't add files from /home/jenkins/workspace/Lucene-Solr-6.x-Linux/solr/build/solr-core/test/J2/temp/solr.cloud.LeaderFailoverAfterPartitionTest_3EEB70CF45BA7790-001/shard-1-001/lib to classpath: /home/jenkins/workspace/Lucene-Solr-6.x-Linux/solr/build/solr-core/test/J2/temp/solr.cloud.LeaderFailoverAfterPartitionTest_3EEB70CF45BA7790-001/shard-1-001/lib
[junit4] 2> 153251 INFO (TEST-LeaderFailoverAfterPartitionTest.test-seed#[3EEB70CF45BA7790]) [ ] o.a.s.h.c.HttpShardHandlerFactory created with socketTimeout : 90000,urlScheme : ,connTimeout : 15000,maxConnectionsPerHost : 20,maxConnections : 10000,corePoolSize : 0,maximumPoolSize : 2147483647,maxThreadIdleTime : 5,sizeOfQueue : -1,fairnessPolicy : false,useRetries : false,connectionsEvictorSleepDelay : 5000,maxConnectionIdleTime : 40000,
[junit4] 2> 153252 INFO (TEST-LeaderFailoverAfterPartitionTest.test-seed#[3EEB70CF45BA7790]) [ ] o.a.s.u.UpdateShardHandler Creating UpdateShardHandler HTTP client with params: socketTimeout=340000&connTimeout=45000&retry=true
[junit4] 2> 153252 INFO (TEST-LeaderFailoverAfterPartitionTest.test-seed#[3EEB70CF45BA7790]) [ ] o.a.s.l.LogWatcher SLF4J impl is org.slf4j.impl.Log4jLoggerFactory
[junit4] 2> 153252 INFO (TEST-LeaderFailoverAfterPartitionTest.test-seed#[3EEB70CF45BA7790]) [ ] o.a.s.l.LogWatcher Registering Log Listener [Log4j (org.slf4j.impl.Log4jLoggerFactory)]
[junit4] 2> 153252 INFO (TEST-LeaderFailoverAfterPartitionTest.test-seed#[3EEB70CF45BA7790]) [ ] o.a.s.c.ZkContainer Zookeeper client=127.0.0.1:38526/solr
[junit4] 2> 153252 INFO (TEST-LeaderFailoverAfterPartitionTest.test-seed#[3EEB70CF45BA7790]) [ ] o.a.s.c.ZkController zkHost includes chroot
[junit4] 2> 153252 INFO (TEST-LeaderFailoverAfterPartitionTest.test-seed#[3EEB70CF45BA7790]) [ ] o.a.s.c.c.SolrZkClient Using default ZkCredentialsProvider
[junit4] 2> 153252 INFO (TEST-LeaderFailoverAfterPartitionTest.test-seed#[3EEB70CF45BA7790]) [ ] o.a.s.c.c.ConnectionManager Waiting for client to connect to ZooKeeper
[junit4] 2> 153254 INFO (zkCallback-229-thread-1) [ ] o.a.s.c.c.ConnectionManager Watcher org.apache.solr.common.cloud.ConnectionManager@844352 name:ZooKeeperConnection Watcher:127.0.0.1:38526 got event WatchedEvent state:SyncConnected type:None path:null path:null type:None
[junit4] 2> 153254 INFO (TEST-LeaderFailoverAfterPartitionTest.test-seed#[3EEB70CF45BA7790]) [ ] o.a.s.c.c.ConnectionManager Client is connected to ZooKeeper
[junit4] 2> 153254 INFO (TEST-LeaderFailoverAfterPartitionTest.test-seed#[3EEB70CF45BA7790]) [ ] o.a.s.c.c.SolrZkClient Using default ZkACLProvider
[junit4] 2> 153255 INFO (TEST-LeaderFailoverAfterPartitionTest.test-seed#[3EEB70CF45BA7790]) [n:127.0.0.1:37249_vykd%2Fep ] o.a.s.c.ZkController Added new OnReconnect listener org.apache.solr.cloud.ZkController$$Lambda$107/2073146622@4a784aee
[junit4] 2> 153255 INFO (TEST-LeaderFailoverAfterPartitionTest.test-seed#[3EEB70CF45BA7790]) [n:127.0.0.1:37249_vykd%2Fep ] o.a.s.c.c.ConnectionManager Waiting for client to connect to ZooKeeper
[junit4] 2> 153257 INFO (zkCallback-230-thread-1-processing-n:127.0.0.1:37249_vykd%2Fep) [n:127.0.0.1:37249_vykd%2Fep ] o.a.s.c.c.ConnectionManager Watcher org.apache.solr.common.cloud.ConnectionManager@59d95587 name:ZooKeeperConnection Watcher:127.0.0.1:38526/solr got event WatchedEvent state:SyncConnected type:None path:null path:null type:None
[junit4] 2> 153257 INFO (TEST-LeaderFailoverAfterPartitionTest.test-seed#[3EEB70CF45BA7790]) [n:127.0.0.1:37249_vykd%2Fep ] o.a.s.c.c.ConnectionManager Client is connected to ZooKeeper
[junit4] 2> 153259 INFO (TEST-LeaderFailoverAfterPartitionTest.test-seed#[3EEB70CF45BA7790]) [n:127.0.0.1:37249_vykd%2Fep ] o.a.s.c.c.ZkStateReader Updating cluster state from ZooKeeper...
[junit4] 2> 153259 INFO (TEST-LeaderFailoverAfterPartitionTest.test-seed#[3EEB70CF45BA7790]) [n:127.0.0.1:37249_vykd%2Fep ] o.a.s.c.c.ZkStateReader Loaded empty cluster properties
[junit4] 2> 153259 INFO (TEST-LeaderFailoverAfterPartitionTest.test-seed#[3EEB70CF45BA7790]) [n:127.0.0.1:37249_vykd%2Fep ] o.a.s.c.c.ZkStateReader Updated live nodes from ZooKeeper... (0) -> (1)
[junit4] 2> 153261 INFO (TEST-LeaderFailoverAfterPartitionTest.test-seed#[3EEB70CF45BA7790]) [n:127.0.0.1:37249_vykd%2Fep ] o.a.s.c.Overseer Overseer (id=null) closing
[junit4] 2> 153262 INFO (TEST-LeaderFailoverAfterPartitionTest.test-seed#[3EEB70CF45BA7790]) [n:127.0.0.1:37249_vykd%2Fep ] o.a.s.c.LeaderElector Joined leadership election with path: /overseer_elect/election/96351344273326089-127.0.0.1:37249_vykd%2Fep-n_0000000001
[junit4] 2> 153262 INFO (TEST-LeaderFailoverAfterPartitionTest.test-seed#[3EEB70CF45BA7790]) [n:127.0.0.1:37249_vykd%2Fep ] o.a.s.c.LeaderElector Watching path /overseer_elect/election/96351344273326084-127.0.0.1:39134_vykd%2Fep-n_0000000000 to know if I could be the leader
[junit4] 2> 153262 INFO (TEST-LeaderFailoverAfterPartitionTest.test-seed#[3EEB70CF45BA7790]) [n:127.0.0.1:37249_vykd%2Fep ] o.a.s.c.ZkController Publish node=127.0.0.1:37249_vykd%2Fep as DOWN
[junit4] 2> 153263 INFO (TEST-LeaderFailoverAfterPartitionTest.test-seed#[3EEB70CF45BA7790]) [n:127.0.0.1:37249_vykd%2Fep ] o.a.s.c.ZkController Register node as live in ZooKeeper:/live_nodes/127.0.0.1:37249_vykd%2Fep
[junit4] 2> 153263 INFO (TEST-LeaderFailoverAfterPartitionTest.test-seed#[3EEB70CF45BA7790]) [n:127.0.0.1:37249_vykd%2Fep ] o.a.s.c.c.SolrZkClient makePath: /live_nodes/127.0.0.1:37249_vykd%2Fep
[junit4] 2> 153263 INFO (OverseerStateUpdate-96351344273326084-127.0.0.1:39134_vykd%2Fep-n_0000000000) [n:127.0.0.1:39134_vykd%2Fep ] o.a.s.c.Overseer processMessage: queueSize: 1, message = {
[junit4] 2> "operation":"downnode",
[junit4] 2> "node_name":"127.0.0.1:37249_vykd%2Fep"} current state version: 3
[junit4] 2> 153263 INFO (OverseerStateUpdate-96351344273326084-127.0.0.1:39134_vykd%2Fep-n_0000000000) [n:127.0.0.1:39134_vykd%2Fep ] o.a.s.c.o.NodeMutator DownNode state invoked for node: 127.0.0.1:37249_vykd%2Fep
[junit4] 2> 153263 INFO (zkCallback-230-thread-1-processing-n:127.0.0.1:37249_vykd%2Fep) [n:127.0.0.1:37249_vykd%2Fep ] o.a.s.c.c.ZkStateReader A live node change: [WatchedEvent state:SyncConnected type:NodeChildrenChanged path:/live_nodes], has occurred - updating... (live nodes size: [1])
[junit4] 2> 153263 INFO (zkCallback-224-thread-1) [ ] o.a.s.c.c.ZkStateReader A live node change: [WatchedEvent state:SyncConnected type:NodeChildrenChanged path:/live_nodes], has occurred - updating... (live nodes size: [1])
[junit4] 2> 153263 INFO (zkCallback-220-thread-1-processing-n:127.0.0.1:39134_vykd%2Fep) [n:127.0.0.1:39134_vykd%2Fep ] o.a.s.c.c.ZkStateReader A live node change: [WatchedEvent state:SyncConnected type:NodeChildrenChanged path:/live_nodes], has occurred - updating... (live nodes size: [1])
[junit4] 2> 153263 INFO (OverseerStateUpdate-96351344273326084-127.0.0.1:39134_vykd%2Fep-n_0000000000) [n:127.0.0.1:39134_vykd%2Fep ] o.a.s.c.o.ZkStateWriter going to create_collection /collections/collection1/state.json
[junit4] 2> 153263 INFO (zkCallback-220-thread-1-processing-n:127.0.0.1:39134_vykd%2Fep) [n:127.0.0.1:39134_vykd%2Fep ] o.a.s.c.c.ZkStateReader Updated live nodes from ZooKeeper... (1) -> (2)
[junit4] 2> 153264 INFO (zkCallback-224-thread-1) [ ] o.a.s.c.c.ZkStateReader Updated live nodes from ZooKeeper... (1) -> (2)
[junit4] 2> 153264 INFO (zkCallback-230-thread-1-processing-n:127.0.0.1:37249_vykd%2Fep) [n:127.0.0.1:37249_vykd%2Fep ] o.a.s.c.c.ZkStateReader Updated live nodes from ZooKeeper... (1) -> (2)
[junit4] 2> 153265 INFO (zkCallback-220-thread-1-processing-n:127.0.0.1:39134_vykd%2Fep) [n:127.0.0.1:39134_vykd%2Fep ] o.a.s.c.c.ZkStateReader A cluster state change: [WatchedEvent state:SyncConnected type:NodeDataChanged path:/clusterstate.json], has occurred - updating... (live nodes size: [2])
[junit4] 2> 153265 INFO (zkCallback-224-thread-1) [ ] o.a.s.c.c.ZkStateReader A cluster state change: [WatchedEvent state:SyncConnected type:NodeDataChanged path:/clusterstate.json], has occurred - updating... (live nodes size: [2])
[junit4] 2> 153265 INFO (zkCallback-230-thread-1-processing-n:127.0.0.1:37249_vykd%2Fep) [n:127.0.0.1:37249_vykd%2Fep ] o.a.s.c.c.ZkStateReader A cluster state change: [WatchedEvent state:SyncConnected type:NodeDataChanged path:/clusterstate.json], has occurred - updating... (live nodes size: [2])
[junit4] 2> 153277 INFO (TEST-LeaderFailoverAfterPartitionTest.test-seed#[3EEB70CF45BA7790]) [n:127.0.0.1:37249_vykd%2Fep ] o.a.s.c.CoreContainer Security conf doesn't exist. Skipping setup for authorization module.
[junit4] 2> 153277 INFO (TEST-LeaderFailoverAfterPartitionTest.test-seed#[3EEB70CF45BA7790]) [n:127.0.0.1:37249_vykd%2Fep ] o.a.s.c.CoreContainer No authentication plugin used.
[junit4] 2> 153278 INFO (TEST-LeaderFailoverAfterPartitionTest.test-seed#[3EEB70CF45BA7790]) [n:127.0.0.1:37249_vykd%2Fep ] o.a.s.c.CorePropertiesLocator Looking for core definitions underneath /home/jenkins/workspace/Lucene-Solr-6.x-Linux/solr/build/solr-core/test/J2/temp/solr.cloud.LeaderFailoverAfterPartitionTest_3EEB70CF45BA7790-001/shard-1-001/cores
[junit4] 2> 153278 INFO (TEST-LeaderFailoverAfterPartitionTest.test-seed#[3EEB70CF45BA7790]) [n:127.0.0.1:37249_vykd%2Fep ] o.a.s.c.CoreDescriptor Created CoreDescriptor: {name=collection1, config=solrconfig.xml, transient=false, schema=schema.xml, loadOnStartup=true, configSetProperties=configsetprops.json, collection=collection1, coreNodeName=, dataDir=data/, shard=}
[junit4] 2> 153278 INFO (TEST-LeaderFailoverAfterPartitionTest.test-seed#[3EEB70CF45BA7790]) [n:127.0.0.1:37249_vykd%2Fep ] o.a.s.c.CorePropertiesLocator Found core collection1 in /home/jenkins/workspace/Lucene-Solr-6.x-Linux/solr/build/solr-core/test/J2/temp/solr.cloud.LeaderFailoverAfterPartitionTest_3EEB70CF45BA7790-001/shard-1-001/cores/collection1
[junit4] 2> 153278 INFO (TEST-LeaderFailoverAfterPartitionTest.test-seed#[3EEB70CF45BA7790]) [n:127.0.0.1:37249_vykd%2Fep ] o.a.s.c.CorePropertiesLocator Found 1 core definitions
[junit4] 2> 153280 INFO (TEST-LeaderFailoverAfterPartitionTest.test-seed#[3EEB70CF45BA7790]) [n:127.0.0.1:37249_vykd%2Fep ] o.a.s.s.SolrDispatchFilter user.dir=/home/jenkins/workspace/Lucene-Solr-6.x-Linux/solr/build/solr-core/test/J2
[junit4] 2> 153280 INFO (TEST-LeaderFailoverAfterPartitionTest.test-seed#[3EEB70CF45BA7790]) [n:127.0.0.1:37249_vykd%2Fep ] o.a.s.s.SolrDispatchFilter SolrDispatchFilter.init() done
[junit4] 2> 153280 INFO (coreLoadExecutor-715-thread-1-processing-n:127.0.0.1:37249_vykd%2Fep) [n:127.0.0.1:37249_vykd%2Fep c:collection1 x:collection1] o.a.s.c.ZkController publishing state=down
[junit4] 2> 153280 INFO (coreLoadExecutor-715-thread-1-processing-n:127.0.0.1:37249_vykd%2Fep) [n:127.0.0.1:37249_vykd%2Fep c:collection1 x:collection1] o.a.s.c.ZkController numShards not found on descriptor - reading it fro
[...truncated too long message...]
common.cloud.SolrZkClient$9.execute(SolrZkClient.java:380)
[junit4] 2> at org.apache.solr.common.cloud.ZkCmdExecutor.retryOperation(ZkCmdExecutor.java:60)
[junit4] 2> at org.apache.solr.common.cloud.SolrZkClient.create(SolrZkClient.java:380)
[junit4] 2> at org.apache.solr.cloud.Overseer.createOverseerNode(Overseer.java:1048)
[junit4] 2> ... 20 more
[junit4] 2> 214506 INFO (TEST-LeaderFailoverAfterPartitionTest.test-seed#[3EEB70CF45BA7790]) [ ] o.e.j.s.ServerConnector Stopped ServerConnector@763ed441{HTTP/1.1,[http/1.1]}{127.0.0.1:0}
[junit4] 2> 214506 INFO (TEST-LeaderFailoverAfterPartitionTest.test-seed#[3EEB70CF45BA7790]) [ ] o.e.j.s.h.ContextHandler Stopped o.e.j.s.ServletContextHandler@5cff0b7b{/vykd/ep,null,UNAVAILABLE}
[junit4] 2> 214507 INFO (TEST-LeaderFailoverAfterPartitionTest.test-seed#[3EEB70CF45BA7790]) [ ] o.a.s.c.ChaosMonkey monkey: stop shard! 35402
[junit4] 2> 214507 INFO (TEST-LeaderFailoverAfterPartitionTest.test-seed#[3EEB70CF45BA7790]) [ ] o.a.s.c.ZkTestServer connecting to 127.0.0.1:38526 38526
[junit4] 2> 214620 INFO (Thread-360) [ ] o.a.s.c.ZkTestServer connecting to 127.0.0.1:38526 38526
[junit4] 2> 214621 WARN (Thread-360) [ ] o.a.s.c.ZkTestServer Watch limit violations:
[junit4] 2> Maximum concurrent create/delete watches above limit:
[junit4] 2>
[junit4] 2> 5 /solr/aliases.json
[junit4] 2> 5 /solr/clusterprops.json
[junit4] 2> 4 /solr/security.json
[junit4] 2> 4 /solr/configs/conf1
[junit4] 2>
[junit4] 2> Maximum concurrent data watches above limit:
[junit4] 2>
[junit4] 2> 5 /solr/clusterstate.json
[junit4] 2> 3 /solr/collections/c8n_1x3_lf/state.json
[junit4] 2> 3 /solr/collections/collection1/state.json
[junit4] 2>
[junit4] 2> Maximum concurrent children watches above limit:
[junit4] 2>
[junit4] 2> 60 /solr/overseer/collection-queue-work
[junit4] 2> 37 /solr/overseer/queue
[junit4] 2> 19 /solr/overseer/queue-work
[junit4] 2> 5 /solr/live_nodes
[junit4] 2> 5 /solr/collections
[junit4] 2>
[junit4] 2> 214621 WARN (TEST-LeaderFailoverAfterPartitionTest.test-seed#[3EEB70CF45BA7790]) [ ] o.a.s.c.SocketProxy Closing 0 connections to: http://127.0.0.1:35402/vykd/ep, target: http://127.0.0.1:38083/vykd/ep
[junit4] 2> 214621 WARN (TEST-LeaderFailoverAfterPartitionTest.test-seed#[3EEB70CF45BA7790]) [ ] o.a.s.c.SocketProxy Closing 1 connections to: http://127.0.0.1:36955/vykd/ep, target: http://127.0.0.1:39676/vykd/ep
[junit4] 2> 214621 WARN (TEST-LeaderFailoverAfterPartitionTest.test-seed#[3EEB70CF45BA7790]) [ ] o.a.s.c.SocketProxy Closing 7 connections to: http://127.0.0.1:37249/vykd/ep, target: http://127.0.0.1:36253/vykd/ep
[junit4] 2> 214621 WARN (TEST-LeaderFailoverAfterPartitionTest.test-seed#[3EEB70CF45BA7790]) [ ] o.a.s.c.SocketProxy Closing 5 connections to: http://127.0.0.1:39134/vykd/ep, target: http://127.0.0.1:35591/vykd/ep
[junit4] 2> NOTE: reproduce with: ant test -Dtestcase=LeaderFailoverAfterPartitionTest -Dtests.method=test -Dtests.seed=3EEB70CF45BA7790 -Dtests.multiplier=3 -Dtests.slow=true -Dtests.locale=es-US -Dtests.timezone=Australia/Canberra -Dtests.asserts=true -Dtests.file.encoding=UTF-8
[junit4] ERROR 63.2s J2 | LeaderFailoverAfterPartitionTest.test <<<
[junit4] > Throwable #1: org.apache.solr.client.solrj.impl.CloudSolrClient$RouteException: No live SolrServers available to handle this request:[http://127.0.0.1:35402/vykd/ep/c8n_1x3_lf_shard1_replica1]
[junit4] > at __randomizedtesting.SeedInfo.seed([3EEB70CF45BA7790:B6BF4F15EB461A68]:0)
[junit4] > at org.apache.solr.client.solrj.impl.CloudSolrClient.directUpdate(CloudSolrClient.java:760)
[junit4] > at org.apache.solr.client.solrj.impl.CloudSolrClient.sendRequest(CloudSolrClient.java:1172)
[junit4] > at org.apache.solr.client.solrj.impl.CloudSolrClient.requestWithRetryOnStaleState(CloudSolrClient.java:1061)
[junit4] > at org.apache.solr.client.solrj.impl.CloudSolrClient.request(CloudSolrClient.java:997)
[junit4] > at org.apache.solr.client.solrj.SolrClient.request(SolrClient.java:1219)
[junit4] > at org.apache.solr.cloud.HttpPartitionTest.sendDoc(HttpPartitionTest.java:592)
[junit4] > at org.apache.solr.cloud.HttpPartitionTest.sendDoc(HttpPartitionTest.java:578)
[junit4] > at org.apache.solr.cloud.LeaderFailoverAfterPartitionTest.testRf3WithLeaderFailover(LeaderFailoverAfterPartitionTest.java:174)
[junit4] > at org.apache.solr.cloud.LeaderFailoverAfterPartitionTest.test(LeaderFailoverAfterPartitionTest.java:55)
[junit4] > at org.apache.solr.BaseDistributedSearchTestCase$ShardsRepeatRule$ShardsFixedStatement.callStatement(BaseDistributedSearchTestCase.java:992)
[junit4] > at org.apache.solr.BaseDistributedSearchTestCase$ShardsRepeatRule$ShardsStatement.evaluate(BaseDistributedSearchTestCase.java:967)
[junit4] > at java.lang.Thread.run(Thread.java:745)
[junit4] > Caused by: org.apache.solr.client.solrj.SolrServerException: No live SolrServers available to handle this request:[http://127.0.0.1:35402/vykd/ep/c8n_1x3_lf_shard1_replica1]
[junit4] > at org.apache.solr.client.solrj.impl.LBHttpSolrClient.request(LBHttpSolrClient.java:383)
[junit4] > at org.apache.solr.client.solrj.impl.CloudSolrClient.lambda$directUpdate$0(CloudSolrClient.java:735)
[junit4] > at java.util.concurrent.FutureTask.run(FutureTask.java:266)
[junit4] > at org.apache.solr.common.util.ExecutorUtil$MDCAwareThreadPoolExecutor.lambda$execute$0(ExecutorUtil.java:229)
[junit4] > at java.util.concurrent.ThreadPoolExecutor.runWorker(ThreadPoolExecutor.java:1142)
[junit4] > at java.util.concurrent.ThreadPoolExecutor$Worker.run(ThreadPoolExecutor.java:617)
[junit4] > ... 1 more
[junit4] > Caused by: org.apache.solr.client.solrj.SolrServerException: Server refused connection at: http://127.0.0.1:35402/vykd/ep/c8n_1x3_lf_shard1_replica1
[junit4] > at org.apache.solr.client.solrj.impl.HttpSolrClient.executeMethod(HttpSolrClient.java:599)
[junit4] > at org.apache.solr.client.solrj.impl.HttpSolrClient.request(HttpSolrClient.java:261)
[junit4] > at org.apache.solr.client.solrj.impl.HttpSolrClient.request(HttpSolrClient.java:250)
[junit4] > at org.apache.solr.client.solrj.impl.LBHttpSolrClient.doRequest(LBHttpSolrClient.java:403)
[junit4] > at org.apache.solr.client.solrj.impl.LBHttpSolrClient.request(LBHttpSolrClient.java:356)
[junit4] > ... 6 more
[junit4] > Caused by: java.net.ConnectException: Connection refused
[junit4] > at java.net.PlainSocketImpl.socketConnect(Native Method)
[junit4] > at java.net.AbstractPlainSocketImpl.doConnect(AbstractPlainSocketImpl.java:350)
[junit4] > at java.net.AbstractPlainSocketImpl.connectToAddress(AbstractPlainSocketImpl.java:206)
[junit4] > at java.net.AbstractPlainSocketImpl.connect(AbstractPlainSocketImpl.java:188)
[junit4] > at java.net.SocksSocketImpl.connect(SocksSocketImpl.java:392)
[junit4] > at java.net.Socket.connect(Socket.java:589)
[junit4] > at org.apache.http.conn.scheme.PlainSocketFactory.connectSocket(PlainSocketFactory.java:117)
[junit4] > at org.apache.http.impl.conn.DefaultClientConnectionOperator.openConnection(DefaultClientConnectionOperator.java:177)
[junit4] > at org.apache.http.impl.conn.ManagedClientConnectionImpl.open(ManagedClientConnectionImpl.java:304)
[junit4] > at org.apache.http.impl.client.DefaultRequestDirector.tryConnect(DefaultRequestDirector.java:611)
[junit4] > at org.apache.http.impl.client.DefaultRequestDirector.execute(DefaultRequestDirector.java:446)
[junit4] > at org.apache.http.impl.client.AbstractHttpClient.doExecute(AbstractHttpClient.java:882)
[junit4] > at org.apache.http.impl.client.CloseableHttpClient.execute(CloseableHttpClient.java:82)
[junit4] > at org.apache.http.impl.client.CloseableHttpClient.execute(CloseableHttpClient.java:107)
[junit4] > at org.apache.http.impl.client.CloseableHttpClient.execute(CloseableHttpClient.java:55)
[junit4] > at org.apache.solr.client.solrj.impl.HttpSolrClient.executeMethod(HttpSolrClient.java:497)
[junit4] > ... 10 more
[junit4] 2> 214627 INFO (SUITE-LeaderFailoverAfterPartitionTest-seed#[3EEB70CF45BA7790]-worker) [ ] o.a.s.SolrTestCaseJ4 ###deleteCore
[junit4] 2> NOTE: leaving temporary files on disk at: /home/jenkins/workspace/Lucene-Solr-6.x-Linux/solr/build/solr-core/test/J2/temp/solr.cloud.LeaderFailoverAfterPartitionTest_3EEB70CF45BA7790-001
[junit4] 2> Aug 03, 2016 6:15:01 AM com.carrotsearch.randomizedtesting.ThreadLeakControl checkThreadLeaks
[junit4] 2> WARNING: Will linger awaiting termination of 1 leaked thread(s).
[junit4] 2> NOTE: test params are: codec=Lucene62, sim=ClassicSimilarity, locale=es-US, timezone=Australia/Canberra
[junit4] 2> NOTE: Linux 4.4.0-31-generic amd64/Oracle Corporation 1.8.0_102 (64-bit)/cpus=12,threads=1,free=411995192,total=521142272
[junit4] 2> NOTE: All tests run in this JVM: [ZkStateWriterTest, TestDistributedMissingSort, TestCSVResponseWriter, TestSuggestSpellingConverter, FacetPivotSmallTest, TestManagedSynonymFilterFactory, ExitableDirectoryReaderTest, TestReload, CloudMLTQParserTest, TestUtils, TestTolerantUpdateProcessorRandomCloud, TestCollationFieldDocValues, QueryParsingTest, RecoveryAfterSoftCommitTest, TestImplicitCoreProperties, BlockDirectoryTest, MergeStrategyTest, TestFreeTextSuggestions, DirectSolrConnectionTest, ClusterStateTest, XmlUpdateRequestHandlerTest, PrimitiveFieldTypeTest, SecurityConfHandlerTest, RecoveryZkTest, TestWriterPerf, LeaderFailoverAfterPartitionTest]
[junit4] Completed [63/626 (1!)] on J2 in 63.98s, 1 test, 1 error <<< FAILURES!
[...truncated 61917 lines...]