You are viewing a plain text version of this content. The canonical link for it is here.
Posted to dev@lucene.apache.org by Policeman Jenkins Server <je...@thetaphi.de> on 2017/07/14 15:11:01 UTC
[JENKINS] Lucene-Solr-7.x-Windows (64bit/jdk1.8.0_131) - Build # 40
- Still Unstable!
Build: https://jenkins.thetaphi.de/job/Lucene-Solr-7.x-Windows/40/
Java: 64bit/jdk1.8.0_131 -XX:-UseCompressedOops -XX:+UseSerialGC
1 tests failed.
FAILED: junit.framework.TestSuite.org.apache.solr.servlet.DirectSolrConnectionTest
Error Message:
Could not remove the following files (in the order of attempts): C:\Users\jenkins\workspace\Lucene-Solr-7.x-Windows\solr\build\solr-core\test\J0\temp\solr.servlet.DirectSolrConnectionTest_E448390C8F21B6F2-001\init-core-data-001: java.nio.file.AccessDeniedException: C:\Users\jenkins\workspace\Lucene-Solr-7.x-Windows\solr\build\solr-core\test\J0\temp\solr.servlet.DirectSolrConnectionTest_E448390C8F21B6F2-001\init-core-data-001 C:\Users\jenkins\workspace\Lucene-Solr-7.x-Windows\solr\build\solr-core\test\J0\temp\solr.servlet.DirectSolrConnectionTest_E448390C8F21B6F2-001: java.nio.file.DirectoryNotEmptyException: C:\Users\jenkins\workspace\Lucene-Solr-7.x-Windows\solr\build\solr-core\test\J0\temp\solr.servlet.DirectSolrConnectionTest_E448390C8F21B6F2-001
Stack Trace:
java.io.IOException: Could not remove the following files (in the order of attempts):
C:\Users\jenkins\workspace\Lucene-Solr-7.x-Windows\solr\build\solr-core\test\J0\temp\solr.servlet.DirectSolrConnectionTest_E448390C8F21B6F2-001\init-core-data-001: java.nio.file.AccessDeniedException: C:\Users\jenkins\workspace\Lucene-Solr-7.x-Windows\solr\build\solr-core\test\J0\temp\solr.servlet.DirectSolrConnectionTest_E448390C8F21B6F2-001\init-core-data-001
C:\Users\jenkins\workspace\Lucene-Solr-7.x-Windows\solr\build\solr-core\test\J0\temp\solr.servlet.DirectSolrConnectionTest_E448390C8F21B6F2-001: java.nio.file.DirectoryNotEmptyException: C:\Users\jenkins\workspace\Lucene-Solr-7.x-Windows\solr\build\solr-core\test\J0\temp\solr.servlet.DirectSolrConnectionTest_E448390C8F21B6F2-001
at __randomizedtesting.SeedInfo.seed([E448390C8F21B6F2]:0)
at org.apache.lucene.util.IOUtils.rm(IOUtils.java:329)
at org.apache.lucene.util.TestRuleTemporaryFilesCleanup.afterAlways(TestRuleTemporaryFilesCleanup.java:216)
at com.carrotsearch.randomizedtesting.rules.TestRuleAdapter$1.afterAlways(TestRuleAdapter.java:31)
at com.carrotsearch.randomizedtesting.rules.StatementAdapter.evaluate(StatementAdapter.java:43)
at com.carrotsearch.randomizedtesting.rules.StatementAdapter.evaluate(StatementAdapter.java:36)
at org.apache.lucene.util.TestRuleAssertionsRequired$1.evaluate(TestRuleAssertionsRequired.java:53)
at org.apache.lucene.util.TestRuleMarkFailure$1.evaluate(TestRuleMarkFailure.java:47)
at org.apache.lucene.util.TestRuleIgnoreAfterMaxFailures$1.evaluate(TestRuleIgnoreAfterMaxFailures.java:64)
at org.apache.lucene.util.TestRuleIgnoreTestSuites$1.evaluate(TestRuleIgnoreTestSuites.java:54)
at com.carrotsearch.randomizedtesting.rules.StatementAdapter.evaluate(StatementAdapter.java:36)
at com.carrotsearch.randomizedtesting.ThreadLeakControl$StatementRunner.run(ThreadLeakControl.java:368)
at java.lang.Thread.run(Thread.java:748)
Build Log:
[...truncated 10877 lines...]
[junit4] Suite: org.apache.solr.servlet.DirectSolrConnectionTest
[junit4] 2> Creating dataDir: C:\Users\jenkins\workspace\Lucene-Solr-7.x-Windows\solr\build\solr-core\test\J0\temp\solr.servlet.DirectSolrConnectionTest_E448390C8F21B6F2-001\init-core-data-001
[junit4] 2> 47855 WARN (SUITE-DirectSolrConnectionTest-seed#[E448390C8F21B6F2]-worker) [ ] o.a.s.SolrTestCaseJ4 startTrackingSearchers: numOpens=2 numCloses=2
[junit4] 2> 47855 INFO (SUITE-DirectSolrConnectionTest-seed#[E448390C8F21B6F2]-worker) [ ] o.a.s.SolrTestCaseJ4 Using TrieFields (NUMERIC_POINTS_SYSPROP=false) w/NUMERIC_DOCVALUES_SYSPROP=false
[junit4] 2> 47861 INFO (SUITE-DirectSolrConnectionTest-seed#[E448390C8F21B6F2]-worker) [ ] o.a.s.SolrTestCaseJ4 Randomized ssl (false) and clientAuth (false) via: @org.apache.solr.util.RandomizeSSL(reason=, value=NaN, ssl=NaN, clientAuth=NaN)
[junit4] 2> 47882 INFO (SUITE-DirectSolrConnectionTest-seed#[E448390C8F21B6F2]-worker) [ ] o.a.s.SolrTestCaseJ4 ####initCore
[junit4] 2> 47883 INFO (SUITE-DirectSolrConnectionTest-seed#[E448390C8F21B6F2]-worker) [ ] o.a.s.c.SolrResourceLoader [null] Added 2 libs to classloader, from paths: [/C:/Users/jenkins/workspace/Lucene-Solr-7.x-Windows/solr/core/src/test-files/solr/collection1/lib, /C:/Users/jenkins/workspace/Lucene-Solr-7.x-Windows/solr/core/src/test-files/solr/collection1/lib/classes]
[junit4] 2> 48034 INFO (SUITE-DirectSolrConnectionTest-seed#[E448390C8F21B6F2]-worker) [ ] o.a.s.c.SolrConfig Using Lucene MatchVersion: 7.1.0
[junit4] 2> 48051 INFO (SUITE-DirectSolrConnectionTest-seed#[E448390C8F21B6F2]-worker) [ ] o.a.s.s.IndexSchema [null] Schema name=test
[junit4] 2> 48055 INFO (SUITE-DirectSolrConnectionTest-seed#[E448390C8F21B6F2]-worker) [ ] o.a.s.s.IndexSchema Loaded schema test/1.0 with uniqueid field id
[junit4] 2> 48195 INFO (SUITE-DirectSolrConnectionTest-seed#[E448390C8F21B6F2]-worker) [ ] o.a.s.m.r.SolrJmxReporter JMX monitoring for 'solr.node' (registry 'solr.node') enabled at server: com.sun.jmx.mbeanserver.JmxMBeanServer@3fa7655d
[junit4] 2> 48199 INFO (SUITE-DirectSolrConnectionTest-seed#[E448390C8F21B6F2]-worker) [ ] o.a.s.m.r.SolrJmxReporter JMX monitoring for 'solr.jvm' (registry 'solr.jvm') enabled at server: com.sun.jmx.mbeanserver.JmxMBeanServer@3fa7655d
[junit4] 2> 48200 INFO (SUITE-DirectSolrConnectionTest-seed#[E448390C8F21B6F2]-worker) [ ] o.a.s.m.r.SolrJmxReporter JMX monitoring for 'solr.jetty' (registry 'solr.jetty') enabled at server: com.sun.jmx.mbeanserver.JmxMBeanServer@3fa7655d
[junit4] 2> 48247 INFO (coreLoadExecutor-153-thread-1) [ x:collection1] o.a.s.c.SolrResourceLoader [null] Added 2 libs to classloader, from paths: [/C:/Users/jenkins/workspace/Lucene-Solr-7.x-Windows/solr/core/src/test-files/solr/collection1/lib, /C:/Users/jenkins/workspace/Lucene-Solr-7.x-Windows/solr/core/src/test-files/solr/collection1/lib/classes]
[junit4] 2> 48369 INFO (coreLoadExecutor-153-thread-1) [ x:collection1] o.a.s.c.SolrConfig Using Lucene MatchVersion: 7.1.0
[junit4] 2> 48385 INFO (coreLoadExecutor-153-thread-1) [ x:collection1] o.a.s.s.IndexSchema [collection1] Schema name=test
[junit4] 2> 48387 INFO (coreLoadExecutor-153-thread-1) [ x:collection1] o.a.s.s.IndexSchema Loaded schema test/1.0 with uniqueid field id
[junit4] 2> 48387 INFO (coreLoadExecutor-153-thread-1) [ x:collection1] o.a.s.c.CoreContainer Creating SolrCore 'collection1' using configuration from instancedir C:\Users\jenkins\workspace\Lucene-Solr-7.x-Windows\solr\core\src\test-files\solr\collection1, trusted=true
[junit4] 2> 48387 INFO (coreLoadExecutor-153-thread-1) [ x:collection1] o.a.s.m.r.SolrJmxReporter JMX monitoring for 'solr.core.collection1' (registry 'solr.core.collection1') enabled at server: com.sun.jmx.mbeanserver.JmxMBeanServer@3fa7655d
[junit4] 2> 48393 INFO (coreLoadExecutor-153-thread-1) [ x:collection1] o.a.s.c.SolrCore solr.RecoveryStrategy.Builder
[junit4] 2> 48394 INFO (coreLoadExecutor-153-thread-1) [ x:collection1] o.a.s.c.SolrCore [[collection1] ] Opening new SolrCore at [C:\Users\jenkins\workspace\Lucene-Solr-7.x-Windows\solr\core\src\test-files\solr\collection1], dataDir=[C:\Users\jenkins\workspace\Lucene-Solr-7.x-Windows\solr\build\solr-core\test\J0\temp\solr.servlet.DirectSolrConnectionTest_E448390C8F21B6F2-001\init-core-data-001\]
[junit4] 2> 48402 INFO (coreLoadExecutor-153-thread-1) [ x:collection1] o.a.s.u.RandomMergePolicy RandomMergePolicy wrapping class org.apache.lucene.index.AlcoholicMergePolicy: [AlcoholicMergePolicy: minMergeSize=0, mergeFactor=10, maxMergeSize=1356026879, maxMergeSizeForForcedMerge=9223372036854775807, calibrateSizeByDeletes=true, maxMergeDocs=2147483647, maxCFSSegmentSizeMB=8.796093022207999E12, noCFSRatio=0.1]
[junit4] 2> 48449 INFO (coreLoadExecutor-153-thread-1) [ x:collection1] o.a.s.r.XSLTResponseWriter xsltCacheLifetimeSeconds=60
[junit4] 2> 48529 INFO (coreLoadExecutor-153-thread-1) [ x:collection1] o.a.s.u.CommitTracker Hard AutoCommit: disabled
[junit4] 2> 48529 INFO (coreLoadExecutor-153-thread-1) [ x:collection1] o.a.s.u.CommitTracker Soft AutoCommit: disabled
[junit4] 2> 48531 INFO (coreLoadExecutor-153-thread-1) [ x:collection1] o.a.s.u.RandomMergePolicy RandomMergePolicy wrapping class org.apache.lucene.index.TieredMergePolicy: [TieredMergePolicy: maxMergeAtOnce=34, maxMergeAtOnceExplicit=26, maxMergedSegmentMB=30.83984375, floorSegmentMB=1.4443359375, forceMergeDeletesPctAllowed=1.7293293980655333, segmentsPerTier=11.0, maxCFSSegmentSizeMB=8.796093022207999E12, noCFSRatio=0.19723433054631834
[junit4] 2> 48543 INFO (coreLoadExecutor-153-thread-1) [ x:collection1] o.a.s.s.SolrIndexSearcher Opening [Searcher@75d6741a[collection1] main]
[junit4] 2> 48547 WARN (coreLoadExecutor-153-thread-1) [ x:collection1] o.a.s.r.ManagedResourceStorage Cannot write to config directory C:\Users\jenkins\workspace\Lucene-Solr-7.x-Windows\solr\core\src\test-files\solr\collection1\conf; switching to use InMemory storage instead.
[junit4] 2> 48551 INFO (coreLoadExecutor-153-thread-1) [ x:collection1] o.a.s.h.ReplicationHandler Commits will be reserved for 10000
[junit4] 2> 48553 INFO (searcherExecutor-154-thread-1-processing-x:collection1) [ x:collection1] o.a.s.c.SolrCore [collection1] Registered new searcher Searcher@75d6741a[collection1] main{ExitableDirectoryReader(UninvertingDirectoryReader())}
[junit4] 2> 48555 INFO (SUITE-DirectSolrConnectionTest-seed#[E448390C8F21B6F2]-worker) [ ] o.a.s.SolrTestCaseJ4 ####initCore end
[junit4] 2> 48556 INFO (TEST-DirectSolrConnectionTest.testInsertThenSelect-seed#[E448390C8F21B6F2]) [ ] o.a.s.SolrTestCaseJ4 ###Starting testInsertThenSelect
[junit4] 2> 48561 INFO (TEST-DirectSolrConnectionTest.testInsertThenSelect-seed#[E448390C8F21B6F2]) [ ] o.a.s.u.p.LogUpdateProcessorFactory [collection1] webapp=null path=null params={stream.body=<delete><id>42</id></delete>}{delete=[42]} 0 1
[junit4] 2> 48573 INFO (TEST-DirectSolrConnectionTest.testInsertThenSelect-seed#[E448390C8F21B6F2]) [ ] o.a.s.u.p.LogUpdateProcessorFactory [collection1] webapp=null path=null params={stream.body=<add><doc><field+name%3D"id">42</field><field+name%3D"subject">Kittens!!!+?</field></doc></add>}{add=[42]} 0 11
[junit4] 2> 48574 INFO (TEST-DirectSolrConnectionTest.testInsertThenSelect-seed#[E448390C8F21B6F2]) [ ] o.a.s.u.DirectUpdateHandler2 start commit{,optimize=false,openSearcher=true,waitSearcher=true,expungeDeletes=false,softCommit=false,prepareCommit=false}
[junit4] 2> 48574 INFO (TEST-DirectSolrConnectionTest.testInsertThenSelect-seed#[E448390C8F21B6F2]) [ ] o.a.s.u.SolrIndexWriter Calling setCommitData with IW:org.apache.solr.update.SolrIndexWriter@32e47718 commitCommandVersion:0
[junit4] 2> 48588 INFO (TEST-DirectSolrConnectionTest.testInsertThenSelect-seed#[E448390C8F21B6F2]) [ ] o.a.s.s.SolrIndexSearcher Opening [Searcher@2ae9bb46[collection1] main]
[junit4] 2> 48588 INFO (TEST-DirectSolrConnectionTest.testInsertThenSelect-seed#[E448390C8F21B6F2]) [ ] o.a.s.u.DirectUpdateHandler2 end_commit_flush
[junit4] 2> 48589 INFO (searcherExecutor-154-thread-1) [ ] o.a.s.c.SolrCore [collection1] Registered new searcher Searcher@2ae9bb46[collection1] main{ExitableDirectoryReader(UninvertingDirectoryReader(Uninverting(_0(7.1.0):c1)))}
[junit4] 2> 48589 INFO (TEST-DirectSolrConnectionTest.testInsertThenSelect-seed#[E448390C8F21B6F2]) [ ] o.a.s.u.p.LogUpdateProcessorFactory [collection1] webapp=null path=null params={stream.body=<commit/>}{commit=} 0 15
[junit4] 2> 48613 INFO (TEST-DirectSolrConnectionTest.testInsertThenSelect-seed#[E448390C8F21B6F2]) [ ] o.a.s.c.S.Request [collection1] webapp=null path=null params={q=id:42&wt=xml} hits=1 status=0 QTime=24
[junit4] 2> 48615 INFO (TEST-DirectSolrConnectionTest.testInsertThenSelect-seed#[E448390C8F21B6F2]) [ ] o.a.s.u.p.LogUpdateProcessorFactory [collection1] webapp=null path=null params={}{delete=[42]} 0 0
[junit4] 2> 48616 INFO (TEST-DirectSolrConnectionTest.testInsertThenSelect-seed#[E448390C8F21B6F2]) [ ] o.a.s.u.p.LogUpdateProcessorFactory [collection1] webapp=null path=null params={}{add=[42]} 0 0
[junit4] 2> 48616 INFO (TEST-DirectSolrConnectionTest.testInsertThenSelect-seed#[E448390C8F21B6F2]) [ ] o.a.s.u.DirectUpdateHandler2 start commit{,optimize=false,openSearcher=true,waitSearcher=true,expungeDeletes=false,softCommit=false,prepareCommit=false}
[junit4] 2> 48616 INFO (TEST-DirectSolrConnectionTest.testInsertThenSelect-seed#[E448390C8F21B6F2]) [ ] o.a.s.u.SolrIndexWriter Calling setCommitData with IW:org.apache.solr.update.SolrIndexWriter@32e47718 commitCommandVersion:0
[junit4] 2> 48635 INFO (TEST-DirectSolrConnectionTest.testInsertThenSelect-seed#[E448390C8F21B6F2]) [ ] o.a.s.s.SolrIndexSearcher Opening [Searcher@5c12afc8[collection1] main]
[junit4] 2> 48636 INFO (searcherExecutor-154-thread-1) [ ] o.a.s.c.SolrCore [collection1] Registered new searcher Searcher@5c12afc8[collection1] main{ExitableDirectoryReader(UninvertingDirectoryReader(Uninverting(_1(7.1.0):c1)))}
[junit4] 2> 48636 INFO (TEST-DirectSolrConnectionTest.testInsertThenSelect-seed#[E448390C8F21B6F2]) [ ] o.a.s.u.DirectUpdateHandler2 end_commit_flush
[junit4] 2> 48637 INFO (TEST-DirectSolrConnectionTest.testInsertThenSelect-seed#[E448390C8F21B6F2]) [ ] o.a.s.u.p.LogUpdateProcessorFactory [collection1] webapp=null path=null params={}{commit=} 0 20
[junit4] 2> 48638 INFO (TEST-DirectSolrConnectionTest.testInsertThenSelect-seed#[E448390C8F21B6F2]) [ ] o.a.s.c.S.Request [collection1] webapp=null path=null params={q=id:42&wt=xml} hits=1 status=0 QTime=0
[junit4] 2> 48638 INFO (TEST-DirectSolrConnectionTest.testInsertThenSelect-seed#[E448390C8F21B6F2]) [ ] o.a.s.SolrTestCaseJ4 ###Ending testInsertThenSelect
[junit4] 2> 48639 INFO (TEST-DirectSolrConnectionTest.testSimpleRequest-seed#[E448390C8F21B6F2]) [ ] o.a.s.SolrTestCaseJ4 ###Starting testSimpleRequest
[junit4] 2> 48643 INFO (TEST-DirectSolrConnectionTest.testSimpleRequest-seed#[E448390C8F21B6F2]) [ ] o.a.s.c.S.Request [collection1] webapp=null path=null params={q=*:*&echoParams=explicit&wt=xml&version=2.2} hits=1 status=0 QTime=3
[junit4] 2> 48643 INFO (TEST-DirectSolrConnectionTest.testSimpleRequest-seed#[E448390C8F21B6F2]) [ ] o.a.s.SolrTestCaseJ4 ###Ending testSimpleRequest
[junit4] 2> 48643 INFO (SUITE-DirectSolrConnectionTest-seed#[E448390C8F21B6F2]-worker) [ ] o.a.s.SolrTestCaseJ4 ###deleteCore
[junit4] 2> 48643 INFO (SUITE-DirectSolrConnectionTest-seed#[E448390C8F21B6F2]-worker) [ ] o.a.s.c.CoreContainer Shutting down CoreContainer instance=1877321722
[junit4] 2> 48643 INFO (SUITE-DirectSolrConnectionTest-seed#[E448390C8F21B6F2]-worker) [ ] o.a.s.m.SolrMetricManager Closing metric reporters for registry=solr.node, tag=null
[junit4] 2> 48644 INFO (SUITE-DirectSolrConnectionTest-seed#[E448390C8F21B6F2]-worker) [ ] o.a.s.m.SolrMetricManager Closing metric reporters for registry=solr.jvm, tag=null
[junit4] 2> 48645 INFO (SUITE-DirectSolrConnectionTest-seed#[E448390C8F21B6F2]-worker) [ ] o.a.s.m.SolrMetricManager Closing metric reporters for registry=solr.jetty, tag=null
[junit4] 2> 48645 INFO (SUITE-DirectSolrConnectionTest-seed#[E448390C8F21B6F2]-worker) [ ] o.a.s.c.TransientSolrCoreCacheDefault Allocating transient cache for 2147483647 transient cores
[junit4] 2> 48647 INFO (coreCloseExecutor-158-thread-1) [ x:collection1] o.a.s.c.SolrCore [collection1] CLOSING SolrCore org.apache.solr.core.SolrCore@28bca27b
[junit4] 2> 48649 INFO (coreCloseExecutor-158-thread-1) [ x:collection1] o.a.s.m.SolrMetricManager Closing metric reporters for registry=solr.core.collection1, tag=683451003
[junit4] 2> 48653 INFO (SUITE-DirectSolrConnectionTest-seed#[E448390C8F21B6F2]-worker) [ ] o.a.s.SolrTestCaseJ4 ------------------------------------------------------- Done waiting for tracked resources to be released
[junit4] 2> NOTE: test params are: codec=Lucene70, sim=RandomSimilarity(queryNorm=false): {}, locale=sq, timezone=Asia/Chungking
[junit4] 2> NOTE: Windows 10 10.0 amd64/Oracle Corporation 1.8.0_131 (64-bit)/cpus=3,threads=1,free=42772264,total=108060672
[junit4] 2> NOTE: All tests run in this JVM: [DistributedVersionInfoTest, SoftAutoCommitTest, TestClusterProperties, TestHighFrequencyDictionaryFactory, DirectSolrConnectionTest]
[junit4] 2> NOTE: reproduce with: ant test -Dtestcase=DirectSolrConnectionTest -Dtests.seed=E448390C8F21B6F2 -Dtests.slow=true -Dtests.locale=sq -Dtests.timezone=Asia/Chungking -Dtests.asserts=true -Dtests.file.encoding=ISO-8859-1
[junit4] ERROR 0.00s J0 | DirectSolrConnectionTest (suite) <<<
[junit4] > Throwable #1: java.io.IOException: Could not remove the following files (in the order of attempts):
[junit4] > C:\Users\jenkins\workspace\Lucene-Solr-7.x-Windows\solr\build\solr-core\test\J0\temp\solr.servlet.DirectSolrConnectionTest_E448390C8F21B6F2-001\init-core-data-001: java.nio.file.AccessDeniedException: C:\Users\jenkins\workspace\Lucene-Solr-7.x-Windows\solr\build\solr-core\test\J0\temp\solr.servlet.DirectSolrConnectionTest_E448390C8F21B6F2-001\init-core-data-001
[junit4] > C:\Users\jenkins\workspace\Lucene-Solr-7.x-Windows\solr\build\solr-core\test\J0\temp\solr.servlet.DirectSolrConnectionTest_E448390C8F21B6F2-001: java.nio.file.DirectoryNotEmptyException: C:\Users\jenkins\workspace\Lucene-Solr-7.x-Windows\solr\build\solr-core\test\J0\temp\solr.servlet.DirectSolrConnectionTest_E448390C8F21B6F2-001
[junit4] > at __randomizedtesting.SeedInfo.seed([E448390C8F21B6F2]:0)
[junit4] > at org.apache.lucene.util.IOUtils.rm(IOUtils.java:329)
[junit4] > at java.lang.Thread.run(Thread.java:748)
[junit4] Completed [9/728 (1!)] on J0 in 0.85s, 2 tests, 1 error <<< FAILURES!
[...truncated 45739 lines...]
[JENKINS] Lucene-Solr-7.x-Windows (64bit/jdk1.8.0_131) - Build # 41
- Still Unstable!
Posted by Policeman Jenkins Server <je...@thetaphi.de>.
Build: https://jenkins.thetaphi.de/job/Lucene-Solr-7.x-Windows/41/
Java: 64bit/jdk1.8.0_131 -XX:+UseCompressedOops -XX:+UseConcMarkSweepGC
4 tests failed.
FAILED: org.apache.solr.cloud.OverseerRolesTest.testOverseerRole
Error Message:
Timed out waiting for overseer state change
Stack Trace:
java.lang.AssertionError: Timed out waiting for overseer state change
at __randomizedtesting.SeedInfo.seed([EA68968DD27CEB1A:BA36B19E9CFDDCB]:0)
at org.junit.Assert.fail(Assert.java:93)
at org.apache.solr.cloud.OverseerRolesTest.waitForNewOverseer(OverseerRolesTest.java:62)
at org.apache.solr.cloud.OverseerRolesTest.testOverseerRole(OverseerRolesTest.java:140)
at sun.reflect.NativeMethodAccessorImpl.invoke0(Native Method)
at sun.reflect.NativeMethodAccessorImpl.invoke(NativeMethodAccessorImpl.java:62)
at sun.reflect.DelegatingMethodAccessorImpl.invoke(DelegatingMethodAccessorImpl.java:43)
at java.lang.reflect.Method.invoke(Method.java:498)
at com.carrotsearch.randomizedtesting.RandomizedRunner.invoke(RandomizedRunner.java:1713)
at com.carrotsearch.randomizedtesting.RandomizedRunner$8.evaluate(RandomizedRunner.java:907)
at com.carrotsearch.randomizedtesting.RandomizedRunner$9.evaluate(RandomizedRunner.java:943)
at com.carrotsearch.randomizedtesting.RandomizedRunner$10.evaluate(RandomizedRunner.java:957)
at com.carrotsearch.randomizedtesting.rules.SystemPropertiesRestoreRule$1.evaluate(SystemPropertiesRestoreRule.java:57)
at org.apache.lucene.util.TestRuleSetupTeardownChained$1.evaluate(TestRuleSetupTeardownChained.java:49)
at org.apache.lucene.util.AbstractBeforeAfterRule$1.evaluate(AbstractBeforeAfterRule.java:45)
at org.apache.lucene.util.TestRuleThreadAndTestName$1.evaluate(TestRuleThreadAndTestName.java:48)
at org.apache.lucene.util.TestRuleIgnoreAfterMaxFailures$1.evaluate(TestRuleIgnoreAfterMaxFailures.java:64)
at org.apache.lucene.util.TestRuleMarkFailure$1.evaluate(TestRuleMarkFailure.java:47)
at com.carrotsearch.randomizedtesting.rules.StatementAdapter.evaluate(StatementAdapter.java:36)
at com.carrotsearch.randomizedtesting.ThreadLeakControl$StatementRunner.run(ThreadLeakControl.java:368)
at com.carrotsearch.randomizedtesting.ThreadLeakControl.forkTimeoutingTask(ThreadLeakControl.java:817)
at com.carrotsearch.randomizedtesting.ThreadLeakControl$3.evaluate(ThreadLeakControl.java:468)
at com.carrotsearch.randomizedtesting.RandomizedRunner.runSingleTest(RandomizedRunner.java:916)
at com.carrotsearch.randomizedtesting.RandomizedRunner$5.evaluate(RandomizedRunner.java:802)
at com.carrotsearch.randomizedtesting.RandomizedRunner$6.evaluate(RandomizedRunner.java:852)
at com.carrotsearch.randomizedtesting.RandomizedRunner$7.evaluate(RandomizedRunner.java:863)
at com.carrotsearch.randomizedtesting.rules.StatementAdapter.evaluate(StatementAdapter.java:36)
at com.carrotsearch.randomizedtesting.rules.SystemPropertiesRestoreRule$1.evaluate(SystemPropertiesRestoreRule.java:57)
at org.apache.lucene.util.AbstractBeforeAfterRule$1.evaluate(AbstractBeforeAfterRule.java:45)
at com.carrotsearch.randomizedtesting.rules.StatementAdapter.evaluate(StatementAdapter.java:36)
at org.apache.lucene.util.TestRuleStoreClassName$1.evaluate(TestRuleStoreClassName.java:41)
at com.carrotsearch.randomizedtesting.rules.NoShadowingOrOverridesOnMethodsRule$1.evaluate(NoShadowingOrOverridesOnMethodsRule.java:40)
at com.carrotsearch.randomizedtesting.rules.NoShadowingOrOverridesOnMethodsRule$1.evaluate(NoShadowingOrOverridesOnMethodsRule.java:40)
at com.carrotsearch.randomizedtesting.rules.StatementAdapter.evaluate(StatementAdapter.java:36)
at com.carrotsearch.randomizedtesting.rules.StatementAdapter.evaluate(StatementAdapter.java:36)
at com.carrotsearch.randomizedtesting.rules.StatementAdapter.evaluate(StatementAdapter.java:36)
at org.apache.lucene.util.TestRuleAssertionsRequired$1.evaluate(TestRuleAssertionsRequired.java:53)
at org.apache.lucene.util.TestRuleMarkFailure$1.evaluate(TestRuleMarkFailure.java:47)
at org.apache.lucene.util.TestRuleIgnoreAfterMaxFailures$1.evaluate(TestRuleIgnoreAfterMaxFailures.java:64)
at org.apache.lucene.util.TestRuleIgnoreTestSuites$1.evaluate(TestRuleIgnoreTestSuites.java:54)
at com.carrotsearch.randomizedtesting.rules.StatementAdapter.evaluate(StatementAdapter.java:36)
at com.carrotsearch.randomizedtesting.ThreadLeakControl$StatementRunner.run(ThreadLeakControl.java:368)
at java.lang.Thread.run(Thread.java:748)
FAILED: org.apache.solr.core.ExitableDirectoryReaderTest.testQueryResults
Error Message:
Should NOT have inserted partial results! expected:<5> but was:<6>
Stack Trace:
java.lang.AssertionError: Should NOT have inserted partial results! expected:<5> but was:<6>
at __randomizedtesting.SeedInfo.seed([EA68968DD27CEB1A:B7E1AEF47077B551]:0)
at org.junit.Assert.fail(Assert.java:93)
at org.junit.Assert.failNotEquals(Assert.java:647)
at org.junit.Assert.assertEquals(Assert.java:128)
at org.junit.Assert.assertEquals(Assert.java:472)
at org.apache.solr.core.ExitableDirectoryReaderTest.testQueryResults(ExitableDirectoryReaderTest.java:141)
at sun.reflect.NativeMethodAccessorImpl.invoke0(Native Method)
at sun.reflect.NativeMethodAccessorImpl.invoke(NativeMethodAccessorImpl.java:62)
at sun.reflect.DelegatingMethodAccessorImpl.invoke(DelegatingMethodAccessorImpl.java:43)
at java.lang.reflect.Method.invoke(Method.java:498)
at com.carrotsearch.randomizedtesting.RandomizedRunner.invoke(RandomizedRunner.java:1713)
at com.carrotsearch.randomizedtesting.RandomizedRunner$8.evaluate(RandomizedRunner.java:907)
at com.carrotsearch.randomizedtesting.RandomizedRunner$9.evaluate(RandomizedRunner.java:943)
at com.carrotsearch.randomizedtesting.RandomizedRunner$10.evaluate(RandomizedRunner.java:957)
at com.carrotsearch.randomizedtesting.rules.SystemPropertiesRestoreRule$1.evaluate(SystemPropertiesRestoreRule.java:57)
at org.apache.lucene.util.TestRuleSetupTeardownChained$1.evaluate(TestRuleSetupTeardownChained.java:49)
at org.apache.lucene.util.AbstractBeforeAfterRule$1.evaluate(AbstractBeforeAfterRule.java:45)
at org.apache.lucene.util.TestRuleThreadAndTestName$1.evaluate(TestRuleThreadAndTestName.java:48)
at org.apache.lucene.util.TestRuleIgnoreAfterMaxFailures$1.evaluate(TestRuleIgnoreAfterMaxFailures.java:64)
at org.apache.lucene.util.TestRuleMarkFailure$1.evaluate(TestRuleMarkFailure.java:47)
at com.carrotsearch.randomizedtesting.rules.StatementAdapter.evaluate(StatementAdapter.java:36)
at com.carrotsearch.randomizedtesting.ThreadLeakControl$StatementRunner.run(ThreadLeakControl.java:368)
at com.carrotsearch.randomizedtesting.ThreadLeakControl.forkTimeoutingTask(ThreadLeakControl.java:817)
at com.carrotsearch.randomizedtesting.ThreadLeakControl$3.evaluate(ThreadLeakControl.java:468)
at com.carrotsearch.randomizedtesting.RandomizedRunner.runSingleTest(RandomizedRunner.java:916)
at com.carrotsearch.randomizedtesting.RandomizedRunner$5.evaluate(RandomizedRunner.java:802)
at com.carrotsearch.randomizedtesting.RandomizedRunner$6.evaluate(RandomizedRunner.java:852)
at com.carrotsearch.randomizedtesting.RandomizedRunner$7.evaluate(RandomizedRunner.java:863)
at com.carrotsearch.randomizedtesting.rules.StatementAdapter.evaluate(StatementAdapter.java:36)
at com.carrotsearch.randomizedtesting.rules.SystemPropertiesRestoreRule$1.evaluate(SystemPropertiesRestoreRule.java:57)
at org.apache.lucene.util.AbstractBeforeAfterRule$1.evaluate(AbstractBeforeAfterRule.java:45)
at com.carrotsearch.randomizedtesting.rules.StatementAdapter.evaluate(StatementAdapter.java:36)
at org.apache.lucene.util.TestRuleStoreClassName$1.evaluate(TestRuleStoreClassName.java:41)
at com.carrotsearch.randomizedtesting.rules.NoShadowingOrOverridesOnMethodsRule$1.evaluate(NoShadowingOrOverridesOnMethodsRule.java:40)
at com.carrotsearch.randomizedtesting.rules.NoShadowingOrOverridesOnMethodsRule$1.evaluate(NoShadowingOrOverridesOnMethodsRule.java:40)
at com.carrotsearch.randomizedtesting.rules.StatementAdapter.evaluate(StatementAdapter.java:36)
at com.carrotsearch.randomizedtesting.rules.StatementAdapter.evaluate(StatementAdapter.java:36)
at com.carrotsearch.randomizedtesting.rules.StatementAdapter.evaluate(StatementAdapter.java:36)
at org.apache.lucene.util.TestRuleAssertionsRequired$1.evaluate(TestRuleAssertionsRequired.java:53)
at org.apache.lucene.util.TestRuleMarkFailure$1.evaluate(TestRuleMarkFailure.java:47)
at org.apache.lucene.util.TestRuleIgnoreAfterMaxFailures$1.evaluate(TestRuleIgnoreAfterMaxFailures.java:64)
at org.apache.lucene.util.TestRuleIgnoreTestSuites$1.evaluate(TestRuleIgnoreTestSuites.java:54)
at com.carrotsearch.randomizedtesting.rules.StatementAdapter.evaluate(StatementAdapter.java:36)
at com.carrotsearch.randomizedtesting.ThreadLeakControl$StatementRunner.run(ThreadLeakControl.java:368)
at java.lang.Thread.run(Thread.java:748)
FAILED: junit.framework.TestSuite.org.apache.solr.util.TestSolrCLIRunExample
Error Message:
ObjectTracker found 1 object(s) that were not released!!! [TransactionLog] org.apache.solr.common.util.ObjectReleaseTracker$ObjectTrackerException: org.apache.solr.update.TransactionLog at org.apache.solr.common.util.ObjectReleaseTracker.track(ObjectReleaseTracker.java:42) at org.apache.solr.update.TransactionLog.<init>(TransactionLog.java:190) at org.apache.solr.update.UpdateLog.newTransactionLog(UpdateLog.java:446) at org.apache.solr.update.UpdateLog.ensureLog(UpdateLog.java:1258) at org.apache.solr.update.UpdateLog.add(UpdateLog.java:532) at org.apache.solr.update.UpdateLog.add(UpdateLog.java:517) at org.apache.solr.update.DirectUpdateHandler2.doNormalUpdate(DirectUpdateHandler2.java:347) at org.apache.solr.update.DirectUpdateHandler2.addDoc0(DirectUpdateHandler2.java:266) at org.apache.solr.update.DirectUpdateHandler2.addDoc(DirectUpdateHandler2.java:216) at org.apache.solr.update.processor.RunUpdateProcessor.processAdd(RunUpdateProcessorFactory.java:67) at org.apache.solr.update.processor.UpdateRequestProcessor.processAdd(UpdateRequestProcessor.java:55) at org.apache.solr.update.processor.DistributedUpdateProcessor.doLocalAdd(DistributedUpdateProcessor.java:990) at org.apache.solr.update.processor.DistributedUpdateProcessor.versionAdd(DistributedUpdateProcessor.java:1206) at org.apache.solr.update.processor.DistributedUpdateProcessor.processAdd(DistributedUpdateProcessor.java:752) at org.apache.solr.update.processor.LogUpdateProcessorFactory$LogUpdateProcessor.processAdd(LogUpdateProcessorFactory.java:103) at org.apache.solr.update.processor.UpdateRequestProcessor.processAdd(UpdateRequestProcessor.java:55) at org.apache.solr.update.processor.AddSchemaFieldsUpdateProcessorFactory$AddSchemaFieldsUpdateProcessor.processAdd(AddSchemaFieldsUpdateProcessorFactory.java:474) at org.apache.solr.update.processor.UpdateRequestProcessor.processAdd(UpdateRequestProcessor.java:55) at org.apache.solr.update.processor.FieldMutatingUpdateProcessor.processAdd(FieldMutatingUpdateProcessor.java:118) at org.apache.solr.update.processor.UpdateRequestProcessor.processAdd(UpdateRequestProcessor.java:55) at org.apache.solr.update.processor.FieldMutatingUpdateProcessor.processAdd(FieldMutatingUpdateProcessor.java:118) at org.apache.solr.update.processor.UpdateRequestProcessor.processAdd(UpdateRequestProcessor.java:55) at org.apache.solr.update.processor.FieldMutatingUpdateProcessor.processAdd(FieldMutatingUpdateProcessor.java:118) at org.apache.solr.update.processor.UpdateRequestProcessor.processAdd(UpdateRequestProcessor.java:55) at org.apache.solr.update.processor.FieldMutatingUpdateProcessor.processAdd(FieldMutatingUpdateProcessor.java:118) at org.apache.solr.update.processor.UpdateRequestProcessor.processAdd(UpdateRequestProcessor.java:55) at org.apache.solr.update.processor.FieldNameMutatingUpdateProcessorFactory$1.processAdd(FieldNameMutatingUpdateProcessorFactory.java:74) at org.apache.solr.update.processor.UpdateRequestProcessor.processAdd(UpdateRequestProcessor.java:55) at org.apache.solr.update.processor.FieldMutatingUpdateProcessor.processAdd(FieldMutatingUpdateProcessor.java:118) at org.apache.solr.update.processor.UpdateRequestProcessor.processAdd(UpdateRequestProcessor.java:55) at org.apache.solr.update.processor.AbstractDefaultValueUpdateProcessorFactory$DefaultValueUpdateProcessor.processAdd(AbstractDefaultValueUpdateProcessorFactory.java:91) at org.apache.solr.handler.loader.JavabinLoader$1.update(JavabinLoader.java:98) at org.apache.solr.client.solrj.request.JavaBinUpdateRequestCodec$1.readOuterMostDocIterator(JavaBinUpdateRequestCodec.java:188) at org.apache.solr.client.solrj.request.JavaBinUpdateRequestCodec$1.readIterator(JavaBinUpdateRequestCodec.java:144) at org.apache.solr.common.util.JavaBinCodec.readObject(JavaBinCodec.java:311) at org.apache.solr.common.util.JavaBinCodec.readVal(JavaBinCodec.java:256) at org.apache.solr.client.solrj.request.JavaBinUpdateRequestCodec$1.readNamedList(JavaBinUpdateRequestCodec.java:130) at org.apache.solr.common.util.JavaBinCodec.readObject(JavaBinCodec.java:276) at org.apache.solr.common.util.JavaBinCodec.readVal(JavaBinCodec.java:256) at org.apache.solr.common.util.JavaBinCodec.unmarshal(JavaBinCodec.java:178) at org.apache.solr.client.solrj.request.JavaBinUpdateRequestCodec.unmarshal(JavaBinUpdateRequestCodec.java:195) at org.apache.solr.handler.loader.JavabinLoader.parseAndLoadDocs(JavabinLoader.java:108) at org.apache.solr.handler.loader.JavabinLoader.load(JavabinLoader.java:55) at org.apache.solr.handler.UpdateRequestHandler$1.load(UpdateRequestHandler.java:97) at org.apache.solr.handler.ContentStreamHandlerBase.handleRequestBody(ContentStreamHandlerBase.java:68) at org.apache.solr.handler.RequestHandlerBase.handleRequest(RequestHandlerBase.java:177) at org.apache.solr.core.SolrCore.execute(SolrCore.java:2473) at org.apache.solr.servlet.HttpSolrCall.execute(HttpSolrCall.java:720) at org.apache.solr.servlet.HttpSolrCall.call(HttpSolrCall.java:526) at org.apache.solr.servlet.SolrDispatchFilter.doFilter(SolrDispatchFilter.java:378) at org.apache.solr.servlet.SolrDispatchFilter.doFilter(SolrDispatchFilter.java:322) at org.eclipse.jetty.servlet.ServletHandler$CachedChain.doFilter(ServletHandler.java:1699) at org.apache.solr.client.solrj.embedded.JettySolrRunner$DebugFilter.doFilter(JettySolrRunner.java:139) at org.eclipse.jetty.servlet.ServletHandler$CachedChain.doFilter(ServletHandler.java:1699) at org.eclipse.jetty.servlet.ServletHandler.doHandle(ServletHandler.java:582) at org.eclipse.jetty.server.session.SessionHandler.doHandle(SessionHandler.java:224) at org.eclipse.jetty.server.handler.ContextHandler.doHandle(ContextHandler.java:1180) at org.eclipse.jetty.servlet.ServletHandler.doScope(ServletHandler.java:512) at org.eclipse.jetty.server.session.SessionHandler.doScope(SessionHandler.java:185) at org.eclipse.jetty.server.handler.ContextHandler.doScope(ContextHandler.java:1112) at org.eclipse.jetty.server.handler.ScopedHandler.handle(ScopedHandler.java:141) at org.eclipse.jetty.server.handler.gzip.GzipHandler.handle(GzipHandler.java:395) at org.eclipse.jetty.server.handler.HandlerWrapper.handle(HandlerWrapper.java:134) at org.eclipse.jetty.server.Server.handle(Server.java:534) at org.eclipse.jetty.server.HttpChannel.handle(HttpChannel.java:320) at org.eclipse.jetty.server.HttpConnection.onFillable(HttpConnection.java:251) at org.eclipse.jetty.io.AbstractConnection$ReadCallback.succeeded(AbstractConnection.java:273) at org.eclipse.jetty.io.FillInterest.fillable(FillInterest.java:95) at org.eclipse.jetty.io.SelectChannelEndPoint$2.run(SelectChannelEndPoint.java:93) at org.eclipse.jetty.util.thread.strategy.ExecuteProduceConsume.executeProduceConsume(ExecuteProduceConsume.java:303) at org.eclipse.jetty.util.thread.strategy.ExecuteProduceConsume.produceConsume(ExecuteProduceConsume.java:148) at org.eclipse.jetty.util.thread.strategy.ExecuteProduceConsume.run(ExecuteProduceConsume.java:136) at org.eclipse.jetty.util.thread.QueuedThreadPool.runJob(QueuedThreadPool.java:671) at org.eclipse.jetty.util.thread.QueuedThreadPool$2.run(QueuedThreadPool.java:589) at java.lang.Thread.run(Thread.java:748)
Stack Trace:
java.lang.AssertionError: ObjectTracker found 1 object(s) that were not released!!! [TransactionLog]
org.apache.solr.common.util.ObjectReleaseTracker$ObjectTrackerException: org.apache.solr.update.TransactionLog
at org.apache.solr.common.util.ObjectReleaseTracker.track(ObjectReleaseTracker.java:42)
at org.apache.solr.update.TransactionLog.<init>(TransactionLog.java:190)
at org.apache.solr.update.UpdateLog.newTransactionLog(UpdateLog.java:446)
at org.apache.solr.update.UpdateLog.ensureLog(UpdateLog.java:1258)
at org.apache.solr.update.UpdateLog.add(UpdateLog.java:532)
at org.apache.solr.update.UpdateLog.add(UpdateLog.java:517)
at org.apache.solr.update.DirectUpdateHandler2.doNormalUpdate(DirectUpdateHandler2.java:347)
at org.apache.solr.update.DirectUpdateHandler2.addDoc0(DirectUpdateHandler2.java:266)
at org.apache.solr.update.DirectUpdateHandler2.addDoc(DirectUpdateHandler2.java:216)
at org.apache.solr.update.processor.RunUpdateProcessor.processAdd(RunUpdateProcessorFactory.java:67)
at org.apache.solr.update.processor.UpdateRequestProcessor.processAdd(UpdateRequestProcessor.java:55)
at org.apache.solr.update.processor.DistributedUpdateProcessor.doLocalAdd(DistributedUpdateProcessor.java:990)
at org.apache.solr.update.processor.DistributedUpdateProcessor.versionAdd(DistributedUpdateProcessor.java:1206)
at org.apache.solr.update.processor.DistributedUpdateProcessor.processAdd(DistributedUpdateProcessor.java:752)
at org.apache.solr.update.processor.LogUpdateProcessorFactory$LogUpdateProcessor.processAdd(LogUpdateProcessorFactory.java:103)
at org.apache.solr.update.processor.UpdateRequestProcessor.processAdd(UpdateRequestProcessor.java:55)
at org.apache.solr.update.processor.AddSchemaFieldsUpdateProcessorFactory$AddSchemaFieldsUpdateProcessor.processAdd(AddSchemaFieldsUpdateProcessorFactory.java:474)
at org.apache.solr.update.processor.UpdateRequestProcessor.processAdd(UpdateRequestProcessor.java:55)
at org.apache.solr.update.processor.FieldMutatingUpdateProcessor.processAdd(FieldMutatingUpdateProcessor.java:118)
at org.apache.solr.update.processor.UpdateRequestProcessor.processAdd(UpdateRequestProcessor.java:55)
at org.apache.solr.update.processor.FieldMutatingUpdateProcessor.processAdd(FieldMutatingUpdateProcessor.java:118)
at org.apache.solr.update.processor.UpdateRequestProcessor.processAdd(UpdateRequestProcessor.java:55)
at org.apache.solr.update.processor.FieldMutatingUpdateProcessor.processAdd(FieldMutatingUpdateProcessor.java:118)
at org.apache.solr.update.processor.UpdateRequestProcessor.processAdd(UpdateRequestProcessor.java:55)
at org.apache.solr.update.processor.FieldMutatingUpdateProcessor.processAdd(FieldMutatingUpdateProcessor.java:118)
at org.apache.solr.update.processor.UpdateRequestProcessor.processAdd(UpdateRequestProcessor.java:55)
at org.apache.solr.update.processor.FieldNameMutatingUpdateProcessorFactory$1.processAdd(FieldNameMutatingUpdateProcessorFactory.java:74)
at org.apache.solr.update.processor.UpdateRequestProcessor.processAdd(UpdateRequestProcessor.java:55)
at org.apache.solr.update.processor.FieldMutatingUpdateProcessor.processAdd(FieldMutatingUpdateProcessor.java:118)
at org.apache.solr.update.processor.UpdateRequestProcessor.processAdd(UpdateRequestProcessor.java:55)
at org.apache.solr.update.processor.AbstractDefaultValueUpdateProcessorFactory$DefaultValueUpdateProcessor.processAdd(AbstractDefaultValueUpdateProcessorFactory.java:91)
at org.apache.solr.handler.loader.JavabinLoader$1.update(JavabinLoader.java:98)
at org.apache.solr.client.solrj.request.JavaBinUpdateRequestCodec$1.readOuterMostDocIterator(JavaBinUpdateRequestCodec.java:188)
at org.apache.solr.client.solrj.request.JavaBinUpdateRequestCodec$1.readIterator(JavaBinUpdateRequestCodec.java:144)
at org.apache.solr.common.util.JavaBinCodec.readObject(JavaBinCodec.java:311)
at org.apache.solr.common.util.JavaBinCodec.readVal(JavaBinCodec.java:256)
at org.apache.solr.client.solrj.request.JavaBinUpdateRequestCodec$1.readNamedList(JavaBinUpdateRequestCodec.java:130)
at org.apache.solr.common.util.JavaBinCodec.readObject(JavaBinCodec.java:276)
at org.apache.solr.common.util.JavaBinCodec.readVal(JavaBinCodec.java:256)
at org.apache.solr.common.util.JavaBinCodec.unmarshal(JavaBinCodec.java:178)
at org.apache.solr.client.solrj.request.JavaBinUpdateRequestCodec.unmarshal(JavaBinUpdateRequestCodec.java:195)
at org.apache.solr.handler.loader.JavabinLoader.parseAndLoadDocs(JavabinLoader.java:108)
at org.apache.solr.handler.loader.JavabinLoader.load(JavabinLoader.java:55)
at org.apache.solr.handler.UpdateRequestHandler$1.load(UpdateRequestHandler.java:97)
at org.apache.solr.handler.ContentStreamHandlerBase.handleRequestBody(ContentStreamHandlerBase.java:68)
at org.apache.solr.handler.RequestHandlerBase.handleRequest(RequestHandlerBase.java:177)
at org.apache.solr.core.SolrCore.execute(SolrCore.java:2473)
at org.apache.solr.servlet.HttpSolrCall.execute(HttpSolrCall.java:720)
at org.apache.solr.servlet.HttpSolrCall.call(HttpSolrCall.java:526)
at org.apache.solr.servlet.SolrDispatchFilter.doFilter(SolrDispatchFilter.java:378)
at org.apache.solr.servlet.SolrDispatchFilter.doFilter(SolrDispatchFilter.java:322)
at org.eclipse.jetty.servlet.ServletHandler$CachedChain.doFilter(ServletHandler.java:1699)
at org.apache.solr.client.solrj.embedded.JettySolrRunner$DebugFilter.doFilter(JettySolrRunner.java:139)
at org.eclipse.jetty.servlet.ServletHandler$CachedChain.doFilter(ServletHandler.java:1699)
at org.eclipse.jetty.servlet.ServletHandler.doHandle(ServletHandler.java:582)
at org.eclipse.jetty.server.session.SessionHandler.doHandle(SessionHandler.java:224)
at org.eclipse.jetty.server.handler.ContextHandler.doHandle(ContextHandler.java:1180)
at org.eclipse.jetty.servlet.ServletHandler.doScope(ServletHandler.java:512)
at org.eclipse.jetty.server.session.SessionHandler.doScope(SessionHandler.java:185)
at org.eclipse.jetty.server.handler.ContextHandler.doScope(ContextHandler.java:1112)
at org.eclipse.jetty.server.handler.ScopedHandler.handle(ScopedHandler.java:141)
at org.eclipse.jetty.server.handler.gzip.GzipHandler.handle(GzipHandler.java:395)
at org.eclipse.jetty.server.handler.HandlerWrapper.handle(HandlerWrapper.java:134)
at org.eclipse.jetty.server.Server.handle(Server.java:534)
at org.eclipse.jetty.server.HttpChannel.handle(HttpChannel.java:320)
at org.eclipse.jetty.server.HttpConnection.onFillable(HttpConnection.java:251)
at org.eclipse.jetty.io.AbstractConnection$ReadCallback.succeeded(AbstractConnection.java:273)
at org.eclipse.jetty.io.FillInterest.fillable(FillInterest.java:95)
at org.eclipse.jetty.io.SelectChannelEndPoint$2.run(SelectChannelEndPoint.java:93)
at org.eclipse.jetty.util.thread.strategy.ExecuteProduceConsume.executeProduceConsume(ExecuteProduceConsume.java:303)
at org.eclipse.jetty.util.thread.strategy.ExecuteProduceConsume.produceConsume(ExecuteProduceConsume.java:148)
at org.eclipse.jetty.util.thread.strategy.ExecuteProduceConsume.run(ExecuteProduceConsume.java:136)
at org.eclipse.jetty.util.thread.QueuedThreadPool.runJob(QueuedThreadPool.java:671)
at org.eclipse.jetty.util.thread.QueuedThreadPool$2.run(QueuedThreadPool.java:589)
at java.lang.Thread.run(Thread.java:748)
at __randomizedtesting.SeedInfo.seed([EA68968DD27CEB1A]:0)
at org.junit.Assert.fail(Assert.java:93)
at org.junit.Assert.assertTrue(Assert.java:43)
at org.junit.Assert.assertNull(Assert.java:551)
at org.apache.solr.SolrTestCaseJ4.teardownTestCases(SolrTestCaseJ4.java:296)
at sun.reflect.GeneratedMethodAccessor32.invoke(Unknown Source)
at sun.reflect.DelegatingMethodAccessorImpl.invoke(DelegatingMethodAccessorImpl.java:43)
at java.lang.reflect.Method.invoke(Method.java:498)
at com.carrotsearch.randomizedtesting.RandomizedRunner.invoke(RandomizedRunner.java:1713)
at com.carrotsearch.randomizedtesting.RandomizedRunner$7.evaluate(RandomizedRunner.java:870)
at com.carrotsearch.randomizedtesting.rules.StatementAdapter.evaluate(StatementAdapter.java:36)
at com.carrotsearch.randomizedtesting.rules.SystemPropertiesRestoreRule$1.evaluate(SystemPropertiesRestoreRule.java:57)
at org.apache.lucene.util.AbstractBeforeAfterRule$1.evaluate(AbstractBeforeAfterRule.java:45)
at com.carrotsearch.randomizedtesting.rules.StatementAdapter.evaluate(StatementAdapter.java:36)
at org.apache.lucene.util.TestRuleStoreClassName$1.evaluate(TestRuleStoreClassName.java:41)
at com.carrotsearch.randomizedtesting.rules.NoShadowingOrOverridesOnMethodsRule$1.evaluate(NoShadowingOrOverridesOnMethodsRule.java:40)
at com.carrotsearch.randomizedtesting.rules.NoShadowingOrOverridesOnMethodsRule$1.evaluate(NoShadowingOrOverridesOnMethodsRule.java:40)
at com.carrotsearch.randomizedtesting.rules.StatementAdapter.evaluate(StatementAdapter.java:36)
at com.carrotsearch.randomizedtesting.rules.StatementAdapter.evaluate(StatementAdapter.java:36)
at com.carrotsearch.randomizedtesting.rules.StatementAdapter.evaluate(StatementAdapter.java:36)
at org.apache.lucene.util.TestRuleAssertionsRequired$1.evaluate(TestRuleAssertionsRequired.java:53)
at org.apache.lucene.util.TestRuleMarkFailure$1.evaluate(TestRuleMarkFailure.java:47)
at org.apache.lucene.util.TestRuleIgnoreAfterMaxFailures$1.evaluate(TestRuleIgnoreAfterMaxFailures.java:64)
at org.apache.lucene.util.TestRuleIgnoreTestSuites$1.evaluate(TestRuleIgnoreTestSuites.java:54)
at com.carrotsearch.randomizedtesting.rules.StatementAdapter.evaluate(StatementAdapter.java:36)
at com.carrotsearch.randomizedtesting.ThreadLeakControl$StatementRunner.run(ThreadLeakControl.java:368)
at java.lang.Thread.run(Thread.java:748)
FAILED: junit.framework.TestSuite.org.apache.solr.util.TestSolrCLIRunExample
Error Message:
Could not remove the following files (in the order of attempts): C:\Users\jenkins\workspace\Lucene-Solr-7.x-Windows\solr\build\solr-core\test\J1\temp\solr.util.TestSolrCLIRunExample_EA68968DD27CEB1A-001\tempDir-004\node1\testCloudExamplePrompt_shard1_replica_n2\data\tlog\tlog.0000000000000000000: java.nio.file.FileSystemException: C:\Users\jenkins\workspace\Lucene-Solr-7.x-Windows\solr\build\solr-core\test\J1\temp\solr.util.TestSolrCLIRunExample_EA68968DD27CEB1A-001\tempDir-004\node1\testCloudExamplePrompt_shard1_replica_n2\data\tlog\tlog.0000000000000000000: The process cannot access the file because it is being used by another process. C:\Users\jenkins\workspace\Lucene-Solr-7.x-Windows\solr\build\solr-core\test\J1\temp\solr.util.TestSolrCLIRunExample_EA68968DD27CEB1A-001\tempDir-004\node1\testCloudExamplePrompt_shard1_replica_n2\data\tlog: java.nio.file.DirectoryNotEmptyException: C:\Users\jenkins\workspace\Lucene-Solr-7.x-Windows\solr\build\solr-core\test\J1\temp\solr.util.TestSolrCLIRunExample_EA68968DD27CEB1A-001\tempDir-004\node1\testCloudExamplePrompt_shard1_replica_n2\data\tlog C:\Users\jenkins\workspace\Lucene-Solr-7.x-Windows\solr\build\solr-core\test\J1\temp\solr.util.TestSolrCLIRunExample_EA68968DD27CEB1A-001\tempDir-004\node1\testCloudExamplePrompt_shard1_replica_n2\data: java.nio.file.DirectoryNotEmptyException: C:\Users\jenkins\workspace\Lucene-Solr-7.x-Windows\solr\build\solr-core\test\J1\temp\solr.util.TestSolrCLIRunExample_EA68968DD27CEB1A-001\tempDir-004\node1\testCloudExamplePrompt_shard1_replica_n2\data C:\Users\jenkins\workspace\Lucene-Solr-7.x-Windows\solr\build\solr-core\test\J1\temp\solr.util.TestSolrCLIRunExample_EA68968DD27CEB1A-001\tempDir-004\node1\testCloudExamplePrompt_shard1_replica_n2: java.nio.file.DirectoryNotEmptyException: C:\Users\jenkins\workspace\Lucene-Solr-7.x-Windows\solr\build\solr-core\test\J1\temp\solr.util.TestSolrCLIRunExample_EA68968DD27CEB1A-001\tempDir-004\node1\testCloudExamplePrompt_shard1_replica_n2 C:\Users\jenkins\workspace\Lucene-Solr-7.x-Windows\solr\build\solr-core\test\J1\temp\solr.util.TestSolrCLIRunExample_EA68968DD27CEB1A-001\tempDir-004\node1: java.nio.file.DirectoryNotEmptyException: C:\Users\jenkins\workspace\Lucene-Solr-7.x-Windows\solr\build\solr-core\test\J1\temp\solr.util.TestSolrCLIRunExample_EA68968DD27CEB1A-001\tempDir-004\node1 C:\Users\jenkins\workspace\Lucene-Solr-7.x-Windows\solr\build\solr-core\test\J1\temp\solr.util.TestSolrCLIRunExample_EA68968DD27CEB1A-001\tempDir-004: java.nio.file.DirectoryNotEmptyException: C:\Users\jenkins\workspace\Lucene-Solr-7.x-Windows\solr\build\solr-core\test\J1\temp\solr.util.TestSolrCLIRunExample_EA68968DD27CEB1A-001\tempDir-004 C:\Users\jenkins\workspace\Lucene-Solr-7.x-Windows\solr\build\solr-core\test\J1\temp\solr.util.TestSolrCLIRunExample_EA68968DD27CEB1A-001: java.nio.file.DirectoryNotEmptyException: C:\Users\jenkins\workspace\Lucene-Solr-7.x-Windows\solr\build\solr-core\test\J1\temp\solr.util.TestSolrCLIRunExample_EA68968DD27CEB1A-001
Stack Trace:
java.io.IOException: Could not remove the following files (in the order of attempts):
C:\Users\jenkins\workspace\Lucene-Solr-7.x-Windows\solr\build\solr-core\test\J1\temp\solr.util.TestSolrCLIRunExample_EA68968DD27CEB1A-001\tempDir-004\node1\testCloudExamplePrompt_shard1_replica_n2\data\tlog\tlog.0000000000000000000: java.nio.file.FileSystemException: C:\Users\jenkins\workspace\Lucene-Solr-7.x-Windows\solr\build\solr-core\test\J1\temp\solr.util.TestSolrCLIRunExample_EA68968DD27CEB1A-001\tempDir-004\node1\testCloudExamplePrompt_shard1_replica_n2\data\tlog\tlog.0000000000000000000: The process cannot access the file because it is being used by another process.
C:\Users\jenkins\workspace\Lucene-Solr-7.x-Windows\solr\build\solr-core\test\J1\temp\solr.util.TestSolrCLIRunExample_EA68968DD27CEB1A-001\tempDir-004\node1\testCloudExamplePrompt_shard1_replica_n2\data\tlog: java.nio.file.DirectoryNotEmptyException: C:\Users\jenkins\workspace\Lucene-Solr-7.x-Windows\solr\build\solr-core\test\J1\temp\solr.util.TestSolrCLIRunExample_EA68968DD27CEB1A-001\tempDir-004\node1\testCloudExamplePrompt_shard1_replica_n2\data\tlog
C:\Users\jenkins\workspace\Lucene-Solr-7.x-Windows\solr\build\solr-core\test\J1\temp\solr.util.TestSolrCLIRunExample_EA68968DD27CEB1A-001\tempDir-004\node1\testCloudExamplePrompt_shard1_replica_n2\data: java.nio.file.DirectoryNotEmptyException: C:\Users\jenkins\workspace\Lucene-Solr-7.x-Windows\solr\build\solr-core\test\J1\temp\solr.util.TestSolrCLIRunExample_EA68968DD27CEB1A-001\tempDir-004\node1\testCloudExamplePrompt_shard1_replica_n2\data
C:\Users\jenkins\workspace\Lucene-Solr-7.x-Windows\solr\build\solr-core\test\J1\temp\solr.util.TestSolrCLIRunExample_EA68968DD27CEB1A-001\tempDir-004\node1\testCloudExamplePrompt_shard1_replica_n2: java.nio.file.DirectoryNotEmptyException: C:\Users\jenkins\workspace\Lucene-Solr-7.x-Windows\solr\build\solr-core\test\J1\temp\solr.util.TestSolrCLIRunExample_EA68968DD27CEB1A-001\tempDir-004\node1\testCloudExamplePrompt_shard1_replica_n2
C:\Users\jenkins\workspace\Lucene-Solr-7.x-Windows\solr\build\solr-core\test\J1\temp\solr.util.TestSolrCLIRunExample_EA68968DD27CEB1A-001\tempDir-004\node1: java.nio.file.DirectoryNotEmptyException: C:\Users\jenkins\workspace\Lucene-Solr-7.x-Windows\solr\build\solr-core\test\J1\temp\solr.util.TestSolrCLIRunExample_EA68968DD27CEB1A-001\tempDir-004\node1
C:\Users\jenkins\workspace\Lucene-Solr-7.x-Windows\solr\build\solr-core\test\J1\temp\solr.util.TestSolrCLIRunExample_EA68968DD27CEB1A-001\tempDir-004: java.nio.file.DirectoryNotEmptyException: C:\Users\jenkins\workspace\Lucene-Solr-7.x-Windows\solr\build\solr-core\test\J1\temp\solr.util.TestSolrCLIRunExample_EA68968DD27CEB1A-001\tempDir-004
C:\Users\jenkins\workspace\Lucene-Solr-7.x-Windows\solr\build\solr-core\test\J1\temp\solr.util.TestSolrCLIRunExample_EA68968DD27CEB1A-001: java.nio.file.DirectoryNotEmptyException: C:\Users\jenkins\workspace\Lucene-Solr-7.x-Windows\solr\build\solr-core\test\J1\temp\solr.util.TestSolrCLIRunExample_EA68968DD27CEB1A-001
at org.apache.lucene.util.IOUtils.rm(IOUtils.java:329)
at org.apache.lucene.util.TestRuleTemporaryFilesCleanup.afterAlways(TestRuleTemporaryFilesCleanup.java:216)
at com.carrotsearch.randomizedtesting.rules.TestRuleAdapter$1.afterAlways(TestRuleAdapter.java:31)
at com.carrotsearch.randomizedtesting.rules.StatementAdapter.evaluate(StatementAdapter.java:43)
at com.carrotsearch.randomizedtesting.rules.StatementAdapter.evaluate(StatementAdapter.java:36)
at org.apache.lucene.util.TestRuleAssertionsRequired$1.evaluate(TestRuleAssertionsRequired.java:53)
at org.apache.lucene.util.TestRuleMarkFailure$1.evaluate(TestRuleMarkFailure.java:47)
at org.apache.lucene.util.TestRuleIgnoreAfterMaxFailures$1.evaluate(TestRuleIgnoreAfterMaxFailures.java:64)
at org.apache.lucene.util.TestRuleIgnoreTestSuites$1.evaluate(TestRuleIgnoreTestSuites.java:54)
at com.carrotsearch.randomizedtesting.rules.StatementAdapter.evaluate(StatementAdapter.java:36)
at com.carrotsearch.randomizedtesting.ThreadLeakControl$StatementRunner.run(ThreadLeakControl.java:368)
at java.lang.Thread.run(Thread.java:748)
Build Log:
[...truncated 11476 lines...]
[junit4] Suite: org.apache.solr.cloud.OverseerRolesTest
[junit4] 2> Creating dataDir: C:\Users\jenkins\workspace\Lucene-Solr-7.x-Windows\solr\build\solr-core\test\J0\temp\solr.cloud.OverseerRolesTest_EA68968DD27CEB1A-001\init-core-data-001
[junit4] 2> 791133 WARN (SUITE-OverseerRolesTest-seed#[EA68968DD27CEB1A]-worker) [ ] o.a.s.SolrTestCaseJ4 startTrackingSearchers: numOpens=3 numCloses=3
[junit4] 2> 791133 INFO (SUITE-OverseerRolesTest-seed#[EA68968DD27CEB1A]-worker) [ ] o.a.s.SolrTestCaseJ4 Using TrieFields (NUMERIC_POINTS_SYSPROP=false) w/NUMERIC_DOCVALUES_SYSPROP=false
[junit4] 2> 791136 INFO (SUITE-OverseerRolesTest-seed#[EA68968DD27CEB1A]-worker) [ ] o.a.s.SolrTestCaseJ4 Randomized ssl (false) and clientAuth (false) via: @org.apache.solr.util.RandomizeSSL(reason=, value=NaN, ssl=NaN, clientAuth=NaN)
[junit4] 2> 791137 INFO (SUITE-OverseerRolesTest-seed#[EA68968DD27CEB1A]-worker) [ ] o.a.s.c.MiniSolrCloudCluster Starting cluster of 4 servers in C:\Users\jenkins\workspace\Lucene-Solr-7.x-Windows\solr\build\solr-core\test\J0\temp\solr.cloud.OverseerRolesTest_EA68968DD27CEB1A-001\tempDir-001
[junit4] 2> 791137 INFO (SUITE-OverseerRolesTest-seed#[EA68968DD27CEB1A]-worker) [ ] o.a.s.c.ZkTestServer STARTING ZK TEST SERVER
[junit4] 2> 791137 INFO (Thread-2023) [ ] o.a.s.c.ZkTestServer client port:0.0.0.0/0.0.0.0:0
[junit4] 2> 791137 INFO (Thread-2023) [ ] o.a.s.c.ZkTestServer Starting server
[junit4] 2> 791141 ERROR (Thread-2023) [ ] o.a.z.s.ZooKeeperServer ZKShutdownHandler is not registered, so ZooKeeper server won't take any action on ERROR or SHUTDOWN server state changes
[junit4] 2> 791238 INFO (SUITE-OverseerRolesTest-seed#[EA68968DD27CEB1A]-worker) [ ] o.a.s.c.ZkTestServer start zk server on port:52252
[junit4] 2> 791246 INFO (jetty-launcher-1970-thread-1) [ ] o.e.j.s.Server jetty-9.3.14.v20161028
[junit4] 2> 791246 INFO (jetty-launcher-1970-thread-4) [ ] o.e.j.s.Server jetty-9.3.14.v20161028
[junit4] 2> 791246 INFO (jetty-launcher-1970-thread-2) [ ] o.e.j.s.Server jetty-9.3.14.v20161028
[junit4] 2> 791247 INFO (jetty-launcher-1970-thread-1) [ ] o.e.j.s.h.ContextHandler Started o.e.j.s.ServletContextHandler@59c2e19a{/solr,null,AVAILABLE}
[junit4] 2> 791247 INFO (jetty-launcher-1970-thread-3) [ ] o.e.j.s.Server jetty-9.3.14.v20161028
[junit4] 2> 791247 INFO (jetty-launcher-1970-thread-2) [ ] o.e.j.s.h.ContextHandler Started o.e.j.s.ServletContextHandler@6fec3ece{/solr,null,AVAILABLE}
[junit4] 2> 791247 INFO (jetty-launcher-1970-thread-3) [ ] o.e.j.s.h.ContextHandler Started o.e.j.s.ServletContextHandler@4f0a8ea4{/solr,null,AVAILABLE}
[junit4] 2> 791247 INFO (jetty-launcher-1970-thread-1) [ ] o.e.j.s.AbstractConnector Started ServerConnector@3b2aba81{HTTP/1.1,[http/1.1]}{127.0.0.1:52256}
[junit4] 2> 791247 INFO (jetty-launcher-1970-thread-2) [ ] o.e.j.s.AbstractConnector Started ServerConnector@78d03dfe{HTTP/1.1,[http/1.1]}{127.0.0.1:52258}
[junit4] 2> 791247 INFO (jetty-launcher-1970-thread-1) [ ] o.e.j.s.Server Started @808281ms
[junit4] 2> 791247 INFO (jetty-launcher-1970-thread-2) [ ] o.e.j.s.Server Started @808281ms
[junit4] 2> 791247 INFO (jetty-launcher-1970-thread-1) [ ] o.a.s.c.s.e.JettySolrRunner Jetty properties: {hostContext=/solr, hostPort=52256}
[junit4] 2> 791247 INFO (jetty-launcher-1970-thread-2) [ ] o.a.s.c.s.e.JettySolrRunner Jetty properties: {hostContext=/solr, hostPort=52258}
[junit4] 2> 791247 ERROR (jetty-launcher-1970-thread-1) [ ] o.a.s.s.StartupLoggingUtils Missing Java Option solr.log.dir. Logging may be missing or incomplete.
[junit4] 2> 791247 INFO (jetty-launcher-1970-thread-4) [ ] o.e.j.s.h.ContextHandler Started o.e.j.s.ServletContextHandler@64e3b97e{/solr,null,AVAILABLE}
[junit4] 2> 791248 INFO (jetty-launcher-1970-thread-1) [ ] o.a.s.s.SolrDispatchFilter ___ _ Welcome to Apache Solr? version 7.1.0
[junit4] 2> 791247 INFO (jetty-launcher-1970-thread-3) [ ] o.e.j.s.AbstractConnector Started ServerConnector@31b24509{HTTP/1.1,[http/1.1]}{127.0.0.1:52262}
[junit4] 2> 791248 INFO (jetty-launcher-1970-thread-1) [ ] o.a.s.s.SolrDispatchFilter / __| ___| |_ _ Starting in cloud mode on port null
[junit4] 2> 791248 INFO (jetty-launcher-1970-thread-3) [ ] o.e.j.s.Server Started @808282ms
[junit4] 2> 791248 INFO (jetty-launcher-1970-thread-1) [ ] o.a.s.s.SolrDispatchFilter \__ \/ _ \ | '_| Install dir: null, Default config dir: null
[junit4] 2> 791248 INFO (jetty-launcher-1970-thread-3) [ ] o.a.s.c.s.e.JettySolrRunner Jetty properties: {hostContext=/solr, hostPort=52262}
[junit4] 2> 791248 INFO (jetty-launcher-1970-thread-1) [ ] o.a.s.s.SolrDispatchFilter |___/\___/_|_| Start time: 2017-07-14T22:02:47.671Z
[junit4] 2> 791248 ERROR (jetty-launcher-1970-thread-3) [ ] o.a.s.s.StartupLoggingUtils Missing Java Option solr.log.dir. Logging may be missing or incomplete.
[junit4] 2> 791248 INFO (jetty-launcher-1970-thread-4) [ ] o.e.j.s.AbstractConnector Started ServerConnector@46efa26c{HTTP/1.1,[http/1.1]}{127.0.0.1:52265}
[junit4] 2> 791248 INFO (jetty-launcher-1970-thread-3) [ ] o.a.s.s.SolrDispatchFilter ___ _ Welcome to Apache Solr? version 7.1.0
[junit4] 2> 791248 INFO (jetty-launcher-1970-thread-3) [ ] o.a.s.s.SolrDispatchFilter / __| ___| |_ _ Starting in cloud mode on port null
[junit4] 2> 791248 INFO (jetty-launcher-1970-thread-3) [ ] o.a.s.s.SolrDispatchFilter \__ \/ _ \ | '_| Install dir: null, Default config dir: null
[junit4] 2> 791248 INFO (jetty-launcher-1970-thread-3) [ ] o.a.s.s.SolrDispatchFilter |___/\___/_|_| Start time: 2017-07-14T22:02:47.671Z
[junit4] 2> 791247 ERROR (jetty-launcher-1970-thread-2) [ ] o.a.s.s.StartupLoggingUtils Missing Java Option solr.log.dir. Logging may be missing or incomplete.
[junit4] 2> 791249 INFO (jetty-launcher-1970-thread-2) [ ] o.a.s.s.SolrDispatchFilter ___ _ Welcome to Apache Solr? version 7.1.0
[junit4] 2> 791249 INFO (jetty-launcher-1970-thread-2) [ ] o.a.s.s.SolrDispatchFilter / __| ___| |_ _ Starting in cloud mode on port null
[junit4] 2> 791249 INFO (jetty-launcher-1970-thread-2) [ ] o.a.s.s.SolrDispatchFilter \__ \/ _ \ | '_| Install dir: null, Default config dir: null
[junit4] 2> 791249 INFO (jetty-launcher-1970-thread-2) [ ] o.a.s.s.SolrDispatchFilter |___/\___/_|_| Start time: 2017-07-14T22:02:47.672Z
[junit4] 2> 791248 INFO (jetty-launcher-1970-thread-4) [ ] o.e.j.s.Server Started @808282ms
[junit4] 2> 791249 INFO (jetty-launcher-1970-thread-4) [ ] o.a.s.c.s.e.JettySolrRunner Jetty properties: {hostContext=/solr, hostPort=52265}
[junit4] 2> 791249 ERROR (jetty-launcher-1970-thread-4) [ ] o.a.s.s.StartupLoggingUtils Missing Java Option solr.log.dir. Logging may be missing or incomplete.
[junit4] 2> 791249 INFO (jetty-launcher-1970-thread-4) [ ] o.a.s.s.SolrDispatchFilter ___ _ Welcome to Apache Solr? version 7.1.0
[junit4] 2> 791249 INFO (jetty-launcher-1970-thread-4) [ ] o.a.s.s.SolrDispatchFilter / __| ___| |_ _ Starting in cloud mode on port null
[junit4] 2> 791249 INFO (jetty-launcher-1970-thread-4) [ ] o.a.s.s.SolrDispatchFilter \__ \/ _ \ | '_| Install dir: null, Default config dir: null
[junit4] 2> 791249 INFO (jetty-launcher-1970-thread-4) [ ] o.a.s.s.SolrDispatchFilter |___/\___/_|_| Start time: 2017-07-14T22:02:47.672Z
[junit4] 2> 791258 INFO (jetty-launcher-1970-thread-2) [ ] o.a.s.s.SolrDispatchFilter solr.xml found in ZooKeeper. Loading...
[junit4] 2> 791258 INFO (jetty-launcher-1970-thread-3) [ ] o.a.s.s.SolrDispatchFilter solr.xml found in ZooKeeper. Loading...
[junit4] 2> 791258 INFO (jetty-launcher-1970-thread-4) [ ] o.a.s.s.SolrDispatchFilter solr.xml found in ZooKeeper. Loading...
[junit4] 2> 791258 INFO (jetty-launcher-1970-thread-1) [ ] o.a.s.s.SolrDispatchFilter solr.xml found in ZooKeeper. Loading...
[junit4] 2> 791271 WARN (NIOServerCxn.Factory:0.0.0.0/0.0.0.0:0) [ ] o.a.z.s.NIOServerCnxn caught end of stream exception
[junit4] 2> EndOfStreamException: Unable to read additional data from client sessionid 0x15d4320298b0002, likely client has closed socket
[junit4] 2> at org.apache.zookeeper.server.NIOServerCnxn.doIO(NIOServerCnxn.java:239)
[junit4] 2> at org.apache.zookeeper.server.NIOServerCnxnFactory.run(NIOServerCnxnFactory.java:203)
[junit4] 2> at java.lang.Thread.run(Thread.java:748)
[junit4] 2> 791275 INFO (jetty-launcher-1970-thread-1) [ ] o.a.s.c.ZkContainer Zookeeper client=127.0.0.1:52252/solr
[junit4] 2> 791275 INFO (jetty-launcher-1970-thread-2) [ ] o.a.s.c.ZkContainer Zookeeper client=127.0.0.1:52252/solr
[junit4] 2> 791276 INFO (jetty-launcher-1970-thread-4) [ ] o.a.s.c.ZkContainer Zookeeper client=127.0.0.1:52252/solr
[junit4] 2> 791277 INFO (jetty-launcher-1970-thread-3) [ ] o.a.s.c.ZkContainer Zookeeper client=127.0.0.1:52252/solr
[junit4] 2> 791280 WARN (NIOServerCxn.Factory:0.0.0.0/0.0.0.0:0) [ ] o.a.z.s.NIOServerCnxn caught end of stream exception
[junit4] 2> EndOfStreamException: Unable to read additional data from client sessionid 0x15d4320298b0006, likely client has closed socket
[junit4] 2> at org.apache.zookeeper.server.NIOServerCnxn.doIO(NIOServerCnxn.java:239)
[junit4] 2> at org.apache.zookeeper.server.NIOServerCnxnFactory.run(NIOServerCnxnFactory.java:203)
[junit4] 2> at java.lang.Thread.run(Thread.java:748)
[junit4] 2> 791281 WARN (NIOServerCxn.Factory:0.0.0.0/0.0.0.0:0) [ ] o.a.z.s.NIOServerCnxn caught end of stream exception
[junit4] 2> EndOfStreamException: Unable to read additional data from client sessionid 0x15d4320298b0005, likely client has closed socket
[junit4] 2> at org.apache.zookeeper.server.NIOServerCnxn.doIO(NIOServerCnxn.java:239)
[junit4] 2> at org.apache.zookeeper.server.NIOServerCnxnFactory.run(NIOServerCnxnFactory.java:203)
[junit4] 2> at java.lang.Thread.run(Thread.java:748)
[junit4] 2> 791282 WARN (NIOServerCxn.Factory:0.0.0.0/0.0.0.0:0) [ ] o.a.z.s.NIOServerCnxn caught end of stream exception
[junit4] 2> EndOfStreamException: Unable to read additional data from client sessionid 0x15d4320298b0007, likely client has closed socket
[junit4] 2> at org.apache.zookeeper.server.NIOServerCnxn.doIO(NIOServerCnxn.java:239)
[junit4] 2> at org.apache.zookeeper.server.NIOServerCnxnFactory.run(NIOServerCnxnFactory.java:203)
[junit4] 2> at java.lang.Thread.run(Thread.java:748)
[junit4] 2> 791283 WARN (NIOServerCxn.Factory:0.0.0.0/0.0.0.0:0) [ ] o.a.z.s.NIOServerCnxn caught end of stream exception
[junit4] 2> EndOfStreamException: Unable to read additional data from client sessionid 0x15d4320298b0008, likely client has closed socket
[junit4] 2> at org.apache.zookeeper.server.NIOServerCnxn.doIO(NIOServerCnxn.java:239)
[junit4] 2> at org.apache.zookeeper.server.NIOServerCnxnFactory.run(NIOServerCnxnFactory.java:203)
[junit4] 2> at java.lang.Thread.run(Thread.java:748)
[junit4] 2> 791397 INFO (jetty-launcher-1970-thread-1) [n:127.0.0.1:52256_solr ] o.a.s.c.Overseer Overseer (id=null) closing
[junit4] 2> 791397 INFO (jetty-launcher-1970-thread-4) [n:127.0.0.1:52265_solr ] o.a.s.c.Overseer Overseer (id=null) closing
[junit4] 2> 791398 INFO (jetty-launcher-1970-thread-2) [n:127.0.0.1:52258_solr ] o.a.s.c.Overseer Overseer (id=null) closing
[junit4] 2> 791399 INFO (jetty-launcher-1970-thread-1) [n:127.0.0.1:52256_solr ] o.a.s.c.OverseerElectionContext I am going to be the leader 127.0.0.1:52256_solr
[junit4] 2> 791399 INFO (jetty-launcher-1970-thread-4) [n:127.0.0.1:52265_solr ] o.a.s.c.ZkController Register node as live in ZooKeeper:/live_nodes/127.0.0.1:52265_solr
[junit4] 2> 791399 INFO (jetty-launcher-1970-thread-2) [n:127.0.0.1:52258_solr ] o.a.s.c.ZkController Register node as live in ZooKeeper:/live_nodes/127.0.0.1:52258_solr
[junit4] 2> 791400 INFO (jetty-launcher-1970-thread-1) [n:127.0.0.1:52256_solr ] o.a.s.c.Overseer Overseer (id=98308572287008779-127.0.0.1:52256_solr-n_0000000000) starting
[junit4] 2> 791402 INFO (zkCallback-1990-thread-1-processing-n:127.0.0.1:52256_solr) [n:127.0.0.1:52256_solr ] o.a.s.c.c.ZkStateReader Updated live nodes from ZooKeeper... (0) -> (2)
[junit4] 2> 791403 INFO (zkCallback-1991-thread-1-processing-n:127.0.0.1:52258_solr) [n:127.0.0.1:52258_solr ] o.a.s.c.c.ZkStateReader Updated live nodes from ZooKeeper... (0) -> (2)
[junit4] 2> 791403 INFO (zkCallback-1989-thread-1-processing-n:127.0.0.1:52265_solr) [n:127.0.0.1:52265_solr ] o.a.s.c.c.ZkStateReader Updated live nodes from ZooKeeper... (0) -> (2)
[junit4] 2> 791410 INFO (jetty-launcher-1970-thread-1) [n:127.0.0.1:52256_solr ] o.a.s.c.ZkController Register node as live in ZooKeeper:/live_nodes/127.0.0.1:52256_solr
[junit4] 2> 791468 INFO (zkCallback-1990-thread-1-processing-n:127.0.0.1:52256_solr) [n:127.0.0.1:52256_solr ] o.a.s.c.c.ZkStateReader Updated live nodes from ZooKeeper... (2) -> (3)
[junit4] 2> 791471 INFO (zkCallback-1989-thread-1-processing-n:127.0.0.1:52265_solr) [n:127.0.0.1:52265_solr ] o.a.s.c.c.ZkStateReader Updated live nodes from ZooKeeper... (2) -> (3)
[junit4] 2> 791471 INFO (zkCallback-1991-thread-1-processing-n:127.0.0.1:52258_solr) [n:127.0.0.1:52258_solr ] o.a.s.c.c.ZkStateReader Updated live nodes from ZooKeeper... (2) -> (3)
[junit4] 2> 791476 INFO (jetty-launcher-1970-thread-3) [n:127.0.0.1:52262_solr ] o.a.s.c.c.ZkStateReader Updated live nodes from ZooKeeper... (0) -> (3)
[junit4] 2> 791478 INFO (jetty-launcher-1970-thread-3) [n:127.0.0.1:52262_solr ] o.a.s.c.Overseer Overseer (id=null) closing
[junit4] 2> 791479 INFO (jetty-launcher-1970-thread-3) [n:127.0.0.1:52262_solr ] o.a.s.c.ZkController Register node as live in ZooKeeper:/live_nodes/127.0.0.1:52262_solr
[junit4] 2> 791536 INFO (jetty-launcher-1970-thread-4) [n:127.0.0.1:52265_solr ] o.a.s.m.r.SolrJmxReporter JMX monitoring for 'solr_52265.solr.node' (registry 'solr.node') enabled at server: com.sun.jmx.mbeanserver.JmxMBeanServer@1b39fc6f
[junit4] 2> 791541 INFO (zkCallback-1989-thread-1-processing-n:127.0.0.1:52265_solr) [n:127.0.0.1:52265_solr ] o.a.s.c.c.ZkStateReader Updated live nodes from ZooKeeper... (3) -> (4)
[junit4] 2> 791542 INFO (zkCallback-1991-thread-1-processing-n:127.0.0.1:52258_solr) [n:127.0.0.1:52258_solr ] o.a.s.c.c.ZkStateReader Updated live nodes from ZooKeeper... (3) -> (4)
[junit4] 2> 791542 INFO (zkCallback-1990-thread-1-processing-n:127.0.0.1:52256_solr) [n:127.0.0.1:52256_solr ] o.a.s.c.c.ZkStateReader Updated live nodes from ZooKeeper... (3) -> (4)
[junit4] 2> 791549 INFO (jetty-launcher-1970-thread-4) [n:127.0.0.1:52265_solr ] o.a.s.m.r.SolrJmxReporter JMX monitoring for 'solr_52265.solr.jvm' (registry 'solr.jvm') enabled at server: com.sun.jmx.mbeanserver.JmxMBeanServer@1b39fc6f
[junit4] 2> 791549 INFO (jetty-launcher-1970-thread-4) [n:127.0.0.1:52265_solr ] o.a.s.m.r.SolrJmxReporter JMX monitoring for 'solr_52265.solr.jetty' (registry 'solr.jetty') enabled at server: com.sun.jmx.mbeanserver.JmxMBeanServer@1b39fc6f
[junit4] 2> 791551 INFO (jetty-launcher-1970-thread-4) [n:127.0.0.1:52265_solr ] o.a.s.c.CorePropertiesLocator Found 0 core definitions underneath C:\Users\jenkins\workspace\Lucene-Solr-7.x-Windows\solr\build\solr-core\test\J0\temp\solr.cloud.OverseerRolesTest_EA68968DD27CEB1A-001\tempDir-001\node4\.
[junit4] 2> 791552 INFO (zkCallback-1992-thread-1-processing-n:127.0.0.1:52262_solr) [n:127.0.0.1:52262_solr ] o.a.s.c.c.ZkStateReader Updated live nodes from ZooKeeper... (3) -> (4)
[junit4] 2> 791595 INFO (jetty-launcher-1970-thread-1) [n:127.0.0.1:52256_solr ] o.a.s.m.r.SolrJmxReporter JMX monitoring for 'solr_52256.solr.node' (registry 'solr.node') enabled at server: com.sun.jmx.mbeanserver.JmxMBeanServer@1b39fc6f
[junit4] 2> 791599 INFO (jetty-launcher-1970-thread-1) [n:127.0.0.1:52256_solr ] o.a.s.m.r.SolrJmxReporter JMX monitoring for 'solr_52256.solr.jvm' (registry 'solr.jvm') enabled at server: com.sun.jmx.mbeanserver.JmxMBeanServer@1b39fc6f
[junit4] 2> 791600 INFO (jetty-launcher-1970-thread-1) [n:127.0.0.1:52256_solr ] o.a.s.m.r.SolrJmxReporter JMX monitoring for 'solr_52256.solr.jetty' (registry 'solr.jetty') enabled at server: com.sun.jmx.mbeanserver.JmxMBeanServer@1b39fc6f
[junit4] 2> 791601 INFO (jetty-launcher-1970-thread-1) [n:127.0.0.1:52256_solr ] o.a.s.c.CorePropertiesLocator Found 0 core definitions underneath C:\Users\jenkins\workspace\Lucene-Solr-7.x-Windows\solr\build\solr-core\test\J0\temp\solr.cloud.OverseerRolesTest_EA68968DD27CEB1A-001\tempDir-001\node1\.
[junit4] 2> 791675 INFO (jetty-launcher-1970-thread-2) [n:127.0.0.1:52258_solr ] o.a.s.m.r.SolrJmxReporter JMX monitoring for 'solr_52258.solr.node' (registry 'solr.node') enabled at server: com.sun.jmx.mbeanserver.JmxMBeanServer@1b39fc6f
[junit4] 2> 791677 INFO (jetty-launcher-1970-thread-3) [n:127.0.0.1:52262_solr ] o.a.s.m.r.SolrJmxReporter JMX monitoring for 'solr_52262.solr.node' (registry 'solr.node') enabled at server: com.sun.jmx.mbeanserver.JmxMBeanServer@1b39fc6f
[junit4] 2> 791681 INFO (jetty-launcher-1970-thread-2) [n:127.0.0.1:52258_solr ] o.a.s.m.r.SolrJmxReporter JMX monitoring for 'solr_52258.solr.jvm' (registry 'solr.jvm') enabled at server: com.sun.jmx.mbeanserver.JmxMBeanServer@1b39fc6f
[junit4] 2> 791681 INFO (jetty-launcher-1970-thread-2) [n:127.0.0.1:52258_solr ] o.a.s.m.r.SolrJmxReporter JMX monitoring for 'solr_52258.solr.jetty' (registry 'solr.jetty') enabled at server: com.sun.jmx.mbeanserver.JmxMBeanServer@1b39fc6f
[junit4] 2> 791682 INFO (jetty-launcher-1970-thread-2) [n:127.0.0.1:52258_solr ] o.a.s.c.CorePropertiesLocator Found 0 core definitions underneath C:\Users\jenkins\workspace\Lucene-Solr-7.x-Windows\solr\build\solr-core\test\J0\temp\solr.cloud.OverseerRolesTest_EA68968DD27CEB1A-001\tempDir-001\node2\.
[junit4] 2> 791682 INFO (jetty-launcher-1970-thread-3) [n:127.0.0.1:52262_solr ] o.a.s.m.r.SolrJmxReporter JMX monitoring for 'solr_52262.solr.jvm' (registry 'solr.jvm') enabled at server: com.sun.jmx.mbeanserver.JmxMBeanServer@1b39fc6f
[junit4] 2> 791682 INFO (jetty-launcher-1970-thread-3) [n:127.0.0.1:52262_solr ] o.a.s.m.r.SolrJmxReporter JMX monitoring for 'solr_52262.solr.jetty' (registry 'solr.jetty') enabled at server: com.sun.jmx.mbeanserver.JmxMBeanServer@1b39fc6f
[junit4] 2> 791684 INFO (jetty-launcher-1970-thread-3) [n:127.0.0.1:52262_solr ] o.a.s.c.CorePropertiesLocator Found 0 core definitions underneath C:\Users\jenkins\workspace\Lucene-Solr-7.x-Windows\solr\build\solr-core\test\J0\temp\solr.cloud.OverseerRolesTest_EA68968DD27CEB1A-001\tempDir-001\node3\.
[junit4] 2> 791740 WARN (NIOServerCxn.Factory:0.0.0.0/0.0.0.0:0) [ ] o.a.z.s.NIOServerCnxn caught end of stream exception
[junit4] 2> EndOfStreamException: Unable to read additional data from client sessionid 0x15d4320298b000d, likely client has closed socket
[junit4] 2> at org.apache.zookeeper.server.NIOServerCnxn.doIO(NIOServerCnxn.java:239)
[junit4] 2> at org.apache.zookeeper.server.NIOServerCnxnFactory.run(NIOServerCnxnFactory.java:203)
[junit4] 2> at java.lang.Thread.run(Thread.java:748)
[junit4] 2> 791749 INFO (SUITE-OverseerRolesTest-seed#[EA68968DD27CEB1A]-worker) [ ] o.a.s.c.c.ZkStateReader Updated live nodes from ZooKeeper... (0) -> (4)
[junit4] 2> 791750 INFO (SUITE-OverseerRolesTest-seed#[EA68968DD27CEB1A]-worker) [ ] o.a.s.c.s.i.ZkClientClusterStateProvider Cluster at 127.0.0.1:52252/solr ready
[junit4] 2> 791782 INFO (TEST-OverseerRolesTest.testOverseerRole-seed#[EA68968DD27CEB1A]) [ ] o.a.s.SolrTestCaseJ4 ###Starting testOverseerRole
[junit4] 2> 791783 INFO (TEST-OverseerRolesTest.testOverseerRole-seed#[EA68968DD27CEB1A]) [ ] o.a.s.c.OverseerRolesTest Overseer: 127.0.0.1:52256_solr
[junit4] 2> 791783 INFO (TEST-OverseerRolesTest.testOverseerRole-seed#[EA68968DD27CEB1A]) [ ] o.a.s.c.OverseerRolesTest Election queue:
[junit4] 2> 791784 INFO (TEST-OverseerRolesTest.testOverseerRole-seed#[EA68968DD27CEB1A]) [ ] o.a.s.c.OverseerRolesTest ### Setting overseer designate 127.0.0.1:52258_solr
[junit4] 2> 791792 INFO (qtp914843614-9140) [n:127.0.0.1:52258_solr ] o.a.s.h.a.CollectionsHandler Invoked Collection Action :addrole with params node=127.0.0.1:52258_solr&role=overseer&action=ADDROLE&wt=javabin&version=2 and sendToOCPQueue=true
[junit4] 2> 791802 INFO (OverseerThreadFactory-3692-thread-1-processing-n:127.0.0.1:52256_solr) [n:127.0.0.1:52256_solr ] o.a.s.c.OverseerRoleCmd Overseer role added to 127.0.0.1:52258_solr
[junit4] 2> 791805 INFO (qtp914843614-9140) [n:127.0.0.1:52258_solr ] o.a.s.s.HttpSolrCall [admin] webapp=null path=/admin/collections params={node=127.0.0.1:52258_solr&role=overseer&action=ADDROLE&wt=javabin&version=2} status=0 QTime=12
[junit4] 2> 791806 INFO (Thread-2071) [n:127.0.0.1:52256_solr ] o.a.s.c.OverseerNodePrioritizer prioritizing overseer nodes at 98308572287008779-127.0.0.1:52256_solr-n_0000000000 overseer designates are [127.0.0.1:52258_solr]
[junit4] 2> 791806 INFO (Thread-2071) [n:127.0.0.1:52256_solr ] o.a.s.c.OverseerNodePrioritizer sorted nodes [98308572287008779-127.0.0.1:52256_solr-n_0000000000, 98308572287008777-127.0.0.1:52265_solr-n_0000000001, 98308572287008780-127.0.0.1:52258_solr-n_0000000002, 98308572287008778-127.0.0.1:52262_solr-n_0000000003]
[junit4] 2> 791806 INFO (Thread-2071) [n:127.0.0.1:52256_solr ] o.a.s.c.OverseerNodePrioritizer asking node 98308572287008780-127.0.0.1:52258_solr-n_0000000002 to come join election at head
[junit4] 2> 791808 INFO (qtp914843614-9141) [n:127.0.0.1:52258_solr ] o.a.s.s.HttpSolrCall [admin] webapp=null path=/admin/cores params={op=rejoinAtHead&qt=/admin/cores&action=OVERSEEROP&electionNode=98308572287008780-127.0.0.1:52258_solr-n_0000000002&wt=javabin&version=2} status=0 QTime=0
[junit4] 2> 791808 INFO (Thread-2071) [n:127.0.0.1:52256_solr ] o.a.s.c.OverseerNodePrioritizer asking the old first in line 98308572287008777-127.0.0.1:52265_solr-n_0000000001 to rejoin election
[junit4] 2> 791811 INFO (qtp376813001-9148) [n:127.0.0.1:52265_solr ] o.a.s.s.HttpSolrCall [admin] webapp=null path=/admin/cores params={op=rejoin&qt=/admin/cores&action=OVERSEEROP&electionNode=98308572287008777-127.0.0.1:52265_solr-n_0000000001&wt=javabin&version=2} status=0 QTime=0
[junit4] 2> 791815 INFO (OverseerStateUpdate-98308572287008779-127.0.0.1:52256_solr-n_0000000000) [n:127.0.0.1:52256_solr ] o.a.s.c.Overseer Quit command received {
[junit4] 2> "operation":"quit",
[junit4] 2> "id":"98308572287008779-127.0.0.1:52256_solr-n_0000000000"} 127.0.0.1:52256_solr
[junit4] 2> 791816 INFO (OverseerStateUpdate-98308572287008779-127.0.0.1:52256_solr-n_0000000000) [n:127.0.0.1:52256_solr ] o.a.s.c.Overseer Overseer Loop exiting : 127.0.0.1:52256_solr
[junit4] 2> 791818 WARN (OverseerExitThread) [n:127.0.0.1:52256_solr ] o.a.s.c.Overseer I'm exiting, but I'm still the leader
[junit4] 2> 791820 INFO (OverseerExitThread) [n:127.0.0.1:52256_solr ] o.a.s.c.Overseer Overseer (id=98308572287008779-127.0.0.1:52256_solr-n_0000000000) closing
[junit4] 2> 791821 INFO (zkCallback-1989-thread-1-processing-n:127.0.0.1:52265_solr) [n:127.0.0.1:52265_solr ] o.a.s.c.OverseerElectionContext I am going to be the leader 127.0.0.1:52265_solr
[junit4] 2> 791823 INFO (zkCallback-1989-thread-1-processing-n:127.0.0.1:52265_solr) [n:127.0.0.1:52265_solr ] o.a.s.c.Overseer Overseer (id=98308572287008777-127.0.0.1:52265_solr-n_0000000001) starting
[junit4] 2> 791829 INFO (OverseerCollectionConfigSetProcessor-98308572287008777-127.0.0.1:52265_solr-n_0000000001) [n:127.0.0.1:52265_solr ] o.a.s.c.OverseerNodePrioritizer prioritizing overseer nodes at 98308572287008777-127.0.0.1:52265_solr-n_0000000001 overseer designates are [127.0.0.1:52258_solr]
[junit4] 2> 791829 INFO (OverseerCollectionConfigSetProcessor-98308572287008777-127.0.0.1:52265_solr-n_0000000001) [n:127.0.0.1:52265_solr ] o.a.s.c.OverseerNodePrioritizer sorted nodes [98308572287008777-127.0.0.1:52265_solr-n_0000000001, 98308572287008780-127.0.0.1:52258_solr-n_0000000002, 98308572287008778-127.0.0.1:52262_solr-n_0000000003, 98308572287008779-127.0.0.1:52256_solr-n_0000000004]
[junit4] 2> 791831 INFO (OverseerStateUpdate-98308572287008777-127.0.0.1:52265_solr-n_0000000001) [n:127.0.0.1:52265_solr ] o.a.s.c.Overseer Quit command received {
[junit4] 2> "operation":"quit",
[junit4] 2> "id":"98308572287008777-127.0.0.1:52265_solr-n_0000000001"} 127.0.0.1:52265_solr
[junit4] 2> 791832 INFO (OverseerStateUpdate-98308572287008777-127.0.0.1:52265_solr-n_0000000001) [n:127.0.0.1:52265_solr ] o.a.s.c.Overseer Overseer Loop exiting : 127.0.0.1:52265_solr
[junit4] 2> 791835 WARN (OverseerExitThread) [n:127.0.0.1:52265_solr ] o.a.s.c.Overseer I'm exiting, but I'm still the leader
[junit4] 2> 791836 INFO (OverseerExitThread) [n:127.0.0.1:52265_solr ] o.a.s.c.Overseer Overseer (id=98308572287008777-127.0.0.1:52265_solr-n_0000000001) closing
[junit4] 2> 791838 INFO (zkCallback-1991-thread-1-processing-n:127.0.0.1:52258_solr) [n:127.0.0.1:52258_solr ] o.a.s.c.OverseerElectionContext I am going to be the leader 127.0.0.1:52258_solr
[junit4] 2> 791839 INFO (zkCallback-1991-thread-1-processing-n:127.0.0.1:52258_solr) [n:127.0.0.1:52258_solr ] o.a.s.c.Overseer Overseer (id=98308572287008780-127.0.0.1:52258_solr-n_0000000002) starting
[junit4] 2> 791907 INFO (TEST-OverseerRolesTest.testOverseerRole-seed#[EA68968DD27CEB1A]) [ ] o.a.s.c.OverseerRolesTest ### Adding another overseer designate 127.0.0.1:52262_solr
[junit4] 2> 791907 INFO (qtp914843614-9141) [n:127.0.0.1:52258_solr ] o.a.s.h.a.CollectionsHandler Invoked Collection Action :addrole with params node=127.0.0.1:52262_solr&role=overseer&action=ADDROLE&wt=javabin&version=2 and sendToOCPQueue=true
[junit4] 2> 791910 INFO (OverseerThreadFactory-3703-thread-1-processing-n:127.0.0.1:52258_solr) [n:127.0.0.1:52258_solr ] o.a.s.c.OverseerRoleCmd Overseer role added to 127.0.0.1:52262_solr
[junit4] 2> 791912 INFO (qtp914843614-9141) [n:127.0.0.1:52258_solr ] o.a.s.s.HttpSolrCall [admin] webapp=null path=/admin/collections params={node=127.0.0.1:52262_solr&role=overseer&action=ADDROLE&wt=javabin&version=2} status=0 QTime=4
[junit4] 2> 791913 INFO (TEST-OverseerRolesTest.testOverseerRole-seed#[EA68968DD27CEB1A]) [ ] o.a.s.c.OverseerRolesTest Overseer: 127.0.0.1:52258_solr
[junit4] 2> 791913 INFO (TEST-OverseerRolesTest.testOverseerRole-seed#[EA68968DD27CEB1A]) [ ] o.a.s.c.OverseerRolesTest Election queue:
[junit4] 2> 791913 INFO (TEST-OverseerRolesTest.testOverseerRole-seed#[EA68968DD27CEB1A]) [ ] o.a.s.c.ChaosMonkey monkey: stop jetty! 52258
[junit4] 2> 791913 INFO (TEST-OverseerRolesTest.testOverseerRole-seed#[EA68968DD27CEB1A]) [ ] o.a.s.c.CoreContainer Shutting down CoreContainer instance=86397619
[junit4] 2> 791914 INFO (TEST-OverseerRolesTest.testOverseerRole-seed#[EA68968DD27CEB1A]) [ ] o.a.s.m.SolrMetricManager Closing metric reporters for registry=solr.node, tag=null
[junit4] 2> 791914 INFO (TEST-OverseerRolesTest.testOverseerRole-seed#[EA68968DD27CEB1A]) [ ] o.a.s.m.SolrMetricManager Closing metric reporters for registry=solr.jvm, tag=null
[junit4] 2> 791915 INFO (TEST-OverseerRolesTest.testOverseerRole-seed#[EA68968DD27CEB1A]) [ ] o.a.s.m.SolrMetricManager Closing metric reporters for registry=solr.jetty, tag=null
[junit4] 2> 791920 INFO (TEST-OverseerRolesTest.testOverseerRole-seed#[EA68968DD27CEB1A]) [ ] o.a.s.m.SolrMetricManager Closing metric reporters for registry=solr.cluster, tag=null
[junit4] 2> 791920 INFO (TEST-OverseerRolesTest.testOverseerRole-seed#[EA68968DD27CEB1A]) [ ] o.a.s.c.TransientSolrCoreCacheDefault Allocating transient cache for 2147483647 transient cores
[junit4] 2> 791920 INFO (TEST-OverseerRolesTest.testOverseerRole-seed#[EA68968DD27CEB1A]) [ ] o.a.s.c.Overseer Overseer (id=98308572287008780-127.0.0.1:52258_solr-n_0000000002) closing
[junit4] 2> 791920 INFO (OverseerStateUpdate-98308572287008780-127.0.0.1:52258_solr-n_0000000002) [n:127.0.0.1:52258_solr ] o.a.s.c.Overseer Overseer Loop exiting : 127.0.0.1:52258_solr
[junit4] 2> 791923 WARN (zkCallback-1991-thread-1-processing-n:127.0.0.1:52258_solr) [n:127.0.0.1:52258_solr ] o.a.s.c.c.ZkStateReader ZooKeeper watch triggered, but Solr cannot talk to ZK: [KeeperErrorCode = Session expired for /live_nodes]
[junit4] 2> 791923 INFO (TEST-OverseerRolesTest.testOverseerRole-seed#[EA68968DD27CEB1A]) [ ] o.e.j.s.AbstractConnector Stopped ServerConnector@78d03dfe{HTTP/1.1,[http/1.1]}{127.0.0.1:0}
[junit4] 2> 791925 INFO (zkCallback-1989-thread-1-processing-n:127.0.0.1:52265_solr) [n:127.0.0.1:52265_solr ] o.a.s.c.c.ZkStateReader Updated live nodes from ZooKeeper... (4) -> (3)
[junit4] 2> 791925 INFO (zkCallback-1992-thread-1-processing-n:127.0.0.1:52262_solr) [n:127.0.0.1:52262_solr ] o.a.s.c.OverseerElectionContext I am going to be the leader 127.0.0.1:52262_solr
[junit4] 2> 791925 INFO (zkCallback-1990-thread-2-processing-n:127.0.0.1:52256_solr) [n:127.0.0.1:52256_solr ] o.a.s.c.c.ZkStateReader Updated live nodes from ZooKeeper... (4) -> (3)
[junit4] 2> 791925 INFO (TEST-OverseerRolesTest.testOverseerRole-seed#[EA68968DD27CEB1A]) [ ] o.e.j.s.h.ContextHandler Stopped o.e.j.s.ServletContextHandler@6fec3ece{/solr,null,UNAVAILABLE}
[junit4] 2> 791926 INFO (zkCallback-2000-thread-1) [ ] o.a.s.c.c.ZkStateReader Updated live nodes from ZooKeeper... (4) -> (3)
[junit4] 2> 791926 INFO (zkCallback-1992-thread-2-processing-n:127.0.0.1:52262_solr) [n:127.0.0.1:52262_solr ] o.a.s.c.c.ZkStateReader Updated live nodes from ZooKeeper... (4) -> (3)
[junit4] 2> 791928 INFO (TEST-OverseerRolesTest.testOverseerRole-seed#[EA68968DD27CEB1A]) [ ] o.a.s.c.OverseerRolesTest ### Adding last overseer designate 127.0.0.1:52265_solr
[junit4] 2> 791928 INFO (zkCallback-1992-thread-1-processing-n:127.0.0.1:52262_solr) [n:127.0.0.1:52262_solr ] o.a.s.c.Overseer Overseer (id=98308572287008778-127.0.0.1:52262_solr-n_0000000003) starting
[junit4] 2> 791930 INFO (qtp1227115696-9153) [n:127.0.0.1:52262_solr ] o.a.s.h.a.CollectionsHandler Invoked Collection Action :addrole with params node=127.0.0.1:52265_solr&role=overseer&action=ADDROLE&wt=javabin&version=2 and sendToOCPQueue=true
[junit4] 2> 791938 INFO (OverseerThreadFactory-3706-thread-1-processing-n:127.0.0.1:52262_solr) [n:127.0.0.1:52262_solr ] o.a.s.c.OverseerRoleCmd Overseer role added to 127.0.0.1:52265_solr
[junit4] 2> 791939 INFO (qtp1227115696-9153) [n:127.0.0.1:52262_solr ] o.a.s.s.HttpSolrCall [admin] webapp=null path=/admin/collections params={node=127.0.0.1:52265_solr&role=overseer&action=ADDROLE&wt=javabin&version=2} status=0 QTime=9
[junit4] 2> 791940 INFO (TEST-OverseerRolesTest.testOverseerRole-seed#[EA68968DD27CEB1A]) [ ] o.a.s.c.OverseerRolesTest Overseer: 127.0.0.1:52262_solr
[junit4] 2> 791940 INFO (TEST-OverseerRolesTest.testOverseerRole-seed#[EA68968DD27CEB1A]) [ ] o.a.s.c.OverseerRolesTest Election queue:
[junit4] 2> 791942 INFO (qtp1227115696-9152) [n:127.0.0.1:52262_solr ] o.a.s.h.a.CollectionsHandler Invoked Collection Action :removerole with params node=127.0.0.1:52262_solr&role=overseer&action=REMOVEROLE&wt=javabin&version=2 and sendToOCPQueue=true
[junit4] 2> 791944 INFO (OverseerCollectionConfigSetProcessor-98308572287008778-127.0.0.1:52262_solr-n_0000000003) [n:127.0.0.1:52262_solr ] o.a.s.c.OverseerTaskQueue Response ZK path: /overseer/collection-queue-work/qnr-0000000004 doesn't exist. Requestor may have disconnected from ZooKeeper
[junit4] 2> 791945 INFO (OverseerThreadFactory-3706-thread-2-processing-n:127.0.0.1:52262_solr) [n:127.0.0.1:52262_solr ] o.a.s.c.OverseerRoleCmd Overseer role removed from 127.0.0.1:52262_solr
[junit4] 2> 791947 INFO (qtp1227115696-9152) [n:127.0.0.1:52262_solr ] o.a.s.s.HttpSolrCall [admin] webapp=null path=/admin/collections params={node=127.0.0.1:52262_solr&role=overseer&action=REMOVEROLE&wt=javabin&version=2} status=0 QTime=4
[junit4] 2> 791947 INFO (Thread-2075) [n:127.0.0.1:52262_solr ] o.a.s.c.OverseerNodePrioritizer prioritizing overseer nodes at 98308572287008778-127.0.0.1:52262_solr-n_0000000003 overseer designates are [127.0.0.1:52258_solr, 127.0.0.1:52265_solr]
[junit4] 2> 791947 INFO (Thread-2075) [n:127.0.0.1:52262_solr ] o.a.s.c.OverseerNodePrioritizer sorted nodes [98308572287008778-127.0.0.1:52262_solr-n_0000000003, 98308572287008779-127.0.0.1:52256_solr-n_0000000004, 98308572287008777-127.0.0.1:52265_solr-n_0000000005]
[junit4] 2> 791947 INFO (Thread-2075) [n:127.0.0.1:52262_solr ] o.a.s.c.OverseerNodePrioritizer asking node 98308572287008777-127.0.0.1:52265_solr-n_0000000005 to come join election at head
[junit4] 2> 791951 INFO (qtp376813001-9144) [n:127.0.0.1:52265_solr ] o.a.s.s.HttpSolrCall [admin] webapp=null path=/admin/cores params={op=rejoinAtHead&qt=/admin/cores&action=OVERSEEROP&electionNode=98308572287008777-127.0.0.1:52265_solr-n_0000000005&wt=javabin&version=2} status=0 QTime=0
[junit4] 2> 791951 INFO (Thread-2075) [n:127.0.0.1:52262_solr ] o.a.s.c.OverseerNodePrioritizer asking the old first in line 98308572287008779-127.0.0.1:52256_solr-n_0000000004 to rejoin election
[junit4] 2> 791953 INFO (qtp1721400931-9167) [n:127.0.0.1:52256_solr ] o.a.s.s.HttpSolrCall [admin] webapp=null path=/admin/cores params={op=rejoin&qt=/admin/cores&action=OVERSEEROP&electionNode=98308572287008779-127.0.0.1:52256_solr-n_0000000004&wt=javabin&version=2} status=0 QTime=0
[junit4] 2> 791955 INFO (OverseerStateUpdate-98308572287008778-127.0.0.1:52262_solr-n_0000000003) [n:127.0.0.1:52262_solr ] o.a.s.c.Overseer Quit command received {
[junit4] 2> "operation":"quit",
[junit4] 2> "id":"98308572287008778-127.0.0.1:52262_solr-n_0000000003"} 127.0.0.1:52262_solr
[junit4] 2> 791956 INFO (OverseerStateUpdate-98308572287008778-127.0.0.1:52262_solr-n_0000000003) [n:127.0.0.1:52262_solr ] o.a.s.c.Overseer Overseer Loop exiting : 127.0.0.1:52262_solr
[junit4] 2> 791958 WARN (OverseerExitThread) [n:127.0.0.1:52262_solr ] o.a.s.c.Overseer I'm exiting, but I'm still the leader
[junit4] 2> 791959 INFO (OverseerExitThread) [n:127.0.0.1:52262_solr ] o.a.s.c.Overseer Overseer (id=98308572287008778-127.0.0.1:52262_solr-n_0000000003) closing
[junit4] 2> 791960 INFO (zkCallback-1990-thread-2-processing-n:127.0.0.1:52256_solr) [n:127.0.0.1:52256_solr ] o.a.s.c.OverseerElectionContext I am going to be the leader 127.0.0.1:52256_solr
[junit4] 2> 791962 INFO (zkCallback-1990-thread-2-processing-n:127.0.0.1:52256_solr) [n:127.0.0.1:52256_solr ] o.a.s.c.Overseer Overseer (id=98308572287008779-127.0.0.1:52256_solr-n_0000000004) starting
[junit4] 2> 791970 INFO (OverseerCollectionConfigSetProcessor-98308572287008779-127.0.0.1:52256_solr-n_0000000004) [n:127.0.0.1:52256_solr ] o.a.s.c.OverseerNodePrioritizer prioritizing overseer nodes at 98308572287008779-127.0.0.1:52256_solr-n_0000000004 overseer designates are [127.0.0.1:52258_solr, 127.0.0.1:52265_solr]
[junit4] 2> 791970 INFO (OverseerCollectionConfigSetProcessor-98308572287008779-127.0.0.1:52256_solr-n_0000000004) [n:127.0.0.1:52256_solr ] o.a.s.c.OverseerNodePrioritizer sorted nodes [98308572287008779-127.0.0.1:52256_solr-n_0000000004, 98308572287008777-127.0.0.1:52265_solr-n_0000000005, 98308572287008778-127.0.0.1:52262_solr-n_0000000006]
[junit4] 2> 791972 INFO (OverseerStateUpdate-98308572287008779-127.0.0.1:52256_solr-n_0000000004) [n:127.0.0.1:52256_solr ] o.a.s.c.Overseer Quit command received {
[junit4] 2> "operation":"quit",
[junit4] 2> "id":"98308572287008779-127.0.0.1:52256_solr-n_0000000004"} 127.0.0.1:52256_solr
[junit4] 2> 791972 INFO (OverseerStateUpdate-98308572287008779-127.0.0.1:52256_solr-n_0000000004) [n:127.0.0.1:52256_solr ] o.a.s.c.Overseer Overseer Loop exiting : 127.0.0.1:52256_solr
[junit4] 2> 791974 WARN (OverseerExitThread) [n:127.0.0.1:52256_solr ] o.a.s.c.Overseer I'm exiting, but I'm still the leader
[junit4] 2> 791974 INFO (OverseerExitThread) [n:127.0.0.1:52256_solr ] o.a.s.c.Overseer Overseer (id=98308572287008779-127.0.0.1:52256_solr-n_0000000004) closing
[junit4] 2> 791977 INFO (zkCallback-1989-thread-1-processing-n:127.0.0.1:52265_solr) [n:127.0.0.1:52265_solr ] o.a.s.c.OverseerElectionContext I am going to be the leader 127.0.0.1:52265_solr
[junit4] 2> 791978 INFO (zkCallback-1989-thread-1-processing-n:127.0.0.1:52265_solr) [n:127.0.0.1:52265_solr ] o.a.s.c.Overseer Overseer (id=98308572287008777-127.0.0.1:52265_solr-n_0000000005) starting
[junit4] 2> 792049 INFO (qtp1227115696-9151) [n:127.0.0.1:52262_solr ] o.a.s.h.a.CollectionsHandler Invoked Collection Action :addrole with params node=127.0.0.1:52262_solr&role=overseer&action=ADDROLE&wt=javabin&version=2 and sendToOCPQueue=true
[junit4] 2> 792056 INFO (OverseerThreadFactory-3710-thread-1-processing-n:127.0.0.1:52265_solr) [n:127.0.0.1:52265_solr ] o.a.s.c.OverseerRoleCmd Overseer role added to 127.0.0.1:52262_solr
[junit4] 2> 792057 INFO (qtp1227115696-9151) [n:127.0.0.1:52262_solr ] o.a.s.s.HttpSolrCall [admin] webapp=null path=/admin/collections params={node=127.0.0.1:52262_solr&role=overseer&action=ADDROLE&wt=javabin&version=2} status=0 QTime=9
[junit4] 2> 792058 INFO (TEST-OverseerRolesTest.testOverseerRole-seed#[EA68968DD27CEB1A]) [ ] o.a.s.c.OverseerRolesTest ### Sending QUIT to overseer 127.0.0.1:52265_solr
[junit4] 2> 792061 INFO (OverseerCollectionConfigSetProcessor-98308572287008777-127.0.0.1:52265_solr-n_0000000005) [n:127.0.0.1:52265_solr ] o.a.s.c.OverseerTaskQueue Response ZK path: /overseer/collection-queue-work/qnr-0000000008 doesn't exist. Requestor may have disconnected from ZooKeeper
[junit4] 2> 792062 INFO (OverseerStateUpdate-98308572287008777-127.0.0.1:52265_solr-n_0000000005) [n:127.0.0.1:52265_solr ] o.a.s.c.Overseer Quit command received {
[junit4] 2> "operation":"quit",
[junit4] 2> "id":"98308572287008777-127.0.0.1:52265_solr-n_0000000005"} 127.0.0.1:52265_solr
[junit4] 2> 792063 INFO (OverseerStateUpdate-98308572287008777-127.0.0.1:52265_solr-n_0000000005) [n:127.0.0.1:52265_solr ] o.a.s.c.Overseer Overseer Loop exiting : 127.0.0.1:52265_solr
[junit4] 2> 792065 WARN (OverseerExitThread) [n:127.0.0.1:52265_solr ] o.a.s.c.Overseer I'm exiting, but I'm still the leader
[junit4] 2> 792066 INFO (Thread-2076) [n:127.0.0.1:52265_solr ] o.a.s.c.OverseerNodePrioritizer prioritizing overseer nodes at 98308572287008777-127.0.0.1:52265_solr-n_0000000005 overseer designates are [127.0.0.1:52258_solr, 127.0.0.1:52265_solr, 127.0.0.1:52262_solr]
[junit4] 2> 792066 INFO (OverseerExitThread) [n:127.0.0.1:52265_solr ] o.a.s.c.Overseer Overseer (id=98308572287008777-127.0.0.1:52265_solr-n_0000000005) closing
[junit4] 2> 792067 INFO (Thread-2076) [n:127.0.0.1:52265_solr ] o.a.s.c.OverseerNodePrioritizer sorted nodes [98308572287008778-127.0.0.1:52262_solr-n_0000000006, 98308572287008779-127.0.0.1:52256_solr-n_0000000007]
[junit4] 2> 792067 INFO (Thread-2076) [n:127.0.0.1:52265_solr ] o.a.s.c.OverseerNodePrioritizer asking node 98308572287008778-127.0.0.1:52262_solr-n_0000000006 to come join election at head
[junit4] 2> 792068 INFO (zkCallback-1992-thread-1-processing-n:127.0.0.1:52262_solr) [n:127.0.0.1:52262_solr ] o.a.s.c.OverseerElectionContext I am going to be the leader 127.0.0.1:52262_solr
[junit4] 2> 792070 INFO (zkCallback-1992-thread-1-processing-n:127.0.0.1:52262_solr) [n:127.0.0.1:52262_solr ] o.a.s.c.Overseer Overseer (id=98308572287008778-127.0.0.1:52262_solr-n_0000000006) starting
[junit4] 2> 792083 INFO (qtp1227115696-9150) [n:127.0.0.1:52262_solr ] o.a.s.s.HttpSolrCall [admin] webapp=null path=/admin/cores params={op=rejoinAtHead&qt=/admin/cores&action=OVERSEEROP&electionNode=98308572287008778-127.0.0.1:52262_solr-n_0000000006&wt=javabin&version=2} status=0 QTime=0
[junit4] 2> 792083 INFO (Thread-2076) [n:127.0.0.1:52265_solr ] o.a.s.c.OverseerNodePrioritizer asking the old first in line 98308572287008779-127.0.0.1:52256_solr-n_0000000007 to rejoin election
[junit4] 2> 792084 INFO (qtp1721400931-9169) [n:127.0.0.1:52256_solr ] o.a.s.s.HttpSolrCall [admin] webapp=null path=/admin/cores params={op=rejoin&qt=/admin/cores&action=OVERSEEROP&electionNode=98308572287008779-127.0.0.1:52256_solr-n_0000000007&wt=javabin&version=2} status=0 QTime=0
[junit4] 2> 792088 INFO (OverseerStateUpdate-98308572287008778-127.0.0.1:52262_solr-n_0000000006) [n:127.0.0.1:52262_solr ] o.a.s.c.Overseer Quit command received {
[junit4] 2> "operation":"quit",
[junit4] 2> "id":"98308572287008778-127.0.0.1:52262_solr-n_0000000006"} 127.0.0.1:52262_solr
[junit4] 2> 792088 INFO (OverseerStateUpdate-98308572287008778-127.0.0.1:52262_solr-n_0000000006) [n:127.0.0.1:52262_solr ] o.a.s.c.Overseer Overseer Loop exiting : 127.0.0.1:52262_solr
[junit4] 2> 792089 WARN (OverseerExitThread) [n:127.0.0.1:52262_solr ] o.a.s.c.Overseer I'm exiting, but I'm still the leader
[junit4] 2> 792091 INFO (OverseerExitThread) [n:127.0.0.1:52262_solr ] o.a.s.c.Overseer Overseer (id=98308572287008778-127.0.0.1:52262_solr-n_0000000006) closing
[junit4] 2> 792092 INFO (zkCallback-1990-thread-2-processing-n:127.0.0.1:52256_solr) [n:127.0.0.1:52256_solr ] o.a.s.c.OverseerElectionContext I am going to be the leader 127.0.0.1:52256_solr
[junit4] 2> 792095 INFO (zkCallback-1990-thread-2-processing-n:127.0.0.1:52256_solr) [n:127.0.0.1:52256_solr ] o.a.s.c.Overseer Overseer (id=98308572287008779-127.0.0.1:52256_solr-n_0000000007) starting
[junit4] 2> 792103 INFO (OverseerCollectionConfigSetProcessor-98308572287008779-127.0.0.1:52256_solr-n_0000000007) [n:127.0.0.1:52256_solr ] o.a.s.c.OverseerNodePrioritizer prioritizing overseer nodes at 98308572287008779-127.0.0.1:52256_solr-n_0000000007 overseer designates are [127.0.0.1:52258_solr, 127.0.0.1:52265_solr, 127.0.0.1:52262_solr]
[junit4] 2> 792104 INFO (OverseerCollectionConfigSetProcessor-98308572287008779-127.0.0.1:52256_solr-n_0000000007) [n:127.0.0.1:52256_solr ] o.a.s.c.OverseerNodePrioritizer sorted nodes [98308572287008779-127.0.0.1:52256_solr-n_0000000007, 98308572287008777-127.0.0.1:52265_solr-n_0000000008, 98308572287008778-127.0.0.1:52262_solr-n_0000000009]
[junit4] 2> 792106 INFO (OverseerStateUpdate-98308572287008779-127.0.0.1:52256_solr-n_0000000007) [n:127.0.0.1:52256_solr ] o.a.s.c.Overseer Quit command received {
[junit4] 2> "operation":"quit",
[junit4] 2> "id":"98308572287008779-127.0.0.1:52256_solr-n_0000000007"} 127.0.0.1:52256_solr
[junit4] 2> 792107 INFO (OverseerStateUpdate-98308572287008779-127.0.0.1:52256_solr-n_0000000007) [n:127.0.0.1:52256_solr ] o.a.s.c.Overseer Overseer Loop exiting : 127.0.0.1:52256_solr
[junit4] 2> 792109 WARN (OverseerExitThread) [n:127.0.0.1:52256_solr ] o.a.s.c.Overseer I'm exiting, but I'm still the leader
[junit4] 2> 792110 INFO (OverseerExitThread) [n:127.0.0.1:52256_solr ] o.a.s.c.Overseer Overseer (id=98308572287008779-127.0.0.1:52256_solr-n_0000000007) closing
[junit4] 2> 792112 INFO (zkCallback-1989-thread-1-processing-n:127.0.0.1:52265_solr) [n:127.0.0.1:52265_solr ] o.a.s.c.OverseerElectionContext I am going to be the leader 127.0.0.1:52265_solr
[junit4] 2> 792114 INFO (zkCallback-1989-thread-1-processing-n:127.0.0.1:52265_solr) [n:127.0.0.1:52265_solr ] o.a.s.c.Overseer Overseer (id=98308572287008777-127.0.0.1:52265_solr-n_0000000008) starting
[junit4] 2> 807155 INFO (TEST-OverseerRolesTest.testOverseerRole-seed#[EA68968DD27CEB1A]) [ ] o.a.s.SolrTestCaseJ4 ###Ending testOverseerRole
[junit4] 2> NOTE: reproduce with: ant test -Dtestcase=OverseerRolesTest -Dtests.method=testOverseerRole -Dtests.seed=EA68968DD27CEB1A -Dtests.slow=true -Dtests.locale=es -Dtests.timezone=Australia/Queensland -Dtests.asserts=true -Dtests.file.encoding=US-ASCII
[junit4] FAILURE 15.4s J0 | OverseerRolesTest.testOverseerRole <<<
[junit4] > Throwable #1: java.lang.AssertionError: Timed out waiting for overseer state change
[junit4] > at __randomizedtesting.SeedInfo.seed([EA68968DD27CEB1A:BA36B19E9CFDDCB]:0)
[junit4] > at org.apache.solr.cloud.OverseerRolesTest.waitForNewOverseer(OverseerRolesTest.java:62)
[junit4] > at org.apache.solr.cloud.OverseerRolesTest.testOverseerRole(OverseerRolesTest.java:140)
[junit4] > at java.lang.Thread.run(Thread.java:748)
[junit4] 2> 807201 INFO (jetty-closer-1971-thread-1) [ ] o.e.j.s.AbstractConnector Stopped ServerConnector@46efa26c{HTTP/1.1,[http/1.1]}{127.0.0.1:0}
[junit4] 2> 807207 INFO (jetty-closer-1971-thread-1) [ ] o.a.s.c.CoreContainer Shutting down CoreContainer instance=187646584
[junit4] 2> 807208 INFO (jetty-closer-1971-thread-1) [ ] o.a.s.m.SolrMetricManager Closing metric reporters for registry=solr.node, tag=null
[junit4] 2> 807208 INFO (jetty-closer-1971-thread-1) [ ] o.a.s.m.SolrMetricManager Closing metric reporters for registry=solr.jvm, tag=null
[junit4] 2> 807209 INFO (jetty-closer-1971-thread-1) [ ] o.a.s.m.SolrMetricManager Closing metric reporters for registry=solr.jetty, tag=null
[junit4] 2> 807213 INFO (jetty-closer-1971-thread-4) [ ] o.e.j.s.AbstractConnector Stopped ServerConnector@31b24509{HTTP/1.1,[http/1.1]}{127.0.0.1:0}
[junit4] 2> 807214 INFO (jetty-closer-1971-thread-4) [ ] o.a.s.c.CoreContainer Shutting down CoreContainer instance=1515116053
[junit4] 2> 807215 INFO (jetty-closer-1971-thread-2) [ ] o.e.j.s.AbstractConnector Stopped ServerConnector@3b2aba81{HTTP/1.1,[http/1.1]}{127.0.0.1:0}
[junit4] 2> 807215 INFO (jetty-closer-1971-thread-2) [ ] o.a.s.c.CoreContainer Shutting down CoreContainer instance=1866703798
[junit4] 2> 807216 INFO (jetty-closer-1971-thread-4) [ ] o.a.s.m.SolrMetricManager Closing metric reporters for registry=solr.node, tag=null
[junit4] 2> 807216 INFO (jetty-closer-1971-thread-2) [ ] o.a.s.m.SolrMetricManager Closing metric reporters for registry=solr.node, tag=null
[junit4] 2> 807218 INFO (jetty-closer-1971-thread-1) [ ] o.a.s.m.SolrMetricManager Closing metric reporters for registry=solr.cluster, tag=null
[junit4] 2> 807218 INFO (jetty-closer-1971-thread-1) [ ] o.a.s.c.TransientSolrCoreCacheDefault Allocating transient cache for 2147483647 transient cores
[junit4] 2> 807222 INFO (jetty-closer-1971-thread-1) [ ] o.a.s.c.Overseer Overseer (id=98308572287008777-127.0.0.1:52265_solr-n_0000000008) closing
[junit4] 2> 807235 INFO (OverseerStateUpdate-98308572287008777-127.0.0.1:52265_solr-n_0000000008) [n:127.0.0.1:52265_solr ] o.a.s.c.Overseer Overseer Loop exiting : 127.0.0.1:52265_solr
[junit4] 2> 807263 WARN (zkCallback-1989-thread-1-processing-n:127.0.0.1:52265_solr) [n:127.0.0.1:52265_solr ] o.a.s.c.c.ZkStateReader ZooKeeper watch triggered, but Solr cannot talk to ZK: [KeeperErrorCode = Session expired for /live_nodes]
[junit4] 2> 807265 INFO (jetty-closer-1971-thread-1) [ ] o.e.j.s.h.ContextHandler Stopped o.e.j.s.ServletContextHandler@64e3b97e{/solr,null,UNAVAILABLE}
[junit4] 2> 807272 INFO (zkCallback-1992-thread-1-processing-n:127.0.0.1:52262_solr) [n:127.0.0.1:52262_solr ] o.a.s.c.c.ZkStateReader Updated live nodes from ZooKeeper... (3) -> (2)
[junit4] 2> 807272 INFO (zkCallback-1990-thread-2-processing-n:127.0.0.1:52256_solr) [n:127.0.0.1:52256_solr ] o.a.s.c.c.ZkStateReader Updated live nodes from ZooKeeper... (3) -> (2)
[junit4] 2> 807272 INFO (zkCallback-1992-thread-2-processing-n:127.0.0.1:52262_solr) [n:127.0.0.1:52262_solr ] o.a.s.c.OverseerElectionContext I am going to be the leader 127.0.0.1:52262_solr
[junit4] 2> 807345 INFO (jetty-closer-1971-thread-2) [ ] o.a.s.m.SolrMetricManager Closing metric reporters for registry=solr.jvm, tag=null
[junit4] 2> 807345 INFO (jetty-closer-1971-thread-4) [ ] o.a.s.m.SolrMetricManager Closing metric reporters for registry=solr.jvm, tag=null
[junit4] 2> 807348 INFO (jetty-closer-1971-thread-2) [ ] o.a.s.m.SolrMetricManager Closing metric reporters for registry=solr.jetty, tag=null
[junit4] 2> 807348 INFO (jetty-closer-1971-thread-4) [ ] o.a.s.m.SolrMetricManager Closing metric reporters for registry=solr.jetty, tag=null
[junit4] 2> 807356 INFO (jetty-closer-1971-thread-2) [ ] o.a.s.m.SolrMetricManager Closing metric reporters for registry=solr.cluster, tag=null
[junit4] 2> 807357 INFO (jetty-closer-1971-thread-2) [ ] o.a.s.c.TransientSolrCoreCacheDefault Allocating transient cache for 2147483647 transient cores
[junit4] 2> 807356 INFO (jetty-closer-1971-thread-4) [ ] o.a.s.m.SolrMetricManager Closing metric reporters for registry=solr.cluster, tag=null
[junit4] 2> 807357 INFO (jetty-closer-1971-thread-4) [ ] o.a.s.c.TransientSolrCoreCacheDefault Allocating transient cache for 2147483647 transient cores
[junit4] 2> 807373 WARN (zkCallback-1990-thread-2-processing-n:127.0.0.1:52256_solr) [n:127.0.0.1:52256_solr ] o.a.s.c.c.ZkStateReader ZooKeeper watch triggered, but Solr cannot talk to ZK: [KeeperErrorCode = Session expired for /live_nodes]
[junit4] 2> 807375 WARN (zkCallback-1992-thread-2-processing-n:127.0.0.1:52262_solr) [n:127.0.0.1:52262_solr ] o.a.s.c.c.ZkStateReader ZooKeeper watch triggered, but Solr cannot talk to ZK: [KeeperErrorCode = Session expired for /live_nodes]
[junit4] 2> 807376 INFO (jetty-closer-1971-thread-2) [ ] o.e.j.s.h.ContextHandler Stopped o.e.j.s.ServletContextHandler@59c2e19a{/solr,null,UNAVAILABLE}
[junit4] 2> 807376 INFO (jetty-closer-1971-thread-4) [ ] o.e.j.s.h.ContextHandler Stopped o.e.j.s.ServletContextHandler@4f0a8ea4{/solr,null,UNAVAILABLE}
[junit4] 2> 807420 ERROR (SUITE-OverseerRolesTest-seed#[EA68968DD27CEB1A]-worker) [ ] o.a.z.s.ZooKeeperServer ZKShutdownHandler is not registered, so ZooKeeper server won't take any action on ERROR or SHUTDOWN server state changes
[junit4] 2> 807420 INFO (SUITE-OverseerRolesTest-seed#[EA68968DD27CEB1A]-worker) [ ] o.a.s.c.ZkTestServer connecting to 127.0.0.1:52252 52252
[junit4] 2> 807425 INFO (Thread-2023) [ ] o.a.s.c.ZkTestServer connecting to 127.0.0.1:52252 52252
[junit4] 2> 807428 WARN (Thread-2023) [ ] o.a.s.c.ZkTestServer Watch limit violations:
[junit4] 2> Maximum concurrent create/delete watches above limit:
[junit4] 2>
[junit4] 2> 5 /solr/aliases.json
[junit4] 2> 5 /solr/clusterprops.json
[junit4] 2> 4 /solr/security.json
[junit4] 2>
[junit4] 2> Maximum concurrent data watches above limit:
[junit4] 2>
[junit4] 2> 5 /solr/clusterstate.json
[junit4] 2>
[junit4] 2> Maximum concurrent children watches above limit:
[junit4] 2>
[junit4] 2> 9 /solr/overseer/queue-work
[junit4] 2> 5 /solr/live_nodes
[junit4] 2> 5 /solr/collections
[junit4] 2> 5 /solr/overseer/collection-queue-work
[junit4] 2> 2 /solr/overseer/queue
[junit4] 2>
[junit4] 2> NOTE: leaving temporary files on disk at: C:\Users\jenkins\workspace\Lucene-Solr-7.x-Windows\solr\build\solr-core\test\J0\temp\solr.cloud.OverseerRolesTest_EA68968DD27CEB1A-001
[junit4] 2> Jul 14, 2017 10:03:03 PM com.carrotsearch.randomizedtesting.ThreadLeakControl checkThreadLeaks
[junit4] 2> WARNING: Will linger awaiting termination of 3 leaked thread(s).
[junit4] 2> NOTE: test params are: codec=CheapBastard, sim=RandomSimilarity(queryNorm=true): {}, locale=es, timezone=Australia/Queensland
[junit4] 2> NOTE: Windows 10 10.0 amd64/Oracle Corporation 1.8.0_131 (64-bit)/cpus=3,threads=1,free=64433040,total=315461632
[junit4] 2> NOTE: All tests run in this JVM: [TestNumericRangeQuery64, TestConfigsApi, ResourceLoaderTest, BJQParserTest, CollectionTooManyReplicasTest, TestReplicationHandler, TestCoreContainer, WordBreakSolrSpellCheckerTest, ConnectionReuseTest, RankQueryTest, RequestLoggingTest, TestFieldCacheSortRandom, TestNRTOpen, TestPullReplicaErrorHandling, UniqFieldsUpdateProcessorFactoryTest, CdcrReplicationHandlerTest, TestLMDirichletSimilarityFactory, CircularListTest, TestQuerySenderListener, DistributedQueryComponentCustomSortTest, TestAtomicUpdateErrorCases, ZkControllerTest, TestPayloadCheckQParserPlugin, HdfsChaosMonkeySafeLeaderTest, HdfsNNFailoverTest, HdfsBasicDistributedZkTest, TestCloudDeleteByQuery, TestDynamicLoading, TestSurroundQueryParser, ShardSplitTest, DistributedDebugComponentTest, TestBulkSchemaAPI, TestGroupingSearch, TestPHPSerializedResponseWriter, TestMiniSolrCloudClusterSSL, ResponseLogComponentTest, TestSQLHandler, TestSearcherReuse, DirectUpdateHandlerOptimizeTest, TestSchemalessBufferedUpdates, TimeZoneUtilsTest, SolrShardReporterTest, TestCopyFieldCollectionResource, PreAnalyzedUpdateProcessorTest, TestHdfsCloudBackupRestore, TestUseDocValuesAsStored2, XmlUpdateRequestHandlerTest, TestHighlightDedupGrouping, TestFilteredDocIdSet, DirectUpdateHandlerTest, TestOmitPositions, BinaryUpdateRequestHandlerTest, CdcrVersionReplicationTest, TestCorePropertiesReload, TestFieldCacheWithThreads, TestLocalFSCloudBackupRestore, TestRandomDVFaceting, TestManagedSchemaAPI, PreAnalyzedFieldManagedSchemaCloudTest, TestNumericTerms32, TestDeleteCollectionOnDownNodes, TestMultiValuedNumericRangeQuery, TestSolrConfigHandler, RequestHandlersTest, OverseerRolesTest]
[junit4] Completed [190/728 (1!)] on J0 in 16.61s, 1 test, 1 failure <<< FAILURES!
[...truncated 1254 lines...]
[junit4] Suite: org.apache.solr.core.ExitableDirectoryReaderTest
[junit4] 2> Creating dataDir: C:\Users\jenkins\workspace\Lucene-Solr-7.x-Windows\solr\build\solr-core\test\J1\temp\solr.core.ExitableDirectoryReaderTest_EA68968DD27CEB1A-001\init-core-data-001
[junit4] 2> 2486911 INFO (SUITE-ExitableDirectoryReaderTest-seed#[EA68968DD27CEB1A]-worker) [ ] o.a.s.SolrTestCaseJ4 Using PointFields (NUMERIC_POINTS_SYSPROP=true) w/NUMERIC_DOCVALUES_SYSPROP=true
[junit4] 2> 2486913 INFO (SUITE-ExitableDirectoryReaderTest-seed#[EA68968DD27CEB1A]-worker) [ ] o.a.s.SolrTestCaseJ4 Randomized ssl (false) and clientAuth (false) via: @org.apache.solr.util.RandomizeSSL(reason=, value=NaN, ssl=NaN, clientAuth=NaN)
[junit4] 2> 2486915 INFO (SUITE-ExitableDirectoryReaderTest-seed#[EA68968DD27CEB1A]-worker) [ ] o.a.s.SolrTestCaseJ4 ####initCore
[junit4] 2> 2486916 INFO (SUITE-ExitableDirectoryReaderTest-seed#[EA68968DD27CEB1A]-worker) [ ] o.a.s.c.SolrResourceLoader [null] Added 2 libs to classloader, from paths: [/C:/Users/jenkins/workspace/Lucene-Solr-7.x-Windows/solr/core/src/test-files/solr/collection1/lib, /C:/Users/jenkins/workspace/Lucene-Solr-7.x-Windows/solr/core/src/test-files/solr/collection1/lib/classes]
[junit4] 2> 2486955 ERROR (Finalizer) [ ] o.a.s.c.CoreContainer CoreContainer was not close prior to finalize(), indicates a bug -- POSSIBLE RESOURCE LEAK!!! instance=1700873558
[junit4] 2> 2486990 INFO (SUITE-ExitableDirectoryReaderTest-seed#[EA68968DD27CEB1A]-worker) [ ] o.a.s.c.SolrConfig Using Lucene MatchVersion: 7.1.0
[jun
[...truncated too long message...]
apache.solr.update.processor.FieldMutatingUpdateProcessor.processAdd(FieldMutatingUpdateProcessor.java:118)
[junit4] > at org.apache.solr.update.processor.UpdateRequestProcessor.processAdd(UpdateRequestProcessor.java:55)
[junit4] > at org.apache.solr.update.processor.FieldMutatingUpdateProcessor.processAdd(FieldMutatingUpdateProcessor.java:118)
[junit4] > at org.apache.solr.update.processor.UpdateRequestProcessor.processAdd(UpdateRequestProcessor.java:55)
[junit4] > at org.apache.solr.update.processor.FieldMutatingUpdateProcessor.processAdd(FieldMutatingUpdateProcessor.java:118)
[junit4] > at org.apache.solr.update.processor.UpdateRequestProcessor.processAdd(UpdateRequestProcessor.java:55)
[junit4] > at org.apache.solr.update.processor.FieldMutatingUpdateProcessor.processAdd(FieldMutatingUpdateProcessor.java:118)
[junit4] > at org.apache.solr.update.processor.UpdateRequestProcessor.processAdd(UpdateRequestProcessor.java:55)
[junit4] > at org.apache.solr.update.processor.FieldNameMutatingUpdateProcessorFactory$1.processAdd(FieldNameMutatingUpdateProcessorFactory.java:74)
[junit4] > at org.apache.solr.update.processor.UpdateRequestProcessor.processAdd(UpdateRequestProcessor.java:55)
[junit4] > at org.apache.solr.update.processor.FieldMutatingUpdateProcessor.processAdd(FieldMutatingUpdateProcessor.java:118)
[junit4] > at org.apache.solr.update.processor.UpdateRequestProcessor.processAdd(UpdateRequestProcessor.java:55)
[junit4] > at org.apache.solr.update.processor.AbstractDefaultValueUpdateProcessorFactory$DefaultValueUpdateProcessor.processAdd(AbstractDefaultValueUpdateProcessorFactory.java:91)
[junit4] > at org.apache.solr.handler.loader.JavabinLoader$1.update(JavabinLoader.java:98)
[junit4] > at org.apache.solr.client.solrj.request.JavaBinUpdateRequestCodec$1.readOuterMostDocIterator(JavaBinUpdateRequestCodec.java:188)
[junit4] > at org.apache.solr.client.solrj.request.JavaBinUpdateRequestCodec$1.readIterator(JavaBinUpdateRequestCodec.java:144)
[junit4] > at org.apache.solr.common.util.JavaBinCodec.readObject(JavaBinCodec.java:311)
[junit4] > at org.apache.solr.common.util.JavaBinCodec.readVal(JavaBinCodec.java:256)
[junit4] > at org.apache.solr.client.solrj.request.JavaBinUpdateRequestCodec$1.readNamedList(JavaBinUpdateRequestCodec.java:130)
[junit4] > at org.apache.solr.common.util.JavaBinCodec.readObject(JavaBinCodec.java:276)
[junit4] > at org.apache.solr.common.util.JavaBinCodec.readVal(JavaBinCodec.java:256)
[junit4] > at org.apache.solr.common.util.JavaBinCodec.unmarshal(JavaBinCodec.java:178)
[junit4] > at org.apache.solr.client.solrj.request.JavaBinUpdateRequestCodec.unmarshal(JavaBinUpdateRequestCodec.java:195)
[junit4] > at org.apache.solr.handler.loader.JavabinLoader.parseAndLoadDocs(JavabinLoader.java:108)
[junit4] > at org.apache.solr.handler.loader.JavabinLoader.load(JavabinLoader.java:55)
[junit4] > at org.apache.solr.handler.UpdateRequestHandler$1.load(UpdateRequestHandler.java:97)
[junit4] > at org.apache.solr.handler.ContentStreamHandlerBase.handleRequestBody(ContentStreamHandlerBase.java:68)
[junit4] > at org.apache.solr.handler.RequestHandlerBase.handleRequest(RequestHandlerBase.java:177)
[junit4] > at org.apache.solr.core.SolrCore.execute(SolrCore.java:2473)
[junit4] > at org.apache.solr.servlet.HttpSolrCall.execute(HttpSolrCall.java:720)
[junit4] > at org.apache.solr.servlet.HttpSolrCall.call(HttpSolrCall.java:526)
[junit4] > at org.apache.solr.servlet.SolrDispatchFilter.doFilter(SolrDispatchFilter.java:378)
[junit4] > at org.apache.solr.servlet.SolrDispatchFilter.doFilter(SolrDispatchFilter.java:322)
[junit4] > at org.eclipse.jetty.servlet.ServletHandler$CachedChain.doFilter(ServletHandler.java:1699)
[junit4] > at org.apache.solr.client.solrj.embedded.JettySolrRunner$DebugFilter.doFilter(JettySolrRunner.java:139)
[junit4] > at org.eclipse.jetty.servlet.ServletHandler$CachedChain.doFilter(ServletHandler.java:1699)
[junit4] > at org.eclipse.jetty.servlet.ServletHandler.doHandle(ServletHandler.java:582)
[junit4] > at org.eclipse.jetty.server.session.SessionHandler.doHandle(SessionHandler.java:224)
[junit4] > at org.eclipse.jetty.server.handler.ContextHandler.doHandle(ContextHandler.java:1180)
[junit4] > at org.eclipse.jetty.servlet.ServletHandler.doScope(ServletHandler.java:512)
[junit4] > at org.eclipse.jetty.server.session.SessionHandler.doScope(SessionHandler.java:185)
[junit4] > at org.eclipse.jetty.server.handler.ContextHandler.doScope(ContextHandler.java:1112)
[junit4] > at org.eclipse.jetty.server.handler.ScopedHandler.handle(ScopedHandler.java:141)
[junit4] > at org.eclipse.jetty.server.handler.gzip.GzipHandler.handle(GzipHandler.java:395)
[junit4] > at org.eclipse.jetty.server.handler.HandlerWrapper.handle(HandlerWrapper.java:134)
[junit4] > at org.eclipse.jetty.server.Server.handle(Server.java:534)
[junit4] > at org.eclipse.jetty.server.HttpChannel.handle(HttpChannel.java:320)
[junit4] > at org.eclipse.jetty.server.HttpConnection.onFillable(HttpConnection.java:251)
[junit4] > at org.eclipse.jetty.io.AbstractConnection$ReadCallback.succeeded(AbstractConnection.java:273)
[junit4] > at org.eclipse.jetty.io.FillInterest.fillable(FillInterest.java:95)
[junit4] > at org.eclipse.jetty.io.SelectChannelEndPoint$2.run(SelectChannelEndPoint.java:93)
[junit4] > at org.eclipse.jetty.util.thread.strategy.ExecuteProduceConsume.executeProduceConsume(ExecuteProduceConsume.java:303)
[junit4] > at org.eclipse.jetty.util.thread.strategy.ExecuteProduceConsume.produceConsume(ExecuteProduceConsume.java:148)
[junit4] > at org.eclipse.jetty.util.thread.strategy.ExecuteProduceConsume.run(ExecuteProduceConsume.java:136)
[junit4] > at org.eclipse.jetty.util.thread.QueuedThreadPool.runJob(QueuedThreadPool.java:671)
[junit4] > at org.eclipse.jetty.util.thread.QueuedThreadPool$2.run(QueuedThreadPool.java:589)
[junit4] > at java.lang.Thread.run(Thread.java:748)
[junit4] > at __randomizedtesting.SeedInfo.seed([EA68968DD27CEB1A]:0)
[junit4] > at org.apache.solr.SolrTestCaseJ4.teardownTestCases(SolrTestCaseJ4.java:296)
[junit4] > at java.lang.Thread.run(Thread.java:748)Throwable #2: java.io.IOException: Could not remove the following files (in the order of attempts):
[junit4] > C:\Users\jenkins\workspace\Lucene-Solr-7.x-Windows\solr\build\solr-core\test\J1\temp\solr.util.TestSolrCLIRunExample_EA68968DD27CEB1A-001\tempDir-004\node1\testCloudExamplePrompt_shard1_replica_n2\data\tlog\tlog.0000000000000000000: java.nio.file.FileSystemException: C:\Users\jenkins\workspace\Lucene-Solr-7.x-Windows\solr\build\solr-core\test\J1\temp\solr.util.TestSolrCLIRunExample_EA68968DD27CEB1A-001\tempDir-004\node1\testCloudExamplePrompt_shard1_replica_n2\data\tlog\tlog.0000000000000000000: The process cannot access the file because it is being used by another process.
[junit4] > C:\Users\jenkins\workspace\Lucene-Solr-7.x-Windows\solr\build\solr-core\test\J1\temp\solr.util.TestSolrCLIRunExample_EA68968DD27CEB1A-001\tempDir-004\node1\testCloudExamplePrompt_shard1_replica_n2\data\tlog: java.nio.file.DirectoryNotEmptyException: C:\Users\jenkins\workspace\Lucene-Solr-7.x-Windows\solr\build\solr-core\test\J1\temp\solr.util.TestSolrCLIRunExample_EA68968DD27CEB1A-001\tempDir-004\node1\testCloudExamplePrompt_shard1_replica_n2\data\tlog
[junit4] > C:\Users\jenkins\workspace\Lucene-Solr-7.x-Windows\solr\build\solr-core\test\J1\temp\solr.util.TestSolrCLIRunExample_EA68968DD27CEB1A-001\tempDir-004\node1\testCloudExamplePrompt_shard1_replica_n2\data: java.nio.file.DirectoryNotEmptyException: C:\Users\jenkins\workspace\Lucene-Solr-7.x-Windows\solr\build\solr-core\test\J1\temp\solr.util.TestSolrCLIRunExample_EA68968DD27CEB1A-001\tempDir-004\node1\testCloudExamplePrompt_shard1_replica_n2\data
[junit4] > C:\Users\jenkins\workspace\Lucene-Solr-7.x-Windows\solr\build\solr-core\test\J1\temp\solr.util.TestSolrCLIRunExample_EA68968DD27CEB1A-001\tempDir-004\node1\testCloudExamplePrompt_shard1_replica_n2: java.nio.file.DirectoryNotEmptyException: C:\Users\jenkins\workspace\Lucene-Solr-7.x-Windows\solr\build\solr-core\test\J1\temp\solr.util.TestSolrCLIRunExample_EA68968DD27CEB1A-001\tempDir-004\node1\testCloudExamplePrompt_shard1_replica_n2
[junit4] > C:\Users\jenkins\workspace\Lucene-Solr-7.x-Windows\solr\build\solr-core\test\J1\temp\solr.util.TestSolrCLIRunExample_EA68968DD27CEB1A-001\tempDir-004\node1: java.nio.file.DirectoryNotEmptyException: C:\Users\jenkins\workspace\Lucene-Solr-7.x-Windows\solr\build\solr-core\test\J1\temp\solr.util.TestSolrCLIRunExample_EA68968DD27CEB1A-001\tempDir-004\node1
[junit4] > C:\Users\jenkins\workspace\Lucene-Solr-7.x-Windows\solr\build\solr-core\test\J1\temp\solr.util.TestSolrCLIRunExample_EA68968DD27CEB1A-001\tempDir-004: java.nio.file.DirectoryNotEmptyException: C:\Users\jenkins\workspace\Lucene-Solr-7.x-Windows\solr\build\solr-core\test\J1\temp\solr.util.TestSolrCLIRunExample_EA68968DD27CEB1A-001\tempDir-004
[junit4] > C:\Users\jenkins\workspace\Lucene-Solr-7.x-Windows\solr\build\solr-core\test\J1\temp\solr.util.TestSolrCLIRunExample_EA68968DD27CEB1A-001: java.nio.file.DirectoryNotEmptyException: C:\Users\jenkins\workspace\Lucene-Solr-7.x-Windows\solr\build\solr-core\test\J1\temp\solr.util.TestSolrCLIRunExample_EA68968DD27CEB1A-001
[junit4] > at org.apache.lucene.util.IOUtils.rm(IOUtils.java:329)
[junit4] > at java.lang.Thread.run(Thread.java:748)
[junit4] Completed [728/728 (3!)] on J1 in 51.29s, 4 tests, 1 failure, 1 error <<< FAILURES!
[...truncated 43339 lines...]