You are viewing a plain text version of this content. The canonical link for it is here.
Posted to dev@poi.apache.org by Apache Jenkins Server <je...@builds.apache.org> on 2026/03/08 07:35:52 UTC

Build failed in Jenkins: POI » POI-DSL-IBM-JDK #305

See <https://ci-builds.apache.org/job/POI/job/POI-DSL-IBM-JDK/305/display/redirect?page=changes>

Changes:

[github] move stress.xls to stress.xlsx (#1021)

[PJ Fanning] Update HWPFDocumentCore.java

[PJ Fanning] Revert "Update HWPFDocumentCore.java"

[github] Remove stress xls (#1022)

[github] support opening hwpf docs by passing passwords (#1017)

[PJ Fanning] add password support

[github] HSLF: support passing password as a param (#1023)

[PJ Fanning] reformat

[PJ Fanning] typo

[PJ Fanning] support upcoming COMPRESS-598 change

[github] Update commons-compress version in index.xml

[github] Add fuzz targets for OSS-Fuzz integration (RLE + FormulaParser) (#1020)

[Dominik Stadler] Log instead of assertion when handling a slightly corrupted wmf-file

[Dominik Stadler] Move fuzz-targets from oss-fuzz to Apache POI


------------------------------------------
[...truncated 303.24 KiB...]
[junitlauncher] Tests run: 2, Failures: 0, Aborted: 0, Skipped: 0, Time elapsed: 0.000000 sec
[junitlauncher] Running org.apache.poi.xssf.util.TestEvilUnclosedBRFixingInputStream
[junitlauncher] 
[junitlauncher] Running org.apache.poi.xssf.util.TestEvilUnclosedBRFixingInputStream
[junitlauncher] Tests run: 3, Failures: 0, Aborted: 0, Skipped: 0, Time elapsed: 0.018000 sec
[junitlauncher] Running org.apache.poi.xssf.util.TestNumericRanges
[junitlauncher] 
[junitlauncher] Running org.apache.poi.xssf.util.TestNumericRanges
[junitlauncher] Tests run: 2, Failures: 0, Aborted: 0, Skipped: 0, Time elapsed: 0.000000 sec
[junitlauncher] Running org.apache.poi.xwpf.TestAllExtendedProperties
[junitlauncher] 
[junitlauncher] Running org.apache.poi.xwpf.TestAllExtendedProperties
[junitlauncher] Tests run: 1, Failures: 0, Aborted: 0, Skipped: 0, Time elapsed: 0.020000 sec
[junitlauncher] Running org.apache.poi.xwpf.TestDocumentProtection
[junitlauncher] 
[junitlauncher] Running org.apache.poi.xwpf.TestDocumentProtection
[junitlauncher] Tests run: 10, Failures: 0, Aborted: 0, Skipped: 0, Time elapsed: 0.259000 sec
[junitlauncher] Running org.apache.poi.xwpf.TestNecessaryOOXMLClasses
[junitlauncher] 
[junitlauncher] Running org.apache.poi.xwpf.TestNecessaryOOXMLClasses
[junitlauncher] Tests run: 1, Failures: 0, Aborted: 0, Skipped: 0, Time elapsed: 0.009000 sec
[junitlauncher] Running org.apache.poi.xwpf.TestPackageCorePropertiesGetKeywords
[junitlauncher] 
[junitlauncher] Running org.apache.poi.xwpf.TestPackageCorePropertiesGetKeywords
[junitlauncher] Tests run: 1, Failures: 0, Aborted: 0, Skipped: 0, Time elapsed: 0.015000 sec
[junitlauncher] Running org.apache.poi.xwpf.TestXWPFBugs
[junitlauncher] 
[junitlauncher] Running org.apache.poi.xwpf.TestXWPFBugs
[junitlauncher] Tests run: 14, Failures: 0, Aborted: 0, Skipped: 0, Time elapsed: 1.719000 sec
[junitlauncher] Running org.apache.poi.xwpf.extractor.TestExternalEntities
[junitlauncher] 
[junitlauncher] Running org.apache.poi.xwpf.extractor.TestExternalEntities
[junitlauncher] Tests run: 1, Failures: 0, Aborted: 0, Skipped: 0, Time elapsed: 0.007000 sec
[junitlauncher] Running org.apache.poi.xwpf.extractor.TestXWPFWordExtractor
[junitlauncher] 
[junitlauncher] Running org.apache.poi.xwpf.extractor.TestXWPFWordExtractor
[junitlauncher] Tests run: 27, Failures: 0, Aborted: 0, Skipped: 0, Time elapsed: 0.388000 sec
[junitlauncher] Running org.apache.poi.xwpf.model.TestMultiSectionHeaders
[junitlauncher] 
[junitlauncher] Running org.apache.poi.xwpf.model.TestMultiSectionHeaders
[junitlauncher] Tests run: 2, Failures: 0, Aborted: 0, Skipped: 0, Time elapsed: 0.002000 sec
[junitlauncher] Running org.apache.poi.xwpf.model.TestXWPFDecorators
[junitlauncher] 
[junitlauncher] Running org.apache.poi.xwpf.model.TestXWPFDecorators
[junitlauncher] Tests run: 2, Failures: 0, Aborted: 0, Skipped: 0, Time elapsed: 0.043000 sec
[junitlauncher] Running org.apache.poi.xwpf.model.TestXWPFHeaderFooterPolicy
[junitlauncher] 
[junitlauncher] Running org.apache.poi.xwpf.model.TestXWPFHeaderFooterPolicy
[junitlauncher] Tests run: 3, Failures: 0, Aborted: 0, Skipped: 0, Time elapsed: 0.115000 sec
[junitlauncher] Running org.apache.poi.xwpf.usermodel.TestChangeTracking
[junitlauncher] 
[junitlauncher] Running org.apache.poi.xwpf.usermodel.TestChangeTracking
[junitlauncher] Tests run: 3, Failures: 0, Aborted: 0, Skipped: 0, Time elapsed: 0.017000 sec
[junitlauncher] Running org.apache.poi.xwpf.usermodel.TestColumn
[junitlauncher] 
[junitlauncher] Running org.apache.poi.xwpf.usermodel.TestColumn
[junitlauncher] Tests run: 4, Failures: 0, Aborted: 0, Skipped: 0, Time elapsed: 0.014000 sec
[junitlauncher] Running org.apache.poi.xwpf.usermodel.TestXWPFAbstractNum
[junitlauncher] 
[junitlauncher] Running org.apache.poi.xwpf.usermodel.TestXWPFAbstractNum
[junitlauncher] Tests run: 1, Failures: 0, Aborted: 0, Skipped: 0, Time elapsed: 0.000000 sec
[junitlauncher] Running org.apache.poi.xwpf.usermodel.TestXWPFBugs
[junitlauncher] 
[junitlauncher] Running org.apache.poi.xwpf.usermodel.TestXWPFBugs
[junitlauncher] Tests run: 15, Failures: 0, Aborted: 0, Skipped: 0, Time elapsed: 0.241000 sec
[junitlauncher] Running org.apache.poi.xwpf.usermodel.TestXWPFChart
[junitlauncher] 
[junitlauncher] Running org.apache.poi.xwpf.usermodel.TestXWPFChart
[junitlauncher] Tests run: 4, Failures: 0, Aborted: 0, Skipped: 0, Time elapsed: 0.034000 sec
[junitlauncher] Running org.apache.poi.xwpf.usermodel.TestXWPFComment
[junitlauncher] 
[junitlauncher] Running org.apache.poi.xwpf.usermodel.TestXWPFComment
[junitlauncher] Tests run: 6, Failures: 0, Aborted: 0, Skipped: 0, Time elapsed: 0.155000 sec
[junitlauncher] Running org.apache.poi.xwpf.usermodel.TestXWPFComments
[junitlauncher] 
[junitlauncher] Running org.apache.poi.xwpf.usermodel.TestXWPFComments
[junitlauncher] Tests run: 2, Failures: 0, Aborted: 0, Skipped: 0, Time elapsed: 0.011000 sec
[junitlauncher] Running org.apache.poi.xwpf.usermodel.TestXWPFDocument
[junitlauncher] 
[junitlauncher] Running org.apache.poi.xwpf.usermodel.TestXWPFDocument
[junitlauncher] Tests run: 28, Failures: 0, Aborted: 0, Skipped: 1, Time elapsed: 0.256000 sec
[junitlauncher] Running org.apache.poi.xwpf.usermodel.TestXWPFEndnote
[junitlauncher] 
[junitlauncher] Running org.apache.poi.xwpf.usermodel.TestXWPFEndnote
[junitlauncher] Tests run: 4, Failures: 0, Aborted: 0, Skipped: 0, Time elapsed: 0.013000 sec
[junitlauncher] Running org.apache.poi.xwpf.usermodel.TestXWPFEndnotes
[junitlauncher] 
[junitlauncher] Running org.apache.poi.xwpf.usermodel.TestXWPFEndnotes
[junitlauncher] Tests run: 2, Failures: 0, Aborted: 0, Skipped: 0, Time elapsed: 0.005000 sec
[junitlauncher] Running org.apache.poi.xwpf.usermodel.TestXWPFFootnote
[junitlauncher] 
[junitlauncher] Running org.apache.poi.xwpf.usermodel.TestXWPFFootnote
[junitlauncher] Tests run: 4, Failures: 0, Aborted: 0, Skipped: 0, Time elapsed: 0.012000 sec
[junitlauncher] Running org.apache.poi.xwpf.usermodel.TestXWPFFootnotes
[junitlauncher] 
[junitlauncher] Running org.apache.poi.xwpf.usermodel.TestXWPFFootnotes
[junitlauncher] Tests run: 3, Failures: 0, Aborted: 0, Skipped: 0, Time elapsed: 0.014000 sec
[junitlauncher] Running org.apache.poi.xwpf.usermodel.TestXWPFHeader
[junitlauncher] 
[junitlauncher] Running org.apache.poi.xwpf.usermodel.TestXWPFHeader
[junitlauncher] Tests run: 6, Failures: 0, Aborted: 0, Skipped: 0, Time elapsed: 0.069000 sec
[junitlauncher] Running org.apache.poi.xwpf.usermodel.TestXWPFHeadings
[junitlauncher] 
[junitlauncher] Running org.apache.poi.xwpf.usermodel.TestXWPFHeadings
[junitlauncher] Tests run: 1, Failures: 0, Aborted: 0, Skipped: 0, Time elapsed: 0.021000 sec
[junitlauncher] Running org.apache.poi.xwpf.usermodel.TestXWPFNumbering
[junitlauncher] 
[junitlauncher] Running org.apache.poi.xwpf.usermodel.TestXWPFNumbering
[junitlauncher] Tests run: 10, Failures: 0, Aborted: 0, Skipped: 0, Time elapsed: 0.068000 sec
[junitlauncher] Running org.apache.poi.xwpf.usermodel.TestXWPFParagraph
[junitlauncher] 
[junitlauncher] Running org.apache.poi.xwpf.usermodel.TestXWPFParagraph
[junitlauncher] Tests run: 32, Failures: 0, Aborted: 0, Skipped: 0, Time elapsed: 0.121000 sec
[junitlauncher] Running org.apache.poi.xwpf.usermodel.TestXWPFPictureData
[junitlauncher] 
[junitlauncher] Running org.apache.poi.xwpf.usermodel.TestXWPFPictureData
[junitlauncher] Tests run: 6, Failures: 0, Aborted: 0, Skipped: 0, Time elapsed: 0.095000 sec
[junitlauncher] Running org.apache.poi.xwpf.usermodel.TestXWPFRun
[junitlauncher] 
[junitlauncher] Running org.apache.poi.xwpf.usermodel.TestXWPFRun
[junitlauncher] Tests run: 42, Failures: 0, Aborted: 0, Skipped: 0, Time elapsed: 0.152000 sec
[junitlauncher] Running org.apache.poi.xwpf.usermodel.TestXWPFSDT
[junitlauncher] 
[junitlauncher] Running org.apache.poi.xwpf.usermodel.TestXWPFSDT
[junitlauncher] Tests run: 8, Failures: 0, Aborted: 0, Skipped: 0, Time elapsed: 0.070000 sec
[junitlauncher] Running org.apache.poi.xwpf.usermodel.TestXWPFSmartTag
[junitlauncher] 
[junitlauncher] Running org.apache.poi.xwpf.usermodel.TestXWPFSmartTag
[junitlauncher] Tests run: 1, Failures: 0, Aborted: 0, Skipped: 0, Time elapsed: 0.006000 sec
[junitlauncher] Running org.apache.poi.xwpf.usermodel.TestXWPFStyles
[junitlauncher] 
[junitlauncher] Running org.apache.poi.xwpf.usermodel.TestXWPFStyles
[junitlauncher] Tests run: 11, Failures: 0, Aborted: 0, Skipped: 0, Time elapsed: 0.080000 sec
[junitlauncher] Running org.apache.poi.xwpf.usermodel.TestXWPFTable
[junitlauncher] 
[junitlauncher] Running org.apache.poi.xwpf.usermodel.TestXWPFTable
[junitlauncher] Tests run: 20, Failures: 0, Aborted: 0, Skipped: 0, Time elapsed: 0.087000 sec
[junitlauncher] Running org.apache.poi.xwpf.usermodel.TestXWPFTableCell
[junitlauncher] 
[junitlauncher] Running org.apache.poi.xwpf.usermodel.TestXWPFTableCell
[junitlauncher] Tests run: 13, Failures: 0, Aborted: 0, Skipped: 0, Time elapsed: 0.041000 sec
[junitlauncher] Running org.apache.poi.xwpf.usermodel.TestXWPFTableRow
[junitlauncher] 
[junitlauncher] Running org.apache.poi.xwpf.usermodel.TestXWPFTableRow
[junitlauncher] Tests run: 9, Failures: 0, Aborted: 0, Skipped: 0, Time elapsed: 0.027000 sec
[junitlauncher] Running org.apache.poi.xwpf.usermodel.TestXWPFTheme
[junitlauncher] 
[junitlauncher] Running org.apache.poi.xwpf.usermodel.TestXWPFTheme
[junitlauncher] Tests run: 1, Failures: 0, Aborted: 0, Skipped: 0, Time elapsed: 0.010000 sec

-test-ooxml-write-testfile:

compile-ooxml-lite:
     [echo] Create ooxml-lite schemas
    [javac] Compiling 1 source file to <https://ci-builds.apache.org/job/POI/job/POI-DSL-IBM-JDK/ws/poi-ooxml-lite/src/main/java9>
     [copy] Copying 1 file to <https://ci-builds.apache.org/job/POI/job/POI-DSL-IBM-JDK/ws/src/resources>
     [copy] Copying 1 file to <https://ci-builds.apache.org/job/POI/job/POI-DSL-IBM-JDK/ws/src/resources>
     [copy] Copying 1 file to <https://ci-builds.apache.org/job/POI/job/POI-DSL-IBM-JDK/ws/src/resources>
    [mkdir] Created dir: <https://ci-builds.apache.org/job/POI/job/POI-DSL-IBM-JDK/ws/build/dist/maven/poi-ooxml-lite>
      [jar] Building jar: <https://ci-builds.apache.org/job/POI/job/POI-DSL-IBM-JDK/305/artifact/build/dist/maven/poi-ooxml-lite/poi-ooxml-lite-6.0.0-SNAPSHOT.jar>
   [delete] Deleting: <https://ci-builds.apache.org/job/POI/job/POI-DSL-IBM-JDK/ws/src/resources/ooxml-lite-report.clazz1>
   [delete] Deleting: <https://ci-builds.apache.org/job/POI/job/POI-DSL-IBM-JDK/ws/src/resources/ooxml-lite-report.clazz2>
   [delete] Deleting: <https://ci-builds.apache.org/job/POI/job/POI-DSL-IBM-JDK/ws/src/resources/ooxml-lite-report.xsb2>

-test-excelant-check:

test-excelant:
[junitlauncher] Mar 08, 2026 7:35:28 AM sun.util.locale.provider.LocaleProviderAdapter <clinit>
[junitlauncher] WARNING: COMPAT locale provider will be removed in a future release
[junitlauncher] Running org.apache.poi.ss.excelant.TestBuildFile
[junitlauncher] 
[junitlauncher] Running org.apache.poi.ss.excelant.TestBuildFile
[junitlauncher] Tests run: 14, Failures: 0, Aborted: 0, Skipped: 0, Time elapsed: 2.649000 sec
[junitlauncher] Running org.apache.poi.ss.excelant.TestExcelAntPrecision
[junitlauncher] 
[junitlauncher] Running org.apache.poi.ss.excelant.TestExcelAntPrecision
[junitlauncher] Tests run: 1, Failures: 0, Aborted: 0, Skipped: 0, Time elapsed: 0.002000 sec
[junitlauncher] Running org.apache.poi.ss.excelant.TestExcelAntSet
[junitlauncher] 
[junitlauncher] Running org.apache.poi.ss.excelant.TestExcelAntSet
[junitlauncher] Tests run: 2, Failures: 0, Aborted: 0, Skipped: 0, Time elapsed: 0.020000 sec
[junitlauncher] Running org.apache.poi.ss.excelant.TestExcelAntSetDoubleCell
[junitlauncher] 
[junitlauncher] Running org.apache.poi.ss.excelant.TestExcelAntSetDoubleCell
[junitlauncher] Tests run: 1, Failures: 0, Aborted: 0, Skipped: 0, Time elapsed: 0.002000 sec
[junitlauncher] Running org.apache.poi.ss.excelant.TestExcelAntUserDefinedFunction
[junitlauncher] 
[junitlauncher] Running org.apache.poi.ss.excelant.TestExcelAntUserDefinedFunction
[junitlauncher] Tests run: 2, Failures: 0, Aborted: 0, Skipped: 0, Time elapsed: 0.003000 sec
[junitlauncher] Running org.apache.poi.ss.excelant.util.TestExcelAntEvaluationResult
[junitlauncher] 
[junitlauncher] Running org.apache.poi.ss.excelant.util.TestExcelAntEvaluationResult
[junitlauncher] Tests run: 4, Failures: 0, Aborted: 0, Skipped: 0, Time elapsed: 0.005000 sec
[junitlauncher] Running org.apache.poi.ss.excelant.util.TestExcelAntWorkbookUtil
[junitlauncher] 
[junitlauncher] Running org.apache.poi.ss.excelant.util.TestExcelAntWorkbookUtil
[junitlauncher] Tests run: 23, Failures: 0, Aborted: 0, Skipped: 0, Time elapsed: 1.062000 sec
[junitlauncher] Running org.apache.poi.ss.excelant.util.TestExcelAntWorkbookUtilFactory
[junitlauncher] 
[junitlauncher] Running org.apache.poi.ss.excelant.util.TestExcelAntWorkbookUtilFactory
[junitlauncher] Tests run: 2, Failures: 0, Aborted: 0, Skipped: 0, Time elapsed: 0.002000 sec

-test-excelant-write-testfile:

test:

compile-integration:
    [javac] Compiling 30 source files to <https://ci-builds.apache.org/job/POI/job/POI-DSL-IBM-JDK/ws/poi-integration/build/test-classes>
    [javac] Ignoring source, target and bootclasspath as release has been set
    [javac] Note: Annotation processing is enabled because one or more processors were found
    [javac]   on the class path. A future release of javac may disable annotation processing
    [javac]   unless at least one processor is specified by name (-processor), or a search
    [javac]   path is specified (--processor-path, --processor-module-path), or annotation
    [javac]   processing is enabled explicitly (-proc:only, -proc:full).
    [javac]   Use -Xlint:-options to suppress this message.
    [javac]   Use -proc:none to disable annotation processing.
    [javac] Note: <https://ci-builds.apache.org/job/POI/job/POI-DSL-IBM-JDK/ws/poi-integration/src/test/java/org/apache/poi/stress/OptimizedNullPrintStream.java> uses or overrides a deprecated API.
    [javac] Note: Recompile with -Xlint:deprecation for details.
    [mkdir] Created dir: <https://ci-builds.apache.org/job/POI/job/POI-DSL-IBM-JDK/ws/poi-integration/build/test-classes/META-INF/versions/9>
    [javac] Compiling 1 source file to <https://ci-builds.apache.org/job/POI/job/POI-DSL-IBM-JDK/ws/poi-integration/build/test-classes/META-INF/versions/9>
      [jar] Building jar: <https://ci-builds.apache.org/job/POI/job/POI-DSL-IBM-JDK/305/artifact/build/dist/maven/poi-integration/poi-integration-6.0.0-SNAPSHOT.jar>

-test-integration-check:

test-integration:
[junitlauncher] Mar 08, 2026 7:35:40 AM sun.util.locale.provider.LocaleProviderAdapter <clinit>
[junitlauncher] WARNING: COMPAT locale provider will be removed in a future release
[junitlauncher] Running org.apache.poi.stress.TestAllFiles
[junitlauncher] 
[junitlauncher] Running org.apache.poi.stress.TestAllFiles
[junitlauncher]    Failed: handleFile(String, FileHandlerKnown, String, Class, String): java.lang.NoClassDefFoundError: org.apache.commons.csv.CSVFormat
[junitlauncher]    Failed: handleAdditional(String, FileHandlerKnown, String, Class, String): java.lang.NoClassDefFoundError: org.apache.commons.csv.CSVFormat
[junitlauncher]    Failed: handleExtracting(String, FileHandlerKnown, String, Class, String): java.lang.NoClassDefFoundError: org.apache.commons.csv.CSVFormat
[junitlauncher] Tests run: 3, Failures: 3, Aborted: 0, Skipped: 0, Time elapsed: 0.103000 sec

BUILD FAILED
<https://ci-builds.apache.org/job/POI/job/POI-DSL-IBM-JDK/ws/build.xml>:1850: The following error occurred while executing this line:
<https://ci-builds.apache.org/job/POI/job/POI-DSL-IBM-JDK/ws/build.xml>:1394: Some test(s) have failure(s)

Total time: 7 minutes 23 seconds
Build step 'Invoke Ant' marked build as failure
[SpotBugs] Skipping execution of recorder since overall result is 'FAILURE'
ERROR: Not all environment variables could be successfully injected. Check for similarly-named environment variables.
Archiving artifacts
ERROR: Not all environment variables could be successfully injected. Check for similarly-named environment variables.
Recording test results
ERROR: Not all environment variables could be successfully injected. Check for similarly-named environment variables.
[Checks API] No suitable checks publisher found.
ERROR: Not all environment variables could be successfully injected. Check for similarly-named environment variables.

---------------------------------------------------------------------
To unsubscribe, e-mail: dev-unsubscribe@poi.apache.org
For additional commands, e-mail: dev-help@poi.apache.org


Jenkins build is back to normal : POI » POI-DSL-IBM-JDK #316

Posted by Apache Jenkins Server <je...@builds.apache.org>.
See <https://ci-builds.apache.org/job/POI/job/POI-DSL-IBM-JDK/316/display/redirect?page=changes>


---------------------------------------------------------------------
To unsubscribe, e-mail: dev-unsubscribe@poi.apache.org
For additional commands, e-mail: dev-help@poi.apache.org


Build failed in Jenkins: POI » POI-DSL-IBM-JDK #315

Posted by Apache Jenkins Server <je...@builds.apache.org>.
See <https://ci-builds.apache.org/job/POI/job/POI-DSL-IBM-JDK/315/display/redirect?page=changes>

Changes:

[github] use long for EmfPlusDrawDriverString glyph byte length (#1098)

[github] remove info losing int casts (#1099)

[github] more int overflow risks (#1100)

[github] more int overflow risks (#1101)

[PJ Fanning] Update HSSFChart.java

[github] more int overflow possibilities (#1102)

[github] boundary handling and decompression limits in CompressedRTF (#1071)

[PJ Fanning] Update CompressedRTF.java

[github] Apply allocation bounds checks to EMF+ path and brush element counts

[github] Fix: XSLFTableCell.setBorderColor Overwrites (#1052)

[github] EscherBSERecord fillFields() to return consumed bytes (#1105)

[PJ Fanning] refactor

[github] Harden integer conversions and arithmetic in HwmfBitmapDib,

[github] Apply allocation bounds checks to EmfPolyDraw and WmfCreateRegion

[github] Modernize test assertions using JUnit 5 assertInstanceOf (#1108)

[github] more 'safe' conversions (#1110)

[github] Close unclosed HSSFWorkbook in TestFormulaParser (#1111)

[PJ Fanning] more safe conversions

[PJ Fanning] Update IOUtils.java

[github] hemf specific limits (#1114)

[PJ Fanning] javadoc

[PJ Fanning] name methods for overriding limits

[PJ Fanning] Update XMLSlideShow.java

[github] HemfPlusPath: validate PointCount before array allocation (#1103)

[github] Use unsigned element count when parsing EscherArrayProperty (#1116)

[github] refactor hssf limit code (#1115)

[github] Enforce ZipSecureFile limits for encrypted temp ZIP streams (#1062)

[github] apply allocation bounds check to EmfExtCreatePen style entries (#1113)

[github] more changes to try to include method names in exceptions (#1118)

[github] more methods names in exceptions (#1119)

[PJ Fanning] more allocation check changes

[github] more allocation changes (#1120)

[PJ Fanning] add javadoc

[PJ Fanning] Update encryption.xml

[PJ Fanning] Update Biff8EncryptionKey.java

[github] more method names in limit exceptions (#1121)

[PJ Fanning] new IOUtils methods

[PJ Fanning] Update security.xml

[PJ Fanning] Update encryption.xml


------------------------------------------
[...truncated 320.58 KiB...]
[junitlauncher] Tests run: 2, Failures: 0, Aborted: 0, Skipped: 0, Time elapsed: 0.001000 sec
[junitlauncher] Running org.apache.poi.xssf.util.TestEvilUnclosedBRFixingInputStream
[junitlauncher] 
[junitlauncher] Running org.apache.poi.xssf.util.TestEvilUnclosedBRFixingInputStream
[junitlauncher] Tests run: 3, Failures: 0, Aborted: 0, Skipped: 0, Time elapsed: 0.026000 sec
[junitlauncher] Running org.apache.poi.xssf.util.TestNumericRanges
[junitlauncher] 
[junitlauncher] Running org.apache.poi.xssf.util.TestNumericRanges
[junitlauncher] Tests run: 2, Failures: 0, Aborted: 0, Skipped: 0, Time elapsed: 0.000000 sec
[junitlauncher] Running org.apache.poi.xwpf.TestAllExtendedProperties
[junitlauncher] 
[junitlauncher] Running org.apache.poi.xwpf.TestAllExtendedProperties
[junitlauncher] Tests run: 1, Failures: 0, Aborted: 0, Skipped: 0, Time elapsed: 0.031000 sec
[junitlauncher] Running org.apache.poi.xwpf.TestDocumentProtection
[junitlauncher] 
[junitlauncher] Running org.apache.poi.xwpf.TestDocumentProtection
[junitlauncher] Tests run: 10, Failures: 0, Aborted: 0, Skipped: 0, Time elapsed: 0.363000 sec
[junitlauncher] Running org.apache.poi.xwpf.TestNecessaryOOXMLClasses
[junitlauncher] 
[junitlauncher] Running org.apache.poi.xwpf.TestNecessaryOOXMLClasses
[junitlauncher] Tests run: 1, Failures: 0, Aborted: 0, Skipped: 0, Time elapsed: 0.009000 sec
[junitlauncher] Running org.apache.poi.xwpf.TestPackageCorePropertiesGetKeywords
[junitlauncher] 
[junitlauncher] Running org.apache.poi.xwpf.TestPackageCorePropertiesGetKeywords
[junitlauncher] Tests run: 1, Failures: 0, Aborted: 0, Skipped: 0, Time elapsed: 0.023000 sec
[junitlauncher] Running org.apache.poi.xwpf.TestXWPFBugs
[junitlauncher] 
[junitlauncher] Running org.apache.poi.xwpf.TestXWPFBugs
[junitlauncher] Tests run: 14, Failures: 0, Aborted: 0, Skipped: 0, Time elapsed: 3.282000 sec
[junitlauncher] Running org.apache.poi.xwpf.extractor.TestExternalEntities
[junitlauncher] 
[junitlauncher] Running org.apache.poi.xwpf.extractor.TestExternalEntities
[junitlauncher] Tests run: 1, Failures: 0, Aborted: 0, Skipped: 0, Time elapsed: 0.011000 sec
[junitlauncher] Running org.apache.poi.xwpf.extractor.TestXWPFWordExtractor
[junitlauncher] 
[junitlauncher] Running org.apache.poi.xwpf.extractor.TestXWPFWordExtractor
[junitlauncher] Tests run: 27, Failures: 0, Aborted: 0, Skipped: 0, Time elapsed: 0.639000 sec
[junitlauncher] Running org.apache.poi.xwpf.model.TestMultiSectionHeaders
[junitlauncher] 
[junitlauncher] Running org.apache.poi.xwpf.model.TestMultiSectionHeaders
[junitlauncher] Tests run: 2, Failures: 0, Aborted: 0, Skipped: 0, Time elapsed: 0.004000 sec
[junitlauncher] Running org.apache.poi.xwpf.model.TestXWPFDecorators
[junitlauncher] 
[junitlauncher] Running org.apache.poi.xwpf.model.TestXWPFDecorators
[junitlauncher] Tests run: 2, Failures: 0, Aborted: 0, Skipped: 0, Time elapsed: 0.079000 sec
[junitlauncher] Running org.apache.poi.xwpf.model.TestXWPFHeaderFooterPolicy
[junitlauncher] 
[junitlauncher] Running org.apache.poi.xwpf.model.TestXWPFHeaderFooterPolicy
[junitlauncher] Tests run: 3, Failures: 0, Aborted: 0, Skipped: 0, Time elapsed: 0.191000 sec
[junitlauncher] Running org.apache.poi.xwpf.usermodel.TestChangeTracking
[junitlauncher] 
[junitlauncher] Running org.apache.poi.xwpf.usermodel.TestChangeTracking
[junitlauncher] Tests run: 3, Failures: 0, Aborted: 0, Skipped: 0, Time elapsed: 0.027000 sec
[junitlauncher] Running org.apache.poi.xwpf.usermodel.TestColumn
[junitlauncher] 
[junitlauncher] Running org.apache.poi.xwpf.usermodel.TestColumn
[junitlauncher] Tests run: 4, Failures: 0, Aborted: 0, Skipped: 0, Time elapsed: 0.024000 sec
[junitlauncher] Running org.apache.poi.xwpf.usermodel.TestXWPFAbstractNum
[junitlauncher] 
[junitlauncher] Running org.apache.poi.xwpf.usermodel.TestXWPFAbstractNum
[junitlauncher] Tests run: 1, Failures: 0, Aborted: 0, Skipped: 0, Time elapsed: 0.000000 sec
[junitlauncher] Running org.apache.poi.xwpf.usermodel.TestXWPFBugs
[junitlauncher] 
[junitlauncher] Running org.apache.poi.xwpf.usermodel.TestXWPFBugs
[junitlauncher] Tests run: 15, Failures: 0, Aborted: 0, Skipped: 0, Time elapsed: 0.384000 sec
[junitlauncher] Running org.apache.poi.xwpf.usermodel.TestXWPFChart
[junitlauncher] 
[junitlauncher] Running org.apache.poi.xwpf.usermodel.TestXWPFChart
[junitlauncher] Tests run: 4, Failures: 0, Aborted: 0, Skipped: 0, Time elapsed: 0.058000 sec
[junitlauncher] Running org.apache.poi.xwpf.usermodel.TestXWPFComment
[junitlauncher] 
[junitlauncher] Running org.apache.poi.xwpf.usermodel.TestXWPFComment
[junitlauncher] Tests run: 6, Failures: 0, Aborted: 0, Skipped: 0, Time elapsed: 0.656000 sec
[junitlauncher] Running org.apache.poi.xwpf.usermodel.TestXWPFComments
[junitlauncher] 
[junitlauncher] Running org.apache.poi.xwpf.usermodel.TestXWPFComments
[junitlauncher] Tests run: 2, Failures: 0, Aborted: 0, Skipped: 0, Time elapsed: 0.020000 sec
[junitlauncher] Running org.apache.poi.xwpf.usermodel.TestXWPFDocument
[junitlauncher] 
[junitlauncher] Running org.apache.poi.xwpf.usermodel.TestXWPFDocument
[junitlauncher] Tests run: 28, Failures: 0, Aborted: 0, Skipped: 1, Time elapsed: 0.418000 sec
[junitlauncher] Running org.apache.poi.xwpf.usermodel.TestXWPFEndnote
[junitlauncher] 
[junitlauncher] Running org.apache.poi.xwpf.usermodel.TestXWPFEndnote
[junitlauncher] Tests run: 4, Failures: 0, Aborted: 0, Skipped: 0, Time elapsed: 0.021000 sec
[junitlauncher] Running org.apache.poi.xwpf.usermodel.TestXWPFEndnotes
[junitlauncher] 
[junitlauncher] Running org.apache.poi.xwpf.usermodel.TestXWPFEndnotes
[junitlauncher] Tests run: 2, Failures: 0, Aborted: 0, Skipped: 0, Time elapsed: 0.009000 sec
[junitlauncher] Running org.apache.poi.xwpf.usermodel.TestXWPFFootnote
[junitlauncher] 
[junitlauncher] Running org.apache.poi.xwpf.usermodel.TestXWPFFootnote
[junitlauncher] Tests run: 4, Failures: 0, Aborted: 0, Skipped: 0, Time elapsed: 0.020000 sec
[junitlauncher] Running org.apache.poi.xwpf.usermodel.TestXWPFFootnotes
[junitlauncher] 
[junitlauncher] Running org.apache.poi.xwpf.usermodel.TestXWPFFootnotes
[junitlauncher] Tests run: 3, Failures: 0, Aborted: 0, Skipped: 0, Time elapsed: 0.025000 sec
[junitlauncher] Running org.apache.poi.xwpf.usermodel.TestXWPFHeader
[junitlauncher] 
[junitlauncher] Running org.apache.poi.xwpf.usermodel.TestXWPFHeader
[junitlauncher] Tests run: 6, Failures: 0, Aborted: 0, Skipped: 0, Time elapsed: 0.120000 sec
[junitlauncher] Running org.apache.poi.xwpf.usermodel.TestXWPFHeadings
[junitlauncher] 
[junitlauncher] Running org.apache.poi.xwpf.usermodel.TestXWPFHeadings
[junitlauncher] Tests run: 1, Failures: 0, Aborted: 0, Skipped: 0, Time elapsed: 0.031000 sec
[junitlauncher] Running org.apache.poi.xwpf.usermodel.TestXWPFNumbering
[junitlauncher] 
[junitlauncher] Running org.apache.poi.xwpf.usermodel.TestXWPFNumbering
[junitlauncher] Tests run: 10, Failures: 0, Aborted: 0, Skipped: 0, Time elapsed: 0.111000 sec
[junitlauncher] Running org.apache.poi.xwpf.usermodel.TestXWPFParagraph
[junitlauncher] 
[junitlauncher] Running org.apache.poi.xwpf.usermodel.TestXWPFParagraph
[junitlauncher] Tests run: 33, Failures: 0, Aborted: 0, Skipped: 0, Time elapsed: 0.210000 sec
[junitlauncher] Running org.apache.poi.xwpf.usermodel.TestXWPFPictureData
[junitlauncher] 
[junitlauncher] Running org.apache.poi.xwpf.usermodel.TestXWPFPictureData
[junitlauncher] Tests run: 6, Failures: 0, Aborted: 0, Skipped: 0, Time elapsed: 0.158000 sec
[junitlauncher] Running org.apache.poi.xwpf.usermodel.TestXWPFRun
[junitlauncher] 
[junitlauncher] Running org.apache.poi.xwpf.usermodel.TestXWPFRun
[junitlauncher] Tests run: 43, Failures: 0, Aborted: 0, Skipped: 0, Time elapsed: 0.311000 sec
[junitlauncher] Running org.apache.poi.xwpf.usermodel.TestXWPFSDT
[junitlauncher] 
[junitlauncher] Running org.apache.poi.xwpf.usermodel.TestXWPFSDT
[junitlauncher] Tests run: 8, Failures: 0, Aborted: 0, Skipped: 0, Time elapsed: 0.108000 sec
[junitlauncher] Running org.apache.poi.xwpf.usermodel.TestXWPFSmartTag
[junitlauncher] 
[junitlauncher] Running org.apache.poi.xwpf.usermodel.TestXWPFSmartTag
[junitlauncher] Tests run: 1, Failures: 0, Aborted: 0, Skipped: 0, Time elapsed: 0.010000 sec
[junitlauncher] Running org.apache.poi.xwpf.usermodel.TestXWPFStyles
[junitlauncher] 
[junitlauncher] Running org.apache.poi.xwpf.usermodel.TestXWPFStyles
[junitlauncher] Tests run: 11, Failures: 0, Aborted: 0, Skipped: 0, Time elapsed: 0.125000 sec
[junitlauncher] Running org.apache.poi.xwpf.usermodel.TestXWPFTable
[junitlauncher] 
[junitlauncher] Running org.apache.poi.xwpf.usermodel.TestXWPFTable
[junitlauncher] Tests run: 20, Failures: 0, Aborted: 0, Skipped: 0, Time elapsed: 0.119000 sec
[junitlauncher] Running org.apache.poi.xwpf.usermodel.TestXWPFTableCell
[junitlauncher] 
[junitlauncher] Running org.apache.poi.xwpf.usermodel.TestXWPFTableCell
[junitlauncher] Tests run: 13, Failures: 0, Aborted: 0, Skipped: 0, Time elapsed: 0.058000 sec
[junitlauncher] Running org.apache.poi.xwpf.usermodel.TestXWPFTableRow
[junitlauncher] 
[junitlauncher] Running org.apache.poi.xwpf.usermodel.TestXWPFTableRow
[junitlauncher] Tests run: 9, Failures: 0, Aborted: 0, Skipped: 0, Time elapsed: 0.039000 sec
[junitlauncher] Running org.apache.poi.xwpf.usermodel.TestXWPFTheme
[junitlauncher] 
[junitlauncher] Running org.apache.poi.xwpf.usermodel.TestXWPFTheme
[junitlauncher] Tests run: 1, Failures: 0, Aborted: 0, Skipped: 0, Time elapsed: 0.016000 sec

-test-ooxml-write-testfile:

compile-ooxml-lite:
     [echo] Create ooxml-lite schemas
    [javac] Compiling 1 source file to <https://ci-builds.apache.org/job/POI/job/POI-DSL-IBM-JDK/ws/poi-ooxml-lite/src/main/java9>
     [copy] Copying 1 file to <https://ci-builds.apache.org/job/POI/job/POI-DSL-IBM-JDK/ws/src/resources>
     [copy] Copying 1 file to <https://ci-builds.apache.org/job/POI/job/POI-DSL-IBM-JDK/ws/src/resources>
     [copy] Copying 1 file to <https://ci-builds.apache.org/job/POI/job/POI-DSL-IBM-JDK/ws/src/resources>
    [mkdir] Created dir: <https://ci-builds.apache.org/job/POI/job/POI-DSL-IBM-JDK/ws/build/dist/maven/poi-ooxml-lite>
      [jar] Building jar: <https://ci-builds.apache.org/job/POI/job/POI-DSL-IBM-JDK/315/artifact/build/dist/maven/poi-ooxml-lite/poi-ooxml-lite-6.0.0-SNAPSHOT.jar>
   [delete] Deleting: <https://ci-builds.apache.org/job/POI/job/POI-DSL-IBM-JDK/ws/src/resources/ooxml-lite-report.clazz1>
   [delete] Deleting: <https://ci-builds.apache.org/job/POI/job/POI-DSL-IBM-JDK/ws/src/resources/ooxml-lite-report.clazz2>
   [delete] Deleting: <https://ci-builds.apache.org/job/POI/job/POI-DSL-IBM-JDK/ws/src/resources/ooxml-lite-report.xsb2>

-test-excelant-check:

test-excelant:
[junitlauncher] Jun 08, 2026 7:44:50 AM sun.util.locale.provider.LocaleProviderAdapter <clinit>
[junitlauncher] WARNING: COMPAT locale provider will be removed in a future release
[junitlauncher] Running org.apache.poi.ss.excelant.TestBuildFile
[junitlauncher] 
[junitlauncher] Running org.apache.poi.ss.excelant.TestBuildFile
[junitlauncher] Tests run: 14, Failures: 0, Aborted: 0, Skipped: 0, Time elapsed: 4.374000 sec
[junitlauncher] Running org.apache.poi.ss.excelant.TestExcelAntPrecision
[junitlauncher] 
[junitlauncher] Running org.apache.poi.ss.excelant.TestExcelAntPrecision
[junitlauncher] Tests run: 1, Failures: 0, Aborted: 0, Skipped: 0, Time elapsed: 0.003000 sec
[junitlauncher] Running org.apache.poi.ss.excelant.TestExcelAntSet
[junitlauncher] 
[junitlauncher] Running org.apache.poi.ss.excelant.TestExcelAntSet
[junitlauncher] Tests run: 2, Failures: 0, Aborted: 0, Skipped: 0, Time elapsed: 0.035000 sec
[junitlauncher] Running org.apache.poi.ss.excelant.TestExcelAntSetDoubleCell
[junitlauncher] 
[junitlauncher] Running org.apache.poi.ss.excelant.TestExcelAntSetDoubleCell
[junitlauncher] Tests run: 1, Failures: 0, Aborted: 0, Skipped: 0, Time elapsed: 0.004000 sec
[junitlauncher] Running org.apache.poi.ss.excelant.TestExcelAntUserDefinedFunction
[junitlauncher] 
[junitlauncher] Running org.apache.poi.ss.excelant.TestExcelAntUserDefinedFunction
[junitlauncher] Tests run: 2, Failures: 0, Aborted: 0, Skipped: 0, Time elapsed: 0.004000 sec
[junitlauncher] Running org.apache.poi.ss.excelant.util.TestExcelAntEvaluationResult
[junitlauncher] 
[junitlauncher] Running org.apache.poi.ss.excelant.util.TestExcelAntEvaluationResult
[junitlauncher] Tests run: 4, Failures: 0, Aborted: 0, Skipped: 0, Time elapsed: 0.009000 sec
[junitlauncher] Running org.apache.poi.ss.excelant.util.TestExcelAntWorkbookUtil
[junitlauncher] 
[junitlauncher] Running org.apache.poi.ss.excelant.util.TestExcelAntWorkbookUtil
[junitlauncher] Tests run: 23, Failures: 0, Aborted: 0, Skipped: 0, Time elapsed: 1.598000 sec
[junitlauncher] Running org.apache.poi.ss.excelant.util.TestExcelAntWorkbookUtilFactory
[junitlauncher] 
[junitlauncher] Running org.apache.poi.ss.excelant.util.TestExcelAntWorkbookUtilFactory
[junitlauncher] Tests run: 2, Failures: 0, Aborted: 0, Skipped: 0, Time elapsed: 0.003000 sec

-test-excelant-write-testfile:

test:

compile-integration:
    [javac] Compiling 30 source files to <https://ci-builds.apache.org/job/POI/job/POI-DSL-IBM-JDK/ws/poi-integration/build/test-classes>
    [javac] Ignoring source, target and bootclasspath as release has been set
    [javac] Note: Annotation processing is enabled because one or more processors were found
    [javac]   on the class path. A future release of javac may disable annotation processing
    [javac]   unless at least one processor is specified by name (-processor), or a search
    [javac]   path is specified (--processor-path, --processor-module-path), or annotation
    [javac]   processing is enabled explicitly (-proc:only, -proc:full).
    [javac]   Use -Xlint:-options to suppress this message.
    [javac]   Use -proc:none to disable annotation processing.
    [javac] Note: <https://ci-builds.apache.org/job/POI/job/POI-DSL-IBM-JDK/ws/poi-integration/src/test/java/org/apache/poi/stress/OptimizedNullPrintStream.java> uses or overrides a deprecated API.
    [javac] Note: Recompile with -Xlint:deprecation for details.
    [mkdir] Created dir: <https://ci-builds.apache.org/job/POI/job/POI-DSL-IBM-JDK/ws/poi-integration/build/test-classes/META-INF/versions/9>
    [javac] Compiling 1 source file to <https://ci-builds.apache.org/job/POI/job/POI-DSL-IBM-JDK/ws/poi-integration/build/test-classes/META-INF/versions/9>
      [jar] Building jar: <https://ci-builds.apache.org/job/POI/job/POI-DSL-IBM-JDK/315/artifact/build/dist/maven/poi-integration/poi-integration-6.0.0-SNAPSHOT.jar>

-test-integration-check:

test-integration:
[junitlauncher] Jun 08, 2026 7:45:07 AM sun.util.locale.provider.LocaleProviderAdapter <clinit>
[junitlauncher] WARNING: COMPAT locale provider will be removed in a future release
[junitlauncher] Running org.apache.poi.stress.TestAllFiles
[junitlauncher] 
[junitlauncher] Running org.apache.poi.stress.TestAllFiles
[junitlauncher]    Failed: handleAdditional(String, FileHandlerKnown, String, Class, String): java.lang.NoClassDefFoundError: org.apache.commons.csv.CSVFormat
[junitlauncher]    Failed: handleExtracting(String, FileHandlerKnown, String, Class, String): java.lang.NoClassDefFoundError: org.apache.commons.csv.CSVFormat
[junitlauncher]    Failed: handleFile(String, FileHandlerKnown, String, Class, String): java.lang.NoClassDefFoundError: org.apache.commons.csv.CSVFormat
[junitlauncher] Tests run: 3, Failures: 3, Aborted: 0, Skipped: 0, Time elapsed: 0.150000 sec

BUILD FAILED
<https://ci-builds.apache.org/job/POI/job/POI-DSL-IBM-JDK/ws/build.xml>:1850: The following error occurred while executing this line:
<https://ci-builds.apache.org/job/POI/job/POI-DSL-IBM-JDK/ws/build.xml>:1394: Some test(s) have failure(s)

Total time: 12 minutes 41 seconds
Build step 'Invoke Ant' marked build as failure
[SpotBugs] Skipping execution of recorder since overall result is 'FAILURE'
ERROR: Not all environment variables could be successfully injected. Check for similarly-named environment variables.
Archiving artifacts
ERROR: Not all environment variables could be successfully injected. Check for similarly-named environment variables.
Recording test results
ERROR: Not all environment variables could be successfully injected. Check for similarly-named environment variables.
[Checks API] No suitable checks publisher found.
ERROR: Not all environment variables could be successfully injected. Check for similarly-named environment variables.

---------------------------------------------------------------------
To unsubscribe, e-mail: dev-unsubscribe@poi.apache.org
For additional commands, e-mail: dev-help@poi.apache.org


Build failed in Jenkins: POI » POI-DSL-IBM-JDK #314

Posted by Apache Jenkins Server <je...@builds.apache.org>.
See <https://ci-builds.apache.org/job/POI/job/POI-DSL-IBM-JDK/314/display/redirect?page=changes>

Changes:

[github] Add TestAssertions class and replace assertTrue(x.contains(y)) patterns

[github] Increase use of POITestCase assert methods and assertInstanceOf in tests

[PJ Fanning] OOMs

[PJ Fanning] Update security.xml

[github] Fix out-of-bounds fill in EmfPlusPath RLE point-type expansion (#1082)

[github] HSLF:  reject oversized PersistPtr sheet offsets (#1078)

[github] Handle oversized uint32 offsets in QuillContents descriptors (#1077)

[github] fix spin count loop issue (#1084)

[PJ Fanning] Update AgileEncryptionVerifier.java

[github] fix issue with inflating picture data but the decompressed data is

[github] add inflaterinputstream checks (#1086)

[github] Update ExOleObjStg.java (#1087)

[github] assertInstanceOf (#1088)

[github] Prevent crashes when calculating cells on absolute anchors. (#1089)

[github] Support mc:AlternateContent for XWPFRun.getPictureText(). (#1091)

[github] Implement ImageUtils.getDimensionFromAnchor variation. (#1090)

[github] guard XSSFBUtils wide-string byte length against int overflow (#1079)

[github] add MathUtil (#1092)

[github] add unit test coverage for mathutil and use it in more places (#1093)

[PJ Fanning] more overflow possibilities

[github] Add @Isolated to test classes that mutate static limits (#1094)

[github] Guard Ole10Native readUtf16 byte length against int overflow (#1080)

[PJ Fanning] Update PathGradientPaint.java

[github] use math multiplyexact for multiplication (#1095)

[github] more number conversion changes (#1096)


------------------------------------------
[...truncated 319.34 KiB...]
[junitlauncher] Tests run: 2, Failures: 0, Aborted: 0, Skipped: 0, Time elapsed: 0.001000 sec
[junitlauncher] Running org.apache.poi.xssf.util.TestEvilUnclosedBRFixingInputStream
[junitlauncher] 
[junitlauncher] Running org.apache.poi.xssf.util.TestEvilUnclosedBRFixingInputStream
[junitlauncher] Tests run: 3, Failures: 0, Aborted: 0, Skipped: 0, Time elapsed: 0.014000 sec
[junitlauncher] Running org.apache.poi.xssf.util.TestNumericRanges
[junitlauncher] 
[junitlauncher] Running org.apache.poi.xssf.util.TestNumericRanges
[junitlauncher] Tests run: 2, Failures: 0, Aborted: 0, Skipped: 0, Time elapsed: 0.000000 sec
[junitlauncher] Running org.apache.poi.xwpf.TestAllExtendedProperties
[junitlauncher] 
[junitlauncher] Running org.apache.poi.xwpf.TestAllExtendedProperties
[junitlauncher] Tests run: 1, Failures: 0, Aborted: 0, Skipped: 0, Time elapsed: 0.033000 sec
[junitlauncher] Running org.apache.poi.xwpf.TestDocumentProtection
[junitlauncher] 
[junitlauncher] Running org.apache.poi.xwpf.TestDocumentProtection
[junitlauncher] Tests run: 10, Failures: 0, Aborted: 0, Skipped: 0, Time elapsed: 0.601000 sec
[junitlauncher] Running org.apache.poi.xwpf.TestNecessaryOOXMLClasses
[junitlauncher] 
[junitlauncher] Running org.apache.poi.xwpf.TestNecessaryOOXMLClasses
[junitlauncher] Tests run: 1, Failures: 0, Aborted: 0, Skipped: 0, Time elapsed: 0.008000 sec
[junitlauncher] Running org.apache.poi.xwpf.TestPackageCorePropertiesGetKeywords
[junitlauncher] 
[junitlauncher] Running org.apache.poi.xwpf.TestPackageCorePropertiesGetKeywords
[junitlauncher] Tests run: 1, Failures: 0, Aborted: 0, Skipped: 0, Time elapsed: 0.023000 sec
[junitlauncher] Running org.apache.poi.xwpf.TestXWPFBugs
[junitlauncher] 
[junitlauncher] Running org.apache.poi.xwpf.TestXWPFBugs
[junitlauncher] Tests run: 14, Failures: 0, Aborted: 0, Skipped: 0, Time elapsed: 2.880000 sec
[junitlauncher] Running org.apache.poi.xwpf.extractor.TestExternalEntities
[junitlauncher] 
[junitlauncher] Running org.apache.poi.xwpf.extractor.TestExternalEntities
[junitlauncher] Tests run: 1, Failures: 0, Aborted: 0, Skipped: 0, Time elapsed: 0.023000 sec
[junitlauncher] Running org.apache.poi.xwpf.extractor.TestXWPFWordExtractor
[junitlauncher] 
[junitlauncher] Running org.apache.poi.xwpf.extractor.TestXWPFWordExtractor
[junitlauncher] Tests run: 27, Failures: 0, Aborted: 0, Skipped: 0, Time elapsed: 0.820000 sec
[junitlauncher] Running org.apache.poi.xwpf.model.TestMultiSectionHeaders
[junitlauncher] 
[junitlauncher] Running org.apache.poi.xwpf.model.TestMultiSectionHeaders
[junitlauncher] Tests run: 2, Failures: 0, Aborted: 0, Skipped: 0, Time elapsed: 0.006000 sec
[junitlauncher] Running org.apache.poi.xwpf.model.TestXWPFDecorators
[junitlauncher] 
[junitlauncher] Running org.apache.poi.xwpf.model.TestXWPFDecorators
[junitlauncher] Tests run: 2, Failures: 0, Aborted: 0, Skipped: 0, Time elapsed: 0.061000 sec
[junitlauncher] Running org.apache.poi.xwpf.model.TestXWPFHeaderFooterPolicy
[junitlauncher] 
[junitlauncher] Running org.apache.poi.xwpf.model.TestXWPFHeaderFooterPolicy
[junitlauncher] Tests run: 3, Failures: 0, Aborted: 0, Skipped: 0, Time elapsed: 0.158000 sec
[junitlauncher] Running org.apache.poi.xwpf.usermodel.TestChangeTracking
[junitlauncher] 
[junitlauncher] Running org.apache.poi.xwpf.usermodel.TestChangeTracking
[junitlauncher] Tests run: 3, Failures: 0, Aborted: 0, Skipped: 0, Time elapsed: 0.030000 sec
[junitlauncher] Running org.apache.poi.xwpf.usermodel.TestColumn
[junitlauncher] 
[junitlauncher] Running org.apache.poi.xwpf.usermodel.TestColumn
[junitlauncher] Tests run: 4, Failures: 0, Aborted: 0, Skipped: 0, Time elapsed: 0.020000 sec
[junitlauncher] Running org.apache.poi.xwpf.usermodel.TestXWPFAbstractNum
[junitlauncher] 
[junitlauncher] Running org.apache.poi.xwpf.usermodel.TestXWPFAbstractNum
[junitlauncher] Tests run: 1, Failures: 0, Aborted: 0, Skipped: 0, Time elapsed: 0.000000 sec
[junitlauncher] Running org.apache.poi.xwpf.usermodel.TestXWPFBugs
[junitlauncher] 
[junitlauncher] Running org.apache.poi.xwpf.usermodel.TestXWPFBugs
[junitlauncher] Tests run: 15, Failures: 0, Aborted: 0, Skipped: 0, Time elapsed: 0.329000 sec
[junitlauncher] Running org.apache.poi.xwpf.usermodel.TestXWPFChart
[junitlauncher] 
[junitlauncher] Running org.apache.poi.xwpf.usermodel.TestXWPFChart
[junitlauncher] Tests run: 4, Failures: 0, Aborted: 0, Skipped: 0, Time elapsed: 0.045000 sec
[junitlauncher] Running org.apache.poi.xwpf.usermodel.TestXWPFComment
[junitlauncher] 
[junitlauncher] Running org.apache.poi.xwpf.usermodel.TestXWPFComment
[junitlauncher] Tests run: 6, Failures: 0, Aborted: 0, Skipped: 0, Time elapsed: 0.218000 sec
[junitlauncher] Running org.apache.poi.xwpf.usermodel.TestXWPFComments
[junitlauncher] 
[junitlauncher] Running org.apache.poi.xwpf.usermodel.TestXWPFComments
[junitlauncher] Tests run: 2, Failures: 0, Aborted: 0, Skipped: 0, Time elapsed: 0.016000 sec
[junitlauncher] Running org.apache.poi.xwpf.usermodel.TestXWPFDocument
[junitlauncher] 
[junitlauncher] Running org.apache.poi.xwpf.usermodel.TestXWPFDocument
[junitlauncher] Tests run: 28, Failures: 0, Aborted: 0, Skipped: 1, Time elapsed: 0.360000 sec
[junitlauncher] Running org.apache.poi.xwpf.usermodel.TestXWPFEndnote
[junitlauncher] 
[junitlauncher] Running org.apache.poi.xwpf.usermodel.TestXWPFEndnote
[junitlauncher] Tests run: 4, Failures: 0, Aborted: 0, Skipped: 0, Time elapsed: 0.019000 sec
[junitlauncher] Running org.apache.poi.xwpf.usermodel.TestXWPFEndnotes
[junitlauncher] 
[junitlauncher] Running org.apache.poi.xwpf.usermodel.TestXWPFEndnotes
[junitlauncher] Tests run: 2, Failures: 0, Aborted: 0, Skipped: 0, Time elapsed: 0.007000 sec
[junitlauncher] Running org.apache.poi.xwpf.usermodel.TestXWPFFootnote
[junitlauncher] 
[junitlauncher] Running org.apache.poi.xwpf.usermodel.TestXWPFFootnote
[junitlauncher] Tests run: 4, Failures: 0, Aborted: 0, Skipped: 0, Time elapsed: 0.018000 sec
[junitlauncher] Running org.apache.poi.xwpf.usermodel.TestXWPFFootnotes
[junitlauncher] 
[junitlauncher] Running org.apache.poi.xwpf.usermodel.TestXWPFFootnotes
[junitlauncher] Tests run: 3, Failures: 0, Aborted: 0, Skipped: 0, Time elapsed: 0.026000 sec
[junitlauncher] Running org.apache.poi.xwpf.usermodel.TestXWPFHeader
[junitlauncher] 
[junitlauncher] Running org.apache.poi.xwpf.usermodel.TestXWPFHeader
[junitlauncher] Tests run: 6, Failures: 0, Aborted: 0, Skipped: 0, Time elapsed: 0.104000 sec
[junitlauncher] Running org.apache.poi.xwpf.usermodel.TestXWPFHeadings
[junitlauncher] 
[junitlauncher] Running org.apache.poi.xwpf.usermodel.TestXWPFHeadings
[junitlauncher] Tests run: 1, Failures: 0, Aborted: 0, Skipped: 0, Time elapsed: 0.028000 sec
[junitlauncher] Running org.apache.poi.xwpf.usermodel.TestXWPFNumbering
[junitlauncher] 
[junitlauncher] Running org.apache.poi.xwpf.usermodel.TestXWPFNumbering
[junitlauncher] Tests run: 10, Failures: 0, Aborted: 0, Skipped: 0, Time elapsed: 0.097000 sec
[junitlauncher] Running org.apache.poi.xwpf.usermodel.TestXWPFParagraph
[junitlauncher] 
[junitlauncher] Running org.apache.poi.xwpf.usermodel.TestXWPFParagraph
[junitlauncher] Tests run: 33, Failures: 0, Aborted: 0, Skipped: 0, Time elapsed: 0.175000 sec
[junitlauncher] Running org.apache.poi.xwpf.usermodel.TestXWPFPictureData
[junitlauncher] 
[junitlauncher] Running org.apache.poi.xwpf.usermodel.TestXWPFPictureData
[junitlauncher] Tests run: 6, Failures: 0, Aborted: 0, Skipped: 0, Time elapsed: 0.156000 sec
[junitlauncher] Running org.apache.poi.xwpf.usermodel.TestXWPFRun
[junitlauncher] 
[junitlauncher] Running org.apache.poi.xwpf.usermodel.TestXWPFRun
[junitlauncher] Tests run: 43, Failures: 0, Aborted: 0, Skipped: 0, Time elapsed: 0.270000 sec
[junitlauncher] Running org.apache.poi.xwpf.usermodel.TestXWPFSDT
[junitlauncher] 
[junitlauncher] Running org.apache.poi.xwpf.usermodel.TestXWPFSDT
[junitlauncher] Tests run: 8, Failures: 0, Aborted: 0, Skipped: 0, Time elapsed: 0.096000 sec
[junitlauncher] Running org.apache.poi.xwpf.usermodel.TestXWPFSmartTag
[junitlauncher] 
[junitlauncher] Running org.apache.poi.xwpf.usermodel.TestXWPFSmartTag
[junitlauncher] Tests run: 1, Failures: 0, Aborted: 0, Skipped: 0, Time elapsed: 0.009000 sec
[junitlauncher] Running org.apache.poi.xwpf.usermodel.TestXWPFStyles
[junitlauncher] 
[junitlauncher] Running org.apache.poi.xwpf.usermodel.TestXWPFStyles
[junitlauncher] Tests run: 11, Failures: 0, Aborted: 0, Skipped: 0, Time elapsed: 0.130000 sec
[junitlauncher] Running org.apache.poi.xwpf.usermodel.TestXWPFTable
[junitlauncher] 
[junitlauncher] Running org.apache.poi.xwpf.usermodel.TestXWPFTable
[junitlauncher] Tests run: 20, Failures: 0, Aborted: 0, Skipped: 0, Time elapsed: 0.198000 sec
[junitlauncher] Running org.apache.poi.xwpf.usermodel.TestXWPFTableCell
[junitlauncher] 
[junitlauncher] Running org.apache.poi.xwpf.usermodel.TestXWPFTableCell
[junitlauncher] Tests run: 13, Failures: 0, Aborted: 0, Skipped: 0, Time elapsed: 0.058000 sec
[junitlauncher] Running org.apache.poi.xwpf.usermodel.TestXWPFTableRow
[junitlauncher] 
[junitlauncher] Running org.apache.poi.xwpf.usermodel.TestXWPFTableRow
[junitlauncher] Tests run: 9, Failures: 0, Aborted: 0, Skipped: 0, Time elapsed: 0.049000 sec
[junitlauncher] Running org.apache.poi.xwpf.usermodel.TestXWPFTheme
[junitlauncher] 
[junitlauncher] Running org.apache.poi.xwpf.usermodel.TestXWPFTheme
[junitlauncher] Tests run: 1, Failures: 0, Aborted: 0, Skipped: 0, Time elapsed: 0.017000 sec

-test-ooxml-write-testfile:

compile-ooxml-lite:
     [echo] Create ooxml-lite schemas
    [javac] Compiling 1 source file to <https://ci-builds.apache.org/job/POI/job/POI-DSL-IBM-JDK/ws/poi-ooxml-lite/src/main/java9>
     [copy] Copying 1 file to <https://ci-builds.apache.org/job/POI/job/POI-DSL-IBM-JDK/ws/src/resources>
     [copy] Copying 1 file to <https://ci-builds.apache.org/job/POI/job/POI-DSL-IBM-JDK/ws/src/resources>
     [copy] Copying 1 file to <https://ci-builds.apache.org/job/POI/job/POI-DSL-IBM-JDK/ws/src/resources>
    [mkdir] Created dir: <https://ci-builds.apache.org/job/POI/job/POI-DSL-IBM-JDK/ws/build/dist/maven/poi-ooxml-lite>
      [jar] Building jar: <https://ci-builds.apache.org/job/POI/job/POI-DSL-IBM-JDK/314/artifact/build/dist/maven/poi-ooxml-lite/poi-ooxml-lite-6.0.0-SNAPSHOT.jar>
   [delete] Deleting: <https://ci-builds.apache.org/job/POI/job/POI-DSL-IBM-JDK/ws/src/resources/ooxml-lite-report.clazz1>
   [delete] Deleting: <https://ci-builds.apache.org/job/POI/job/POI-DSL-IBM-JDK/ws/src/resources/ooxml-lite-report.clazz2>
   [delete] Deleting: <https://ci-builds.apache.org/job/POI/job/POI-DSL-IBM-JDK/ws/src/resources/ooxml-lite-report.xsb2>

-test-excelant-check:

test-excelant:
[junitlauncher] May 31, 2026 7:41:55 AM sun.util.locale.provider.LocaleProviderAdapter <clinit>
[junitlauncher] WARNING: COMPAT locale provider will be removed in a future release
[junitlauncher] Running org.apache.poi.ss.excelant.TestBuildFile
[junitlauncher] 
[junitlauncher] Running org.apache.poi.ss.excelant.TestBuildFile
[junitlauncher] Tests run: 14, Failures: 0, Aborted: 0, Skipped: 0, Time elapsed: 4.836000 sec
[junitlauncher] Running org.apache.poi.ss.excelant.TestExcelAntPrecision
[junitlauncher] 
[junitlauncher] Running org.apache.poi.ss.excelant.TestExcelAntPrecision
[junitlauncher] Tests run: 1, Failures: 0, Aborted: 0, Skipped: 0, Time elapsed: 0.003000 sec
[junitlauncher] Running org.apache.poi.ss.excelant.TestExcelAntSet
[junitlauncher] 
[junitlauncher] Running org.apache.poi.ss.excelant.TestExcelAntSet
[junitlauncher] Tests run: 2, Failures: 0, Aborted: 0, Skipped: 0, Time elapsed: 0.035000 sec
[junitlauncher] Running org.apache.poi.ss.excelant.TestExcelAntSetDoubleCell
[junitlauncher] 
[junitlauncher] Running org.apache.poi.ss.excelant.TestExcelAntSetDoubleCell
[junitlauncher] Tests run: 1, Failures: 0, Aborted: 0, Skipped: 0, Time elapsed: 0.004000 sec
[junitlauncher] Running org.apache.poi.ss.excelant.TestExcelAntUserDefinedFunction
[junitlauncher] 
[junitlauncher] Running org.apache.poi.ss.excelant.TestExcelAntUserDefinedFunction
[junitlauncher] Tests run: 2, Failures: 0, Aborted: 0, Skipped: 0, Time elapsed: 0.005000 sec
[junitlauncher] Running org.apache.poi.ss.excelant.util.TestExcelAntEvaluationResult
[junitlauncher] 
[junitlauncher] Running org.apache.poi.ss.excelant.util.TestExcelAntEvaluationResult
[junitlauncher] Tests run: 4, Failures: 0, Aborted: 0, Skipped: 0, Time elapsed: 0.010000 sec
[junitlauncher] Running org.apache.poi.ss.excelant.util.TestExcelAntWorkbookUtil
[junitlauncher] 
[junitlauncher] Running org.apache.poi.ss.excelant.util.TestExcelAntWorkbookUtil
[junitlauncher] Tests run: 23, Failures: 0, Aborted: 0, Skipped: 0, Time elapsed: 1.938000 sec
[junitlauncher] Running org.apache.poi.ss.excelant.util.TestExcelAntWorkbookUtilFactory
[junitlauncher] 
[junitlauncher] Running org.apache.poi.ss.excelant.util.TestExcelAntWorkbookUtilFactory
[junitlauncher] Tests run: 2, Failures: 0, Aborted: 0, Skipped: 0, Time elapsed: 0.003000 sec

-test-excelant-write-testfile:

test:

compile-integration:
    [javac] Compiling 30 source files to <https://ci-builds.apache.org/job/POI/job/POI-DSL-IBM-JDK/ws/poi-integration/build/test-classes>
    [javac] Ignoring source, target and bootclasspath as release has been set
    [javac] Note: Annotation processing is enabled because one or more processors were found
    [javac]   on the class path. A future release of javac may disable annotation processing
    [javac]   unless at least one processor is specified by name (-processor), or a search
    [javac]   path is specified (--processor-path, --processor-module-path), or annotation
    [javac]   processing is enabled explicitly (-proc:only, -proc:full).
    [javac]   Use -Xlint:-options to suppress this message.
    [javac]   Use -proc:none to disable annotation processing.
    [javac] Note: <https://ci-builds.apache.org/job/POI/job/POI-DSL-IBM-JDK/ws/poi-integration/src/test/java/org/apache/poi/stress/OptimizedNullPrintStream.java> uses or overrides a deprecated API.
    [javac] Note: Recompile with -Xlint:deprecation for details.
    [mkdir] Created dir: <https://ci-builds.apache.org/job/POI/job/POI-DSL-IBM-JDK/ws/poi-integration/build/test-classes/META-INF/versions/9>
    [javac] Compiling 1 source file to <https://ci-builds.apache.org/job/POI/job/POI-DSL-IBM-JDK/ws/poi-integration/build/test-classes/META-INF/versions/9>
      [jar] Building jar: <https://ci-builds.apache.org/job/POI/job/POI-DSL-IBM-JDK/314/artifact/build/dist/maven/poi-integration/poi-integration-6.0.0-SNAPSHOT.jar>

-test-integration-check:

test-integration:
[junitlauncher] May 31, 2026 7:42:14 AM sun.util.locale.provider.LocaleProviderAdapter <clinit>
[junitlauncher] WARNING: COMPAT locale provider will be removed in a future release
[junitlauncher] Running org.apache.poi.stress.TestAllFiles
[junitlauncher] 
[junitlauncher] Running org.apache.poi.stress.TestAllFiles
[junitlauncher]    Failed: handleAdditional(String, FileHandlerKnown, String, Class, String): java.lang.NoClassDefFoundError: org.apache.commons.csv.CSVFormat
[junitlauncher]    Failed: handleFile(String, FileHandlerKnown, String, Class, String): java.lang.NoClassDefFoundError: org.apache.commons.csv.CSVFormat
[junitlauncher]    Failed: handleExtracting(String, FileHandlerKnown, String, Class, String): java.lang.NoClassDefFoundError: org.apache.commons.csv.CSVFormat
[junitlauncher] Tests run: 3, Failures: 3, Aborted: 0, Skipped: 0, Time elapsed: 0.150000 sec

BUILD FAILED
<https://ci-builds.apache.org/job/POI/job/POI-DSL-IBM-JDK/ws/build.xml>:1850: The following error occurred while executing this line:
<https://ci-builds.apache.org/job/POI/job/POI-DSL-IBM-JDK/ws/build.xml>:1394: Some test(s) have failure(s)

Total time: 13 minutes 35 seconds
Build step 'Invoke Ant' marked build as failure
[SpotBugs] Skipping execution of recorder since overall result is 'FAILURE'
ERROR: Not all environment variables could be successfully injected. Check for similarly-named environment variables.
Archiving artifacts
ERROR: Not all environment variables could be successfully injected. Check for similarly-named environment variables.
Recording test results
ERROR: Not all environment variables could be successfully injected. Check for similarly-named environment variables.
[Checks API] No suitable checks publisher found.
ERROR: Not all environment variables could be successfully injected. Check for similarly-named environment variables.

---------------------------------------------------------------------
To unsubscribe, e-mail: dev-unsubscribe@poi.apache.org
For additional commands, e-mail: dev-help@poi.apache.org


Build failed in Jenkins: POI » POI-DSL-IBM-JDK #313

Posted by Apache Jenkins Server <je...@builds.apache.org>.
See <https://ci-builds.apache.org/job/POI/job/POI-DSL-IBM-JDK/313/display/redirect?page=changes>

Changes:

[github] Validate EMF description bounds before allocation (#1060)

[github] Apply zip bomb checks to encrypted temp ZIP processing (#1057)

[github] Harden temporary file permissions (#1063)

[github] rework temp file permissions (#1065)

[github] Harden HPSF allocation-size arithmetic against silent overflow (#1064)

[github] Reject oversized XSSF table counts during integer conversion (#1067)

[Dominik Stadler] Add sample document and test for issue #1013

[Dominik Stadler] Update .asf.yaml

[Dominik Stadler] Bug 70005: Fix countifs with multi-element arrays

[Dominik Stadler] Increase coverage for function CountIf

[github] Reject oversized OOXML ptCount values in XDDFDataSourcesFactory (#1070)

[github] Update IOUtils.java (#1073)

[github] Update XSLFSheet.java (#1074)

[github] replace casts long to int with Math.toIntExact (#1072)

[github] Validate HDGF v6+ chunk Length before narrowing to int (#1075)

[github] Guard HDGF PointerFactory offset/length uint32 narrowing (#1076)

[github] Reject path traversal filenames during HMEF attachment extraction


------------------------------------------
[...truncated 317.68 KiB...]
[junitlauncher] Tests run: 2, Failures: 0, Aborted: 0, Skipped: 0, Time elapsed: 0.000000 sec
[junitlauncher] Running org.apache.poi.xssf.util.TestEvilUnclosedBRFixingInputStream
[junitlauncher] 
[junitlauncher] Running org.apache.poi.xssf.util.TestEvilUnclosedBRFixingInputStream
[junitlauncher] Tests run: 3, Failures: 0, Aborted: 0, Skipped: 0, Time elapsed: 0.031000 sec
[junitlauncher] Running org.apache.poi.xssf.util.TestNumericRanges
[junitlauncher] 
[junitlauncher] Running org.apache.poi.xssf.util.TestNumericRanges
[junitlauncher] Tests run: 2, Failures: 0, Aborted: 0, Skipped: 0, Time elapsed: 0.000000 sec
[junitlauncher] Running org.apache.poi.xwpf.TestAllExtendedProperties
[junitlauncher] 
[junitlauncher] Running org.apache.poi.xwpf.TestAllExtendedProperties
[junitlauncher] Tests run: 1, Failures: 0, Aborted: 0, Skipped: 0, Time elapsed: 0.055000 sec
[junitlauncher] Running org.apache.poi.xwpf.TestDocumentProtection
[junitlauncher] 
[junitlauncher] Running org.apache.poi.xwpf.TestDocumentProtection
[junitlauncher] Tests run: 10, Failures: 0, Aborted: 0, Skipped: 0, Time elapsed: 0.666000 sec
[junitlauncher] Running org.apache.poi.xwpf.TestNecessaryOOXMLClasses
[junitlauncher] 
[junitlauncher] Running org.apache.poi.xwpf.TestNecessaryOOXMLClasses
[junitlauncher] Tests run: 1, Failures: 0, Aborted: 0, Skipped: 0, Time elapsed: 0.009000 sec
[junitlauncher] Running org.apache.poi.xwpf.TestPackageCorePropertiesGetKeywords
[junitlauncher] 
[junitlauncher] Running org.apache.poi.xwpf.TestPackageCorePropertiesGetKeywords
[junitlauncher] Tests run: 1, Failures: 0, Aborted: 0, Skipped: 0, Time elapsed: 0.049000 sec
[junitlauncher] Running org.apache.poi.xwpf.TestXWPFBugs
[junitlauncher] 
[junitlauncher] Running org.apache.poi.xwpf.TestXWPFBugs
[junitlauncher] Tests run: 14, Failures: 0, Aborted: 0, Skipped: 0, Time elapsed: 13.503000 sec
[junitlauncher] Running org.apache.poi.xwpf.extractor.TestExternalEntities
[junitlauncher] 
[junitlauncher] Running org.apache.poi.xwpf.extractor.TestExternalEntities
[junitlauncher] Tests run: 1, Failures: 0, Aborted: 0, Skipped: 0, Time elapsed: 0.024000 sec
[junitlauncher] Running org.apache.poi.xwpf.extractor.TestXWPFWordExtractor
[junitlauncher] 
[junitlauncher] Running org.apache.poi.xwpf.extractor.TestXWPFWordExtractor
[junitlauncher] Tests run: 27, Failures: 0, Aborted: 0, Skipped: 0, Time elapsed: 1.696000 sec
[junitlauncher] Running org.apache.poi.xwpf.model.TestMultiSectionHeaders
[junitlauncher] 
[junitlauncher] Running org.apache.poi.xwpf.model.TestMultiSectionHeaders
[junitlauncher] Tests run: 2, Failures: 0, Aborted: 0, Skipped: 0, Time elapsed: 0.004000 sec
[junitlauncher] Running org.apache.poi.xwpf.model.TestXWPFDecorators
[junitlauncher] 
[junitlauncher] Running org.apache.poi.xwpf.model.TestXWPFDecorators
[junitlauncher] Tests run: 2, Failures: 0, Aborted: 0, Skipped: 0, Time elapsed: 0.187000 sec
[junitlauncher] Running org.apache.poi.xwpf.model.TestXWPFHeaderFooterPolicy
[junitlauncher] 
[junitlauncher] Running org.apache.poi.xwpf.model.TestXWPFHeaderFooterPolicy
[junitlauncher] Tests run: 3, Failures: 0, Aborted: 0, Skipped: 0, Time elapsed: 0.486000 sec
[junitlauncher] Running org.apache.poi.xwpf.usermodel.TestChangeTracking
[junitlauncher] 
[junitlauncher] Running org.apache.poi.xwpf.usermodel.TestChangeTracking
[junitlauncher] Tests run: 3, Failures: 0, Aborted: 0, Skipped: 0, Time elapsed: 0.043000 sec
[junitlauncher] Running org.apache.poi.xwpf.usermodel.TestColumn
[junitlauncher] 
[junitlauncher] Running org.apache.poi.xwpf.usermodel.TestColumn
[junitlauncher] Tests run: 4, Failures: 0, Aborted: 0, Skipped: 0, Time elapsed: 0.065000 sec
[junitlauncher] Running org.apache.poi.xwpf.usermodel.TestXWPFAbstractNum
[junitlauncher] 
[junitlauncher] Running org.apache.poi.xwpf.usermodel.TestXWPFAbstractNum
[junitlauncher] Tests run: 1, Failures: 0, Aborted: 0, Skipped: 0, Time elapsed: 0.000000 sec
[junitlauncher] Running org.apache.poi.xwpf.usermodel.TestXWPFBugs
[junitlauncher] 
[junitlauncher] Running org.apache.poi.xwpf.usermodel.TestXWPFBugs
[junitlauncher] Tests run: 15, Failures: 0, Aborted: 0, Skipped: 0, Time elapsed: 0.867000 sec
[junitlauncher] Running org.apache.poi.xwpf.usermodel.TestXWPFChart
[junitlauncher] 
[junitlauncher] Running org.apache.poi.xwpf.usermodel.TestXWPFChart
[junitlauncher] Tests run: 4, Failures: 0, Aborted: 0, Skipped: 0, Time elapsed: 0.128000 sec
[junitlauncher] Running org.apache.poi.xwpf.usermodel.TestXWPFComment
[junitlauncher] 
[junitlauncher] Running org.apache.poi.xwpf.usermodel.TestXWPFComment
[junitlauncher] Tests run: 6, Failures: 0, Aborted: 0, Skipped: 0, Time elapsed: 0.390000 sec
[junitlauncher] Running org.apache.poi.xwpf.usermodel.TestXWPFComments
[junitlauncher] 
[junitlauncher] Running org.apache.poi.xwpf.usermodel.TestXWPFComments
[junitlauncher] Tests run: 2, Failures: 0, Aborted: 0, Skipped: 0, Time elapsed: 0.030000 sec
[junitlauncher] Running org.apache.poi.xwpf.usermodel.TestXWPFDocument
[junitlauncher] 
[junitlauncher] Running org.apache.poi.xwpf.usermodel.TestXWPFDocument
[junitlauncher] Tests run: 28, Failures: 0, Aborted: 0, Skipped: 1, Time elapsed: 1.154000 sec
[junitlauncher] Running org.apache.poi.xwpf.usermodel.TestXWPFEndnote
[junitlauncher] 
[junitlauncher] Running org.apache.poi.xwpf.usermodel.TestXWPFEndnote
[junitlauncher] Tests run: 4, Failures: 0, Aborted: 0, Skipped: 0, Time elapsed: 0.022000 sec
[junitlauncher] Running org.apache.poi.xwpf.usermodel.TestXWPFEndnotes
[junitlauncher] 
[junitlauncher] Running org.apache.poi.xwpf.usermodel.TestXWPFEndnotes
[junitlauncher] Tests run: 2, Failures: 0, Aborted: 0, Skipped: 0, Time elapsed: 0.008000 sec
[junitlauncher] Running org.apache.poi.xwpf.usermodel.TestXWPFFootnote
[junitlauncher] 
[junitlauncher] Running org.apache.poi.xwpf.usermodel.TestXWPFFootnote
[junitlauncher] Tests run: 4, Failures: 0, Aborted: 0, Skipped: 0, Time elapsed: 0.022000 sec
[junitlauncher] Running org.apache.poi.xwpf.usermodel.TestXWPFFootnotes
[junitlauncher] 
[junitlauncher] Running org.apache.poi.xwpf.usermodel.TestXWPFFootnotes
[junitlauncher] Tests run: 3, Failures: 0, Aborted: 0, Skipped: 0, Time elapsed: 0.035000 sec
[junitlauncher] Running org.apache.poi.xwpf.usermodel.TestXWPFHeader
[junitlauncher] 
[junitlauncher] Running org.apache.poi.xwpf.usermodel.TestXWPFHeader
[junitlauncher] Tests run: 6, Failures: 0, Aborted: 0, Skipped: 0, Time elapsed: 0.254000 sec
[junitlauncher] Running org.apache.poi.xwpf.usermodel.TestXWPFHeadings
[junitlauncher] 
[junitlauncher] Running org.apache.poi.xwpf.usermodel.TestXWPFHeadings
[junitlauncher] Tests run: 1, Failures: 0, Aborted: 0, Skipped: 0, Time elapsed: 0.066000 sec
[junitlauncher] Running org.apache.poi.xwpf.usermodel.TestXWPFNumbering
[junitlauncher] 
[junitlauncher] Running org.apache.poi.xwpf.usermodel.TestXWPFNumbering
[junitlauncher] Tests run: 10, Failures: 0, Aborted: 0, Skipped: 0, Time elapsed: 0.350000 sec
[junitlauncher] Running org.apache.poi.xwpf.usermodel.TestXWPFParagraph
[junitlauncher] 
[junitlauncher] Running org.apache.poi.xwpf.usermodel.TestXWPFParagraph
[junitlauncher] Tests run: 32, Failures: 0, Aborted: 0, Skipped: 0, Time elapsed: 0.410000 sec
[junitlauncher] Running org.apache.poi.xwpf.usermodel.TestXWPFPictureData
[junitlauncher] 
[junitlauncher] Running org.apache.poi.xwpf.usermodel.TestXWPFPictureData
[junitlauncher] Tests run: 6, Failures: 0, Aborted: 0, Skipped: 0, Time elapsed: 0.439000 sec
[junitlauncher] Running org.apache.poi.xwpf.usermodel.TestXWPFRun
[junitlauncher] 
[junitlauncher] Running org.apache.poi.xwpf.usermodel.TestXWPFRun
[junitlauncher] Tests run: 43, Failures: 0, Aborted: 0, Skipped: 0, Time elapsed: 0.646000 sec
[junitlauncher] Running org.apache.poi.xwpf.usermodel.TestXWPFSDT
[junitlauncher] 
[junitlauncher] Running org.apache.poi.xwpf.usermodel.TestXWPFSDT
[junitlauncher] Tests run: 8, Failures: 0, Aborted: 0, Skipped: 0, Time elapsed: 0.273000 sec
[junitlauncher] Running org.apache.poi.xwpf.usermodel.TestXWPFSmartTag
[junitlauncher] 
[junitlauncher] Running org.apache.poi.xwpf.usermodel.TestXWPFSmartTag
[junitlauncher] Tests run: 1, Failures: 0, Aborted: 0, Skipped: 0, Time elapsed: 0.017000 sec
[junitlauncher] Running org.apache.poi.xwpf.usermodel.TestXWPFStyles
[junitlauncher] 
[junitlauncher] Running org.apache.poi.xwpf.usermodel.TestXWPFStyles
[junitlauncher] Tests run: 11, Failures: 0, Aborted: 0, Skipped: 0, Time elapsed: 0.286000 sec
[junitlauncher] Running org.apache.poi.xwpf.usermodel.TestXWPFTable
[junitlauncher] 
[junitlauncher] Running org.apache.poi.xwpf.usermodel.TestXWPFTable
[junitlauncher] Tests run: 20, Failures: 0, Aborted: 0, Skipped: 0, Time elapsed: 0.190000 sec
[junitlauncher] Running org.apache.poi.xwpf.usermodel.TestXWPFTableCell
[junitlauncher] 
[junitlauncher] Running org.apache.poi.xwpf.usermodel.TestXWPFTableCell
[junitlauncher] Tests run: 13, Failures: 0, Aborted: 0, Skipped: 0, Time elapsed: 0.229000 sec
[junitlauncher] Running org.apache.poi.xwpf.usermodel.TestXWPFTableRow
[junitlauncher] 
[junitlauncher] Running org.apache.poi.xwpf.usermodel.TestXWPFTableRow
[junitlauncher] Tests run: 9, Failures: 0, Aborted: 0, Skipped: 0, Time elapsed: 0.094000 sec
[junitlauncher] Running org.apache.poi.xwpf.usermodel.TestXWPFTheme
[junitlauncher] 
[junitlauncher] Running org.apache.poi.xwpf.usermodel.TestXWPFTheme
[junitlauncher] Tests run: 1, Failures: 0, Aborted: 0, Skipped: 0, Time elapsed: 0.025000 sec

-test-ooxml-write-testfile:

compile-ooxml-lite:
     [echo] Create ooxml-lite schemas
    [javac] Compiling 1 source file to <https://ci-builds.apache.org/job/POI/job/POI-DSL-IBM-JDK/ws/poi-ooxml-lite/src/main/java9>
     [copy] Copying 1 file to <https://ci-builds.apache.org/job/POI/job/POI-DSL-IBM-JDK/ws/src/resources>
     [copy] Copying 1 file to <https://ci-builds.apache.org/job/POI/job/POI-DSL-IBM-JDK/ws/src/resources>
     [copy] Copying 1 file to <https://ci-builds.apache.org/job/POI/job/POI-DSL-IBM-JDK/ws/src/resources>
    [mkdir] Created dir: <https://ci-builds.apache.org/job/POI/job/POI-DSL-IBM-JDK/ws/build/dist/maven/poi-ooxml-lite>
      [jar] Building jar: <https://ci-builds.apache.org/job/POI/job/POI-DSL-IBM-JDK/313/artifact/build/dist/maven/poi-ooxml-lite/poi-ooxml-lite-6.0.0-SNAPSHOT.jar>
   [delete] Deleting: <https://ci-builds.apache.org/job/POI/job/POI-DSL-IBM-JDK/ws/src/resources/ooxml-lite-report.clazz1>
   [delete] Deleting: <https://ci-builds.apache.org/job/POI/job/POI-DSL-IBM-JDK/ws/src/resources/ooxml-lite-report.clazz2>
   [delete] Deleting: <https://ci-builds.apache.org/job/POI/job/POI-DSL-IBM-JDK/ws/src/resources/ooxml-lite-report.xsb2>

-test-excelant-check:

test-excelant:
[junitlauncher] May 17, 2026 7:48:13 AM sun.util.locale.provider.LocaleProviderAdapter <clinit>
[junitlauncher] WARNING: COMPAT locale provider will be removed in a future release
[junitlauncher] Running org.apache.poi.ss.excelant.TestBuildFile
[junitlauncher] 
[junitlauncher] Running org.apache.poi.ss.excelant.TestBuildFile
[junitlauncher] Tests run: 14, Failures: 0, Aborted: 0, Skipped: 0, Time elapsed: 5.465000 sec
[junitlauncher] Running org.apache.poi.ss.excelant.TestExcelAntPrecision
[junitlauncher] 
[junitlauncher] Running org.apache.poi.ss.excelant.TestExcelAntPrecision
[junitlauncher] Tests run: 1, Failures: 0, Aborted: 0, Skipped: 0, Time elapsed: 0.004000 sec
[junitlauncher] Running org.apache.poi.ss.excelant.TestExcelAntSet
[junitlauncher] 
[junitlauncher] Running org.apache.poi.ss.excelant.TestExcelAntSet
[junitlauncher] Tests run: 2, Failures: 0, Aborted: 0, Skipped: 0, Time elapsed: 0.028000 sec
[junitlauncher] Running org.apache.poi.ss.excelant.TestExcelAntSetDoubleCell
[junitlauncher] 
[junitlauncher] Running org.apache.poi.ss.excelant.TestExcelAntSetDoubleCell
[junitlauncher] Tests run: 1, Failures: 0, Aborted: 0, Skipped: 0, Time elapsed: 0.004000 sec
[junitlauncher] Running org.apache.poi.ss.excelant.TestExcelAntUserDefinedFunction
[junitlauncher] 
[junitlauncher] Running org.apache.poi.ss.excelant.TestExcelAntUserDefinedFunction
[junitlauncher] Tests run: 2, Failures: 0, Aborted: 0, Skipped: 0, Time elapsed: 0.004000 sec
[junitlauncher] Running org.apache.poi.ss.excelant.util.TestExcelAntEvaluationResult
[junitlauncher] 
[junitlauncher] Running org.apache.poi.ss.excelant.util.TestExcelAntEvaluationResult
[junitlauncher] Tests run: 4, Failures: 0, Aborted: 0, Skipped: 0, Time elapsed: 0.007000 sec
[junitlauncher] Running org.apache.poi.ss.excelant.util.TestExcelAntWorkbookUtil
[junitlauncher] 
[junitlauncher] Running org.apache.poi.ss.excelant.util.TestExcelAntWorkbookUtil
[junitlauncher] Tests run: 23, Failures: 0, Aborted: 0, Skipped: 0, Time elapsed: 2.074000 sec
[junitlauncher] Running org.apache.poi.ss.excelant.util.TestExcelAntWorkbookUtilFactory
[junitlauncher] 
[junitlauncher] Running org.apache.poi.ss.excelant.util.TestExcelAntWorkbookUtilFactory
[junitlauncher] Tests run: 2, Failures: 0, Aborted: 0, Skipped: 0, Time elapsed: 0.019000 sec

-test-excelant-write-testfile:

test:

compile-integration:
    [javac] Compiling 30 source files to <https://ci-builds.apache.org/job/POI/job/POI-DSL-IBM-JDK/ws/poi-integration/build/test-classes>
    [javac] Ignoring source, target and bootclasspath as release has been set
    [javac] Note: Annotation processing is enabled because one or more processors were found
    [javac]   on the class path. A future release of javac may disable annotation processing
    [javac]   unless at least one processor is specified by name (-processor), or a search
    [javac]   path is specified (--processor-path, --processor-module-path), or annotation
    [javac]   processing is enabled explicitly (-proc:only, -proc:full).
    [javac]   Use -Xlint:-options to suppress this message.
    [javac]   Use -proc:none to disable annotation processing.
    [javac] Note: <https://ci-builds.apache.org/job/POI/job/POI-DSL-IBM-JDK/ws/poi-integration/src/test/java/org/apache/poi/stress/OptimizedNullPrintStream.java> uses or overrides a deprecated API.
    [javac] Note: Recompile with -Xlint:deprecation for details.
    [mkdir] Created dir: <https://ci-builds.apache.org/job/POI/job/POI-DSL-IBM-JDK/ws/poi-integration/build/test-classes/META-INF/versions/9>
    [javac] Compiling 1 source file to <https://ci-builds.apache.org/job/POI/job/POI-DSL-IBM-JDK/ws/poi-integration/build/test-classes/META-INF/versions/9>
      [jar] Building jar: <https://ci-builds.apache.org/job/POI/job/POI-DSL-IBM-JDK/313/artifact/build/dist/maven/poi-integration/poi-integration-6.0.0-SNAPSHOT.jar>

-test-integration-check:

test-integration:
[junitlauncher] May 17, 2026 7:48:37 AM sun.util.locale.provider.LocaleProviderAdapter <clinit>
[junitlauncher] WARNING: COMPAT locale provider will be removed in a future release
[junitlauncher] Running org.apache.poi.stress.TestAllFiles
[junitlauncher] 
[junitlauncher] Running org.apache.poi.stress.TestAllFiles
[junitlauncher]    Failed: handleFile(String, FileHandlerKnown, String, Class, String): java.lang.NoClassDefFoundError: org.apache.commons.csv.CSVFormat
[junitlauncher]    Failed: handleExtracting(String, FileHandlerKnown, String, Class, String): java.lang.NoClassDefFoundError: org.apache.commons.csv.CSVFormat
[junitlauncher]    Failed: handleAdditional(String, FileHandlerKnown, String, Class, String): java.lang.NoClassDefFoundError: org.apache.commons.csv.CSVFormat
[junitlauncher] Tests run: 3, Failures: 3, Aborted: 0, Skipped: 0, Time elapsed: 0.175000 sec

BUILD FAILED
<https://ci-builds.apache.org/job/POI/job/POI-DSL-IBM-JDK/ws/build.xml>:1850: The following error occurred while executing this line:
<https://ci-builds.apache.org/job/POI/job/POI-DSL-IBM-JDK/ws/build.xml>:1394: Some test(s) have failure(s)

Total time: 19 minutes 50 seconds
Build step 'Invoke Ant' marked build as failure
[SpotBugs] Skipping execution of recorder since overall result is 'FAILURE'
ERROR: Not all environment variables could be successfully injected. Check for similarly-named environment variables.
Archiving artifacts
ERROR: Not all environment variables could be successfully injected. Check for similarly-named environment variables.
Recording test results
ERROR: Not all environment variables could be successfully injected. Check for similarly-named environment variables.
[Checks API] No suitable checks publisher found.
ERROR: Not all environment variables could be successfully injected. Check for similarly-named environment variables.

---------------------------------------------------------------------
To unsubscribe, e-mail: dev-unsubscribe@poi.apache.org
For additional commands, e-mail: dev-help@poi.apache.org


Build failed in Jenkins: POI » POI-DSL-IBM-JDK #312

Posted by Apache Jenkins Server <je...@builds.apache.org>.
See <https://ci-builds.apache.org/job/POI/job/POI-DSL-IBM-JDK/312/display/redirect?page=changes>

Changes:

[github] police overflow in blip calculations (#1054)

[github] Enforce max entry size consistently for streaming ZIP entries (#1055)

[PJ Fanning] Revert "Enforce max entry size consistently for streaming ZIP entries

[github] Update class description for PoiLogManager

[PJ Fanning] log4j 2.26.0


------------------------------------------
[...truncated 317.33 KiB...]
[junitlauncher] Tests run: 2, Failures: 0, Aborted: 0, Skipped: 0, Time elapsed: 0.001000 sec
[junitlauncher] Running org.apache.poi.xssf.util.TestEvilUnclosedBRFixingInputStream
[junitlauncher] 
[junitlauncher] Running org.apache.poi.xssf.util.TestEvilUnclosedBRFixingInputStream
[junitlauncher] Tests run: 3, Failures: 0, Aborted: 0, Skipped: 0, Time elapsed: 0.017000 sec
[junitlauncher] Running org.apache.poi.xssf.util.TestNumericRanges
[junitlauncher] 
[junitlauncher] Running org.apache.poi.xssf.util.TestNumericRanges
[junitlauncher] Tests run: 2, Failures: 0, Aborted: 0, Skipped: 0, Time elapsed: 0.000000 sec
[junitlauncher] Running org.apache.poi.xwpf.TestAllExtendedProperties
[junitlauncher] 
[junitlauncher] Running org.apache.poi.xwpf.TestAllExtendedProperties
[junitlauncher] Tests run: 1, Failures: 0, Aborted: 0, Skipped: 0, Time elapsed: 0.019000 sec
[junitlauncher] Running org.apache.poi.xwpf.TestDocumentProtection
[junitlauncher] 
[junitlauncher] Running org.apache.poi.xwpf.TestDocumentProtection
[junitlauncher] Tests run: 10, Failures: 0, Aborted: 0, Skipped: 0, Time elapsed: 0.262000 sec
[junitlauncher] Running org.apache.poi.xwpf.TestNecessaryOOXMLClasses
[junitlauncher] 
[junitlauncher] Running org.apache.poi.xwpf.TestNecessaryOOXMLClasses
[junitlauncher] Tests run: 1, Failures: 0, Aborted: 0, Skipped: 0, Time elapsed: 0.007000 sec
[junitlauncher] Running org.apache.poi.xwpf.TestPackageCorePropertiesGetKeywords
[junitlauncher] 
[junitlauncher] Running org.apache.poi.xwpf.TestPackageCorePropertiesGetKeywords
[junitlauncher] Tests run: 1, Failures: 0, Aborted: 0, Skipped: 0, Time elapsed: 0.016000 sec
[junitlauncher] Running org.apache.poi.xwpf.TestXWPFBugs
[junitlauncher] 
[junitlauncher] Running org.apache.poi.xwpf.TestXWPFBugs
[junitlauncher] Tests run: 14, Failures: 0, Aborted: 0, Skipped: 0, Time elapsed: 1.483000 sec
[junitlauncher] Running org.apache.poi.xwpf.extractor.TestExternalEntities
[junitlauncher] 
[junitlauncher] Running org.apache.poi.xwpf.extractor.TestExternalEntities
[junitlauncher] Tests run: 1, Failures: 0, Aborted: 0, Skipped: 0, Time elapsed: 0.006000 sec
[junitlauncher] Running org.apache.poi.xwpf.extractor.TestXWPFWordExtractor
[junitlauncher] 
[junitlauncher] Running org.apache.poi.xwpf.extractor.TestXWPFWordExtractor
[junitlauncher] Tests run: 27, Failures: 0, Aborted: 0, Skipped: 0, Time elapsed: 0.360000 sec
[junitlauncher] Running org.apache.poi.xwpf.model.TestMultiSectionHeaders
[junitlauncher] 
[junitlauncher] Running org.apache.poi.xwpf.model.TestMultiSectionHeaders
[junitlauncher] Tests run: 2, Failures: 0, Aborted: 0, Skipped: 0, Time elapsed: 0.002000 sec
[junitlauncher] Running org.apache.poi.xwpf.model.TestXWPFDecorators
[junitlauncher] 
[junitlauncher] Running org.apache.poi.xwpf.model.TestXWPFDecorators
[junitlauncher] Tests run: 2, Failures: 0, Aborted: 0, Skipped: 0, Time elapsed: 0.046000 sec
[junitlauncher] Running org.apache.poi.xwpf.model.TestXWPFHeaderFooterPolicy
[junitlauncher] 
[junitlauncher] Running org.apache.poi.xwpf.model.TestXWPFHeaderFooterPolicy
[junitlauncher] Tests run: 3, Failures: 0, Aborted: 0, Skipped: 0, Time elapsed: 0.131000 sec
[junitlauncher] Running org.apache.poi.xwpf.usermodel.TestChangeTracking
[junitlauncher] 
[junitlauncher] Running org.apache.poi.xwpf.usermodel.TestChangeTracking
[junitlauncher] Tests run: 3, Failures: 0, Aborted: 0, Skipped: 0, Time elapsed: 0.016000 sec
[junitlauncher] Running org.apache.poi.xwpf.usermodel.TestColumn
[junitlauncher] 
[junitlauncher] Running org.apache.poi.xwpf.usermodel.TestColumn
[junitlauncher] Tests run: 4, Failures: 0, Aborted: 0, Skipped: 0, Time elapsed: 0.014000 sec
[junitlauncher] Running org.apache.poi.xwpf.usermodel.TestXWPFAbstractNum
[junitlauncher] 
[junitlauncher] Running org.apache.poi.xwpf.usermodel.TestXWPFAbstractNum
[junitlauncher] Tests run: 1, Failures: 0, Aborted: 0, Skipped: 0, Time elapsed: 0.000000 sec
[junitlauncher] Running org.apache.poi.xwpf.usermodel.TestXWPFBugs
[junitlauncher] 
[junitlauncher] Running org.apache.poi.xwpf.usermodel.TestXWPFBugs
[junitlauncher] Tests run: 15, Failures: 0, Aborted: 0, Skipped: 0, Time elapsed: 0.229000 sec
[junitlauncher] Running org.apache.poi.xwpf.usermodel.TestXWPFChart
[junitlauncher] 
[junitlauncher] Running org.apache.poi.xwpf.usermodel.TestXWPFChart
[junitlauncher] Tests run: 4, Failures: 0, Aborted: 0, Skipped: 0, Time elapsed: 0.034000 sec
[junitlauncher] Running org.apache.poi.xwpf.usermodel.TestXWPFComment
[junitlauncher] 
[junitlauncher] Running org.apache.poi.xwpf.usermodel.TestXWPFComment
[junitlauncher] Tests run: 6, Failures: 0, Aborted: 0, Skipped: 0, Time elapsed: 0.253000 sec
[junitlauncher] Running org.apache.poi.xwpf.usermodel.TestXWPFComments
[junitlauncher] 
[junitlauncher] Running org.apache.poi.xwpf.usermodel.TestXWPFComments
[junitlauncher] Tests run: 2, Failures: 0, Aborted: 0, Skipped: 0, Time elapsed: 0.013000 sec
[junitlauncher] Running org.apache.poi.xwpf.usermodel.TestXWPFDocument
[junitlauncher] 
[junitlauncher] Running org.apache.poi.xwpf.usermodel.TestXWPFDocument
[junitlauncher] Tests run: 28, Failures: 0, Aborted: 0, Skipped: 1, Time elapsed: 0.281000 sec
[junitlauncher] Running org.apache.poi.xwpf.usermodel.TestXWPFEndnote
[junitlauncher] 
[junitlauncher] Running org.apache.poi.xwpf.usermodel.TestXWPFEndnote
[junitlauncher] Tests run: 4, Failures: 0, Aborted: 0, Skipped: 0, Time elapsed: 0.019000 sec
[junitlauncher] Running org.apache.poi.xwpf.usermodel.TestXWPFEndnotes
[junitlauncher] 
[junitlauncher] Running org.apache.poi.xwpf.usermodel.TestXWPFEndnotes
[junitlauncher] Tests run: 2, Failures: 0, Aborted: 0, Skipped: 0, Time elapsed: 0.005000 sec
[junitlauncher] Running org.apache.poi.xwpf.usermodel.TestXWPFFootnote
[junitlauncher] 
[junitlauncher] Running org.apache.poi.xwpf.usermodel.TestXWPFFootnote
[junitlauncher] Tests run: 4, Failures: 0, Aborted: 0, Skipped: 0, Time elapsed: 0.014000 sec
[junitlauncher] Running org.apache.poi.xwpf.usermodel.TestXWPFFootnotes
[junitlauncher] 
[junitlauncher] Running org.apache.poi.xwpf.usermodel.TestXWPFFootnotes
[junitlauncher] Tests run: 3, Failures: 0, Aborted: 0, Skipped: 0, Time elapsed: 0.016000 sec
[junitlauncher] Running org.apache.poi.xwpf.usermodel.TestXWPFHeader
[junitlauncher] 
[junitlauncher] Running org.apache.poi.xwpf.usermodel.TestXWPFHeader
[junitlauncher] Tests run: 6, Failures: 0, Aborted: 0, Skipped: 0, Time elapsed: 0.080000 sec
[junitlauncher] Running org.apache.poi.xwpf.usermodel.TestXWPFHeadings
[junitlauncher] 
[junitlauncher] Running org.apache.poi.xwpf.usermodel.TestXWPFHeadings
[junitlauncher] Tests run: 1, Failures: 0, Aborted: 0, Skipped: 0, Time elapsed: 0.025000 sec
[junitlauncher] Running org.apache.poi.xwpf.usermodel.TestXWPFNumbering
[junitlauncher] 
[junitlauncher] Running org.apache.poi.xwpf.usermodel.TestXWPFNumbering
[junitlauncher] Tests run: 10, Failures: 0, Aborted: 0, Skipped: 0, Time elapsed: 0.077000 sec
[junitlauncher] Running org.apache.poi.xwpf.usermodel.TestXWPFParagraph
[junitlauncher] 
[junitlauncher] Running org.apache.poi.xwpf.usermodel.TestXWPFParagraph
[junitlauncher] Tests run: 32, Failures: 0, Aborted: 0, Skipped: 0, Time elapsed: 0.144000 sec
[junitlauncher] Running org.apache.poi.xwpf.usermodel.TestXWPFPictureData
[junitlauncher] 
[junitlauncher] Running org.apache.poi.xwpf.usermodel.TestXWPFPictureData
[junitlauncher] Tests run: 6, Failures: 0, Aborted: 0, Skipped: 0, Time elapsed: 0.079000 sec
[junitlauncher] Running org.apache.poi.xwpf.usermodel.TestXWPFRun
[junitlauncher] 
[junitlauncher] Running org.apache.poi.xwpf.usermodel.TestXWPFRun
[junitlauncher] Tests run: 42, Failures: 0, Aborted: 0, Skipped: 0, Time elapsed: 0.158000 sec
[junitlauncher] Running org.apache.poi.xwpf.usermodel.TestXWPFSDT
[junitlauncher] 
[junitlauncher] Running org.apache.poi.xwpf.usermodel.TestXWPFSDT
[junitlauncher] Tests run: 8, Failures: 0, Aborted: 0, Skipped: 0, Time elapsed: 0.061000 sec
[junitlauncher] Running org.apache.poi.xwpf.usermodel.TestXWPFSmartTag
[junitlauncher] 
[junitlauncher] Running org.apache.poi.xwpf.usermodel.TestXWPFSmartTag
[junitlauncher] Tests run: 1, Failures: 0, Aborted: 0, Skipped: 0, Time elapsed: 0.006000 sec
[junitlauncher] Running org.apache.poi.xwpf.usermodel.TestXWPFStyles
[junitlauncher] 
[junitlauncher] Running org.apache.poi.xwpf.usermodel.TestXWPFStyles
[junitlauncher] Tests run: 11, Failures: 0, Aborted: 0, Skipped: 0, Time elapsed: 0.084000 sec
[junitlauncher] Running org.apache.poi.xwpf.usermodel.TestXWPFTable
[junitlauncher] 
[junitlauncher] Running org.apache.poi.xwpf.usermodel.TestXWPFTable
[junitlauncher] Tests run: 20, Failures: 0, Aborted: 0, Skipped: 0, Time elapsed: 0.080000 sec
[junitlauncher] Running org.apache.poi.xwpf.usermodel.TestXWPFTableCell
[junitlauncher] 
[junitlauncher] Running org.apache.poi.xwpf.usermodel.TestXWPFTableCell
[junitlauncher] Tests run: 13, Failures: 0, Aborted: 0, Skipped: 0, Time elapsed: 0.042000 sec
[junitlauncher] Running org.apache.poi.xwpf.usermodel.TestXWPFTableRow
[junitlauncher] 
[junitlauncher] Running org.apache.poi.xwpf.usermodel.TestXWPFTableRow
[junitlauncher] Tests run: 9, Failures: 0, Aborted: 0, Skipped: 0, Time elapsed: 0.028000 sec
[junitlauncher] Running org.apache.poi.xwpf.usermodel.TestXWPFTheme
[junitlauncher] 
[junitlauncher] Running org.apache.poi.xwpf.usermodel.TestXWPFTheme
[junitlauncher] Tests run: 1, Failures: 0, Aborted: 0, Skipped: 0, Time elapsed: 0.010000 sec

-test-ooxml-write-testfile:

compile-ooxml-lite:
     [echo] Create ooxml-lite schemas
    [javac] Compiling 1 source file to <https://ci-builds.apache.org/job/POI/job/POI-DSL-IBM-JDK/ws/poi-ooxml-lite/src/main/java9>
     [copy] Copying 1 file to <https://ci-builds.apache.org/job/POI/job/POI-DSL-IBM-JDK/ws/src/resources>
     [copy] Copying 1 file to <https://ci-builds.apache.org/job/POI/job/POI-DSL-IBM-JDK/ws/src/resources>
     [copy] Copying 1 file to <https://ci-builds.apache.org/job/POI/job/POI-DSL-IBM-JDK/ws/src/resources>
    [mkdir] Created dir: <https://ci-builds.apache.org/job/POI/job/POI-DSL-IBM-JDK/ws/build/dist/maven/poi-ooxml-lite>
      [jar] Building jar: <https://ci-builds.apache.org/job/POI/job/POI-DSL-IBM-JDK/312/artifact/build/dist/maven/poi-ooxml-lite/poi-ooxml-lite-6.0.0-SNAPSHOT.jar>
   [delete] Deleting: <https://ci-builds.apache.org/job/POI/job/POI-DSL-IBM-JDK/ws/src/resources/ooxml-lite-report.clazz1>
   [delete] Deleting: <https://ci-builds.apache.org/job/POI/job/POI-DSL-IBM-JDK/ws/src/resources/ooxml-lite-report.clazz2>
   [delete] Deleting: <https://ci-builds.apache.org/job/POI/job/POI-DSL-IBM-JDK/ws/src/resources/ooxml-lite-report.xsb2>

-test-excelant-check:

test-excelant:
[junitlauncher] May 10, 2026 7:36:19 AM sun.util.locale.provider.LocaleProviderAdapter <clinit>
[junitlauncher] WARNING: COMPAT locale provider will be removed in a future release
[junitlauncher] Running org.apache.poi.ss.excelant.TestBuildFile
[junitlauncher] 
[junitlauncher] Running org.apache.poi.ss.excelant.TestBuildFile
[junitlauncher] Tests run: 14, Failures: 0, Aborted: 0, Skipped: 0, Time elapsed: 2.334000 sec
[junitlauncher] Running org.apache.poi.ss.excelant.TestExcelAntPrecision
[junitlauncher] 
[junitlauncher] Running org.apache.poi.ss.excelant.TestExcelAntPrecision
[junitlauncher] Tests run: 1, Failures: 0, Aborted: 0, Skipped: 0, Time elapsed: 0.003000 sec
[junitlauncher] Running org.apache.poi.ss.excelant.TestExcelAntSet
[junitlauncher] 
[junitlauncher] Running org.apache.poi.ss.excelant.TestExcelAntSet
[junitlauncher] Tests run: 2, Failures: 0, Aborted: 0, Skipped: 0, Time elapsed: 0.016000 sec
[junitlauncher] Running org.apache.poi.ss.excelant.TestExcelAntSetDoubleCell
[junitlauncher] 
[junitlauncher] Running org.apache.poi.ss.excelant.TestExcelAntSetDoubleCell
[junitlauncher] Tests run: 1, Failures: 0, Aborted: 0, Skipped: 0, Time elapsed: 0.002000 sec
[junitlauncher] Running org.apache.poi.ss.excelant.TestExcelAntUserDefinedFunction
[junitlauncher] 
[junitlauncher] Running org.apache.poi.ss.excelant.TestExcelAntUserDefinedFunction
[junitlauncher] Tests run: 2, Failures: 0, Aborted: 0, Skipped: 0, Time elapsed: 0.002000 sec
[junitlauncher] Running org.apache.poi.ss.excelant.util.TestExcelAntEvaluationResult
[junitlauncher] 
[junitlauncher] Running org.apache.poi.ss.excelant.util.TestExcelAntEvaluationResult
[junitlauncher] Tests run: 4, Failures: 0, Aborted: 0, Skipped: 0, Time elapsed: 0.005000 sec
[junitlauncher] Running org.apache.poi.ss.excelant.util.TestExcelAntWorkbookUtil
[junitlauncher] 
[junitlauncher] Running org.apache.poi.ss.excelant.util.TestExcelAntWorkbookUtil
[junitlauncher] Tests run: 23, Failures: 0, Aborted: 0, Skipped: 0, Time elapsed: 1.011000 sec
[junitlauncher] Running org.apache.poi.ss.excelant.util.TestExcelAntWorkbookUtilFactory
[junitlauncher] 
[junitlauncher] Running org.apache.poi.ss.excelant.util.TestExcelAntWorkbookUtilFactory
[junitlauncher] Tests run: 2, Failures: 0, Aborted: 0, Skipped: 0, Time elapsed: 0.002000 sec

-test-excelant-write-testfile:

test:

compile-integration:
    [javac] Compiling 30 source files to <https://ci-builds.apache.org/job/POI/job/POI-DSL-IBM-JDK/ws/poi-integration/build/test-classes>
    [javac] Ignoring source, target and bootclasspath as release has been set
    [javac] Note: Annotation processing is enabled because one or more processors were found
    [javac]   on the class path. A future release of javac may disable annotation processing
    [javac]   unless at least one processor is specified by name (-processor), or a search
    [javac]   path is specified (--processor-path, --processor-module-path), or annotation
    [javac]   processing is enabled explicitly (-proc:only, -proc:full).
    [javac]   Use -Xlint:-options to suppress this message.
    [javac]   Use -proc:none to disable annotation processing.
    [javac] Note: <https://ci-builds.apache.org/job/POI/job/POI-DSL-IBM-JDK/ws/poi-integration/src/test/java/org/apache/poi/stress/OptimizedNullPrintStream.java> uses or overrides a deprecated API.
    [javac] Note: Recompile with -Xlint:deprecation for details.
    [mkdir] Created dir: <https://ci-builds.apache.org/job/POI/job/POI-DSL-IBM-JDK/ws/poi-integration/build/test-classes/META-INF/versions/9>
    [javac] Compiling 1 source file to <https://ci-builds.apache.org/job/POI/job/POI-DSL-IBM-JDK/ws/poi-integration/build/test-classes/META-INF/versions/9>
      [jar] Building jar: <https://ci-builds.apache.org/job/POI/job/POI-DSL-IBM-JDK/312/artifact/build/dist/maven/poi-integration/poi-integration-6.0.0-SNAPSHOT.jar>

-test-integration-check:

test-integration:
[junitlauncher] May 10, 2026 7:36:30 AM sun.util.locale.provider.LocaleProviderAdapter <clinit>
[junitlauncher] WARNING: COMPAT locale provider will be removed in a future release
[junitlauncher] Running org.apache.poi.stress.TestAllFiles
[junitlauncher] 
[junitlauncher] Running org.apache.poi.stress.TestAllFiles
[junitlauncher]    Failed: handleFile(String, FileHandlerKnown, String, Class, String): java.lang.NoClassDefFoundError: org.apache.commons.csv.CSVFormat
[junitlauncher]    Failed: handleAdditional(String, FileHandlerKnown, String, Class, String): java.lang.NoClassDefFoundError: org.apache.commons.csv.CSVFormat
[junitlauncher]    Failed: handleExtracting(String, FileHandlerKnown, String, Class, String): java.lang.NoClassDefFoundError: org.apache.commons.csv.CSVFormat
[junitlauncher] Tests run: 3, Failures: 3, Aborted: 0, Skipped: 0, Time elapsed: 0.120000 sec

BUILD FAILED
<https://ci-builds.apache.org/job/POI/job/POI-DSL-IBM-JDK/ws/build.xml>:1850: The following error occurred while executing this line:
<https://ci-builds.apache.org/job/POI/job/POI-DSL-IBM-JDK/ws/build.xml>:1394: Some test(s) have failure(s)

Total time: 8 minutes 3 seconds
Build step 'Invoke Ant' marked build as failure
[SpotBugs] Skipping execution of recorder since overall result is 'FAILURE'
ERROR: Not all environment variables could be successfully injected. Check for similarly-named environment variables.
Archiving artifacts
ERROR: Not all environment variables could be successfully injected. Check for similarly-named environment variables.
Recording test results
ERROR: Not all environment variables could be successfully injected. Check for similarly-named environment variables.
[Checks API] No suitable checks publisher found.
ERROR: Not all environment variables could be successfully injected. Check for similarly-named environment variables.

---------------------------------------------------------------------
To unsubscribe, e-mail: dev-unsubscribe@poi.apache.org
For additional commands, e-mail: dev-help@poi.apache.org


Build failed in Jenkins: POI » POI-DSL-IBM-JDK #311

Posted by Apache Jenkins Server <je...@builds.apache.org>.
See <https://ci-builds.apache.org/job/POI/job/POI-DSL-IBM-JDK/311/display/redirect?page=changes>

Changes:

[PJ Fanning] log4j 2.25.4

[PJ Fanning] bc 1.84

[github] Reject invalid WMF unitsPerInch=0 to prevent infinite scaling (#1045)

[github] Event based extractor: refactor password support  (#1026)

[github] decouple xlsb from xmlbeans (#1043)

[github] add setOutputPassword for HSLFSlideShow and HWPFDocument (#1050)


------------------------------------------
[...truncated 309.09 KiB...]
[junitlauncher] Tests run: 2, Failures: 0, Aborted: 0, Skipped: 0, Time elapsed: 0.000000 sec
[junitlauncher] Running org.apache.poi.xssf.util.TestEvilUnclosedBRFixingInputStream
[junitlauncher] 
[junitlauncher] Running org.apache.poi.xssf.util.TestEvilUnclosedBRFixingInputStream
[junitlauncher] Tests run: 3, Failures: 0, Aborted: 0, Skipped: 0, Time elapsed: 0.037000 sec
[junitlauncher] Running org.apache.poi.xssf.util.TestNumericRanges
[junitlauncher] 
[junitlauncher] Running org.apache.poi.xssf.util.TestNumericRanges
[junitlauncher] Tests run: 2, Failures: 0, Aborted: 0, Skipped: 0, Time elapsed: 0.000000 sec
[junitlauncher] Running org.apache.poi.xwpf.TestAllExtendedProperties
[junitlauncher] 
[junitlauncher] Running org.apache.poi.xwpf.TestAllExtendedProperties
[junitlauncher] Tests run: 1, Failures: 0, Aborted: 0, Skipped: 0, Time elapsed: 0.053000 sec
[junitlauncher] Running org.apache.poi.xwpf.TestDocumentProtection
[junitlauncher] 
[junitlauncher] Running org.apache.poi.xwpf.TestDocumentProtection
[junitlauncher] Tests run: 10, Failures: 0, Aborted: 0, Skipped: 0, Time elapsed: 0.470000 sec
[junitlauncher] Running org.apache.poi.xwpf.TestNecessaryOOXMLClasses
[junitlauncher] 
[junitlauncher] Running org.apache.poi.xwpf.TestNecessaryOOXMLClasses
[junitlauncher] Tests run: 1, Failures: 0, Aborted: 0, Skipped: 0, Time elapsed: 0.008000 sec
[junitlauncher] Running org.apache.poi.xwpf.TestPackageCorePropertiesGetKeywords
[junitlauncher] 
[junitlauncher] Running org.apache.poi.xwpf.TestPackageCorePropertiesGetKeywords
[junitlauncher] Tests run: 1, Failures: 0, Aborted: 0, Skipped: 0, Time elapsed: 0.022000 sec
[junitlauncher] Running org.apache.poi.xwpf.TestXWPFBugs
[junitlauncher] 
[junitlauncher] Running org.apache.poi.xwpf.TestXWPFBugs
[junitlauncher] Tests run: 14, Failures: 0, Aborted: 0, Skipped: 0, Time elapsed: 3.362000 sec
[junitlauncher] Running org.apache.poi.xwpf.extractor.TestExternalEntities
[junitlauncher] 
[junitlauncher] Running org.apache.poi.xwpf.extractor.TestExternalEntities
[junitlauncher] Tests run: 1, Failures: 0, Aborted: 0, Skipped: 0, Time elapsed: 0.034000 sec
[junitlauncher] Running org.apache.poi.xwpf.extractor.TestXWPFWordExtractor
[junitlauncher] 
[junitlauncher] Running org.apache.poi.xwpf.extractor.TestXWPFWordExtractor
[junitlauncher] Tests run: 27, Failures: 0, Aborted: 0, Skipped: 0, Time elapsed: 0.859000 sec
[junitlauncher] Running org.apache.poi.xwpf.model.TestMultiSectionHeaders
[junitlauncher] 
[junitlauncher] Running org.apache.poi.xwpf.model.TestMultiSectionHeaders
[junitlauncher] Tests run: 2, Failures: 0, Aborted: 0, Skipped: 0, Time elapsed: 0.004000 sec
[junitlauncher] Running org.apache.poi.xwpf.model.TestXWPFDecorators
[junitlauncher] 
[junitlauncher] Running org.apache.poi.xwpf.model.TestXWPFDecorators
[junitlauncher] Tests run: 2, Failures: 0, Aborted: 0, Skipped: 0, Time elapsed: 0.074000 sec
[junitlauncher] Running org.apache.poi.xwpf.model.TestXWPFHeaderFooterPolicy
[junitlauncher] 
[junitlauncher] Running org.apache.poi.xwpf.model.TestXWPFHeaderFooterPolicy
[junitlauncher] Tests run: 3, Failures: 0, Aborted: 0, Skipped: 0, Time elapsed: 0.203000 sec
[junitlauncher] Running org.apache.poi.xwpf.usermodel.TestChangeTracking
[junitlauncher] 
[junitlauncher] Running org.apache.poi.xwpf.usermodel.TestChangeTracking
[junitlauncher] Tests run: 3, Failures: 0, Aborted: 0, Skipped: 0, Time elapsed: 0.029000 sec
[junitlauncher] Running org.apache.poi.xwpf.usermodel.TestColumn
[junitlauncher] 
[junitlauncher] Running org.apache.poi.xwpf.usermodel.TestColumn
[junitlauncher] Tests run: 4, Failures: 0, Aborted: 0, Skipped: 0, Time elapsed: 0.040000 sec
[junitlauncher] Running org.apache.poi.xwpf.usermodel.TestXWPFAbstractNum
[junitlauncher] 
[junitlauncher] Running org.apache.poi.xwpf.usermodel.TestXWPFAbstractNum
[junitlauncher] Tests run: 1, Failures: 0, Aborted: 0, Skipped: 0, Time elapsed: 0.000000 sec
[junitlauncher] Running org.apache.poi.xwpf.usermodel.TestXWPFBugs
[junitlauncher] 
[junitlauncher] Running org.apache.poi.xwpf.usermodel.TestXWPFBugs
[junitlauncher] Tests run: 15, Failures: 0, Aborted: 0, Skipped: 0, Time elapsed: 0.447000 sec
[junitlauncher] Running org.apache.poi.xwpf.usermodel.TestXWPFChart
[junitlauncher] 
[junitlauncher] Running org.apache.poi.xwpf.usermodel.TestXWPFChart
[junitlauncher] Tests run: 4, Failures: 0, Aborted: 0, Skipped: 0, Time elapsed: 0.059000 sec
[junitlauncher] Running org.apache.poi.xwpf.usermodel.TestXWPFComment
[junitlauncher] 
[junitlauncher] Running org.apache.poi.xwpf.usermodel.TestXWPFComment
[junitlauncher] Tests run: 6, Failures: 0, Aborted: 0, Skipped: 0, Time elapsed: 0.555000 sec
[junitlauncher] Running org.apache.poi.xwpf.usermodel.TestXWPFComments
[junitlauncher] 
[junitlauncher] Running org.apache.poi.xwpf.usermodel.TestXWPFComments
[junitlauncher] Tests run: 2, Failures: 0, Aborted: 0, Skipped: 0, Time elapsed: 0.022000 sec
[junitlauncher] Running org.apache.poi.xwpf.usermodel.TestXWPFDocument
[junitlauncher] 
[junitlauncher] Running org.apache.poi.xwpf.usermodel.TestXWPFDocument
[junitlauncher] Tests run: 28, Failures: 0, Aborted: 0, Skipped: 1, Time elapsed: 0.563000 sec
[junitlauncher] Running org.apache.poi.xwpf.usermodel.TestXWPFEndnote
[junitlauncher] 
[junitlauncher] Running org.apache.poi.xwpf.usermodel.TestXWPFEndnote
[junitlauncher] Tests run: 4, Failures: 0, Aborted: 0, Skipped: 0, Time elapsed: 0.026000 sec
[junitlauncher] Running org.apache.poi.xwpf.usermodel.TestXWPFEndnotes
[junitlauncher] 
[junitlauncher] Running org.apache.poi.xwpf.usermodel.TestXWPFEndnotes
[junitlauncher] Tests run: 2, Failures: 0, Aborted: 0, Skipped: 0, Time elapsed: 0.010000 sec
[junitlauncher] Running org.apache.poi.xwpf.usermodel.TestXWPFFootnote
[junitlauncher] 
[junitlauncher] Running org.apache.poi.xwpf.usermodel.TestXWPFFootnote
[junitlauncher] Tests run: 4, Failures: 0, Aborted: 0, Skipped: 0, Time elapsed: 0.256000 sec
[junitlauncher] Running org.apache.poi.xwpf.usermodel.TestXWPFFootnotes
[junitlauncher] 
[junitlauncher] Running org.apache.poi.xwpf.usermodel.TestXWPFFootnotes
[junitlauncher] Tests run: 3, Failures: 0, Aborted: 0, Skipped: 0, Time elapsed: 0.040000 sec
[junitlauncher] Running org.apache.poi.xwpf.usermodel.TestXWPFHeader
[junitlauncher] 
[junitlauncher] Running org.apache.poi.xwpf.usermodel.TestXWPFHeader
[junitlauncher] Tests run: 6, Failures: 0, Aborted: 0, Skipped: 0, Time elapsed: 0.134000 sec
[junitlauncher] Running org.apache.poi.xwpf.usermodel.TestXWPFHeadings
[junitlauncher] 
[junitlauncher] Running org.apache.poi.xwpf.usermodel.TestXWPFHeadings
[junitlauncher] Tests run: 1, Failures: 0, Aborted: 0, Skipped: 0, Time elapsed: 0.046000 sec
[junitlauncher] Running org.apache.poi.xwpf.usermodel.TestXWPFNumbering
[junitlauncher] 
[junitlauncher] Running org.apache.poi.xwpf.usermodel.TestXWPFNumbering
[junitlauncher] Tests run: 10, Failures: 0, Aborted: 0, Skipped: 0, Time elapsed: 0.118000 sec
[junitlauncher] Running org.apache.poi.xwpf.usermodel.TestXWPFParagraph
[junitlauncher] 
[junitlauncher] Running org.apache.poi.xwpf.usermodel.TestXWPFParagraph
[junitlauncher] Tests run: 32, Failures: 0, Aborted: 0, Skipped: 0, Time elapsed: 0.220000 sec
[junitlauncher] Running org.apache.poi.xwpf.usermodel.TestXWPFPictureData
[junitlauncher] 
[junitlauncher] Running org.apache.poi.xwpf.usermodel.TestXWPFPictureData
[junitlauncher] Tests run: 6, Failures: 0, Aborted: 0, Skipped: 0, Time elapsed: 0.169000 sec
[junitlauncher] Running org.apache.poi.xwpf.usermodel.TestXWPFRun
[junitlauncher] 
[junitlauncher] Running org.apache.poi.xwpf.usermodel.TestXWPFRun
[junitlauncher] Tests run: 42, Failures: 0, Aborted: 0, Skipped: 0, Time elapsed: 0.242000 sec
[junitlauncher] Running org.apache.poi.xwpf.usermodel.TestXWPFSDT
[junitlauncher] 
[junitlauncher] Running org.apache.poi.xwpf.usermodel.TestXWPFSDT
[junitlauncher] Tests run: 8, Failures: 0, Aborted: 0, Skipped: 0, Time elapsed: 0.115000 sec
[junitlauncher] Running org.apache.poi.xwpf.usermodel.TestXWPFSmartTag
[junitlauncher] 
[junitlauncher] Running org.apache.poi.xwpf.usermodel.TestXWPFSmartTag
[junitlauncher] Tests run: 1, Failures: 0, Aborted: 0, Skipped: 0, Time elapsed: 0.009000 sec
[junitlauncher] Running org.apache.poi.xwpf.usermodel.TestXWPFStyles
[junitlauncher] 
[junitlauncher] Running org.apache.poi.xwpf.usermodel.TestXWPFStyles
[junitlauncher] Tests run: 11, Failures: 0, Aborted: 0, Skipped: 0, Time elapsed: 0.133000 sec
[junitlauncher] Running org.apache.poi.xwpf.usermodel.TestXWPFTable
[junitlauncher] 
[junitlauncher] Running org.apache.poi.xwpf.usermodel.TestXWPFTable
[junitlauncher] Tests run: 20, Failures: 0, Aborted: 0, Skipped: 0, Time elapsed: 0.119000 sec
[junitlauncher] Running org.apache.poi.xwpf.usermodel.TestXWPFTableCell
[junitlauncher] 
[junitlauncher] Running org.apache.poi.xwpf.usermodel.TestXWPFTableCell
[junitlauncher] Tests run: 13, Failures: 0, Aborted: 0, Skipped: 0, Time elapsed: 0.069000 sec
[junitlauncher] Running org.apache.poi.xwpf.usermodel.TestXWPFTableRow
[junitlauncher] 
[junitlauncher] Running org.apache.poi.xwpf.usermodel.TestXWPFTableRow
[junitlauncher] Tests run: 9, Failures: 0, Aborted: 0, Skipped: 0, Time elapsed: 0.069000 sec
[junitlauncher] Running org.apache.poi.xwpf.usermodel.TestXWPFTheme
[junitlauncher] 
[junitlauncher] Running org.apache.poi.xwpf.usermodel.TestXWPFTheme
[junitlauncher] Tests run: 1, Failures: 0, Aborted: 0, Skipped: 0, Time elapsed: 0.020000 sec

-test-ooxml-write-testfile:

compile-ooxml-lite:
     [echo] Create ooxml-lite schemas
    [javac] Compiling 1 source file to <https://ci-builds.apache.org/job/POI/job/POI-DSL-IBM-JDK/ws/poi-ooxml-lite/src/main/java9>
     [copy] Copying 1 file to <https://ci-builds.apache.org/job/POI/job/POI-DSL-IBM-JDK/ws/src/resources>
     [copy] Copying 1 file to <https://ci-builds.apache.org/job/POI/job/POI-DSL-IBM-JDK/ws/src/resources>
     [copy] Copying 1 file to <https://ci-builds.apache.org/job/POI/job/POI-DSL-IBM-JDK/ws/src/resources>
    [mkdir] Created dir: <https://ci-builds.apache.org/job/POI/job/POI-DSL-IBM-JDK/ws/build/dist/maven/poi-ooxml-lite>
      [jar] Building jar: <https://ci-builds.apache.org/job/POI/job/POI-DSL-IBM-JDK/311/artifact/build/dist/maven/poi-ooxml-lite/poi-ooxml-lite-6.0.0-SNAPSHOT.jar>
   [delete] Deleting: <https://ci-builds.apache.org/job/POI/job/POI-DSL-IBM-JDK/ws/src/resources/ooxml-lite-report.clazz1>
   [delete] Deleting: <https://ci-builds.apache.org/job/POI/job/POI-DSL-IBM-JDK/ws/src/resources/ooxml-lite-report.clazz2>
   [delete] Deleting: <https://ci-builds.apache.org/job/POI/job/POI-DSL-IBM-JDK/ws/src/resources/ooxml-lite-report.xsb2>

-test-excelant-check:

test-excelant:
[junitlauncher] Apr 26, 2026 7:42:25 AM sun.util.locale.provider.LocaleProviderAdapter <clinit>
[junitlauncher] WARNING: COMPAT locale provider will be removed in a future release
[junitlauncher] Running org.apache.poi.ss.excelant.TestBuildFile
[junitlauncher] 
[junitlauncher] Running org.apache.poi.ss.excelant.TestBuildFile
[junitlauncher] Tests run: 14, Failures: 0, Aborted: 0, Skipped: 0, Time elapsed: 5.065000 sec
[junitlauncher] Running org.apache.poi.ss.excelant.TestExcelAntPrecision
[junitlauncher] 
[junitlauncher] Running org.apache.poi.ss.excelant.TestExcelAntPrecision
[junitlauncher] Tests run: 1, Failures: 0, Aborted: 0, Skipped: 0, Time elapsed: 0.002000 sec
[junitlauncher] Running org.apache.poi.ss.excelant.TestExcelAntSet
[junitlauncher] 
[junitlauncher] Running org.apache.poi.ss.excelant.TestExcelAntSet
[junitlauncher] Tests run: 2, Failures: 0, Aborted: 0, Skipped: 0, Time elapsed: 0.032000 sec
[junitlauncher] Running org.apache.poi.ss.excelant.TestExcelAntSetDoubleCell
[junitlauncher] 
[junitlauncher] Running org.apache.poi.ss.excelant.TestExcelAntSetDoubleCell
[junitlauncher] Tests run: 1, Failures: 0, Aborted: 0, Skipped: 0, Time elapsed: 0.003000 sec
[junitlauncher] Running org.apache.poi.ss.excelant.TestExcelAntUserDefinedFunction
[junitlauncher] 
[junitlauncher] Running org.apache.poi.ss.excelant.TestExcelAntUserDefinedFunction
[junitlauncher] Tests run: 2, Failures: 0, Aborted: 0, Skipped: 0, Time elapsed: 0.004000 sec
[junitlauncher] Running org.apache.poi.ss.excelant.util.TestExcelAntEvaluationResult
[junitlauncher] 
[junitlauncher] Running org.apache.poi.ss.excelant.util.TestExcelAntEvaluationResult
[junitlauncher] Tests run: 4, Failures: 0, Aborted: 0, Skipped: 0, Time elapsed: 0.008000 sec
[junitlauncher] Running org.apache.poi.ss.excelant.util.TestExcelAntWorkbookUtil
[junitlauncher] 
[junitlauncher] Running org.apache.poi.ss.excelant.util.TestExcelAntWorkbookUtil
[junitlauncher] Tests run: 23, Failures: 0, Aborted: 0, Skipped: 0, Time elapsed: 1.467000 sec
[junitlauncher] Running org.apache.poi.ss.excelant.util.TestExcelAntWorkbookUtilFactory
[junitlauncher] 
[junitlauncher] Running org.apache.poi.ss.excelant.util.TestExcelAntWorkbookUtilFactory
[junitlauncher] Tests run: 2, Failures: 0, Aborted: 0, Skipped: 0, Time elapsed: 0.003000 sec

-test-excelant-write-testfile:

test:

compile-integration:
    [javac] Compiling 30 source files to <https://ci-builds.apache.org/job/POI/job/POI-DSL-IBM-JDK/ws/poi-integration/build/test-classes>
    [javac] Ignoring source, target and bootclasspath as release has been set
    [javac] Note: Annotation processing is enabled because one or more processors were found
    [javac]   on the class path. A future release of javac may disable annotation processing
    [javac]   unless at least one processor is specified by name (-processor), or a search
    [javac]   path is specified (--processor-path, --processor-module-path), or annotation
    [javac]   processing is enabled explicitly (-proc:only, -proc:full).
    [javac]   Use -Xlint:-options to suppress this message.
    [javac]   Use -proc:none to disable annotation processing.
    [javac] Note: <https://ci-builds.apache.org/job/POI/job/POI-DSL-IBM-JDK/ws/poi-integration/src/test/java/org/apache/poi/stress/OptimizedNullPrintStream.java> uses or overrides a deprecated API.
    [javac] Note: Recompile with -Xlint:deprecation for details.
    [mkdir] Created dir: <https://ci-builds.apache.org/job/POI/job/POI-DSL-IBM-JDK/ws/poi-integration/build/test-classes/META-INF/versions/9>
    [javac] Compiling 1 source file to <https://ci-builds.apache.org/job/POI/job/POI-DSL-IBM-JDK/ws/poi-integration/build/test-classes/META-INF/versions/9>
      [jar] Building jar: <https://ci-builds.apache.org/job/POI/job/POI-DSL-IBM-JDK/311/artifact/build/dist/maven/poi-integration/poi-integration-6.0.0-SNAPSHOT.jar>

-test-integration-check:

test-integration:
[junitlauncher] Apr 26, 2026 7:42:44 AM sun.util.locale.provider.LocaleProviderAdapter <clinit>
[junitlauncher] WARNING: COMPAT locale provider will be removed in a future release
[junitlauncher] Running org.apache.poi.stress.TestAllFiles
[junitlauncher] 
[junitlauncher] Running org.apache.poi.stress.TestAllFiles
[junitlauncher]    Failed: handleFile(String, FileHandlerKnown, String, Class, String): java.lang.NoClassDefFoundError: org.apache.commons.csv.CSVFormat
[junitlauncher]    Failed: handleExtracting(String, FileHandlerKnown, String, Class, String): java.lang.NoClassDefFoundError: org.apache.commons.csv.CSVFormat
[junitlauncher]    Failed: handleAdditional(String, FileHandlerKnown, String, Class, String): java.lang.NoClassDefFoundError: org.apache.commons.csv.CSVFormat
[junitlauncher] Tests run: 3, Failures: 3, Aborted: 0, Skipped: 0, Time elapsed: 0.168000 sec

BUILD FAILED
<https://ci-builds.apache.org/job/POI/job/POI-DSL-IBM-JDK/ws/build.xml>:1850: The following error occurred while executing this line:
<https://ci-builds.apache.org/job/POI/job/POI-DSL-IBM-JDK/ws/build.xml>:1394: Some test(s) have failure(s)

Total time: 14 minutes 17 seconds
Build step 'Invoke Ant' marked build as failure
[SpotBugs] Skipping execution of recorder since overall result is 'FAILURE'
ERROR: Not all environment variables could be successfully injected. Check for similarly-named environment variables.
Archiving artifacts
ERROR: Not all environment variables could be successfully injected. Check for similarly-named environment variables.
Recording test results
ERROR: Not all environment variables could be successfully injected. Check for similarly-named environment variables.
[Checks API] No suitable checks publisher found.
ERROR: Not all environment variables could be successfully injected. Check for similarly-named environment variables.

---------------------------------------------------------------------
To unsubscribe, e-mail: dev-unsubscribe@poi.apache.org
For additional commands, e-mail: dev-help@poi.apache.org


Build failed in Jenkins: POI » POI-DSL-IBM-JDK #310

Posted by Apache Jenkins Server <je...@builds.apache.org>.
See <https://ci-builds.apache.org/job/POI/job/POI-DSL-IBM-JDK/310/display/redirect?page=changes>

Changes:

[github] Open up xssfb to simplify client usage/modifications. (#1042)

[Dominik Stadler] Bug 60848 and 65907 - Fix SUMPRODUCT with unary minus (--) on array

[github] Bump bouncy castle from 1.83 to 1.84 (#1047)


------------------------------------------
[...truncated 316.88 KiB...]
[junitlauncher] Tests run: 2, Failures: 0, Aborted: 0, Skipped: 0, Time elapsed: 0.001000 sec
[junitlauncher] Running org.apache.poi.xssf.util.TestEvilUnclosedBRFixingInputStream
[junitlauncher] 
[junitlauncher] Running org.apache.poi.xssf.util.TestEvilUnclosedBRFixingInputStream
[junitlauncher] Tests run: 3, Failures: 0, Aborted: 0, Skipped: 0, Time elapsed: 0.031000 sec
[junitlauncher] Running org.apache.poi.xssf.util.TestNumericRanges
[junitlauncher] 
[junitlauncher] Running org.apache.poi.xssf.util.TestNumericRanges
[junitlauncher] Tests run: 2, Failures: 0, Aborted: 0, Skipped: 0, Time elapsed: 0.000000 sec
[junitlauncher] Running org.apache.poi.xwpf.TestAllExtendedProperties
[junitlauncher] 
[junitlauncher] Running org.apache.poi.xwpf.TestAllExtendedProperties
[junitlauncher] Tests run: 1, Failures: 0, Aborted: 0, Skipped: 0, Time elapsed: 0.034000 sec
[junitlauncher] Running org.apache.poi.xwpf.TestDocumentProtection
[junitlauncher] 
[junitlauncher] Running org.apache.poi.xwpf.TestDocumentProtection
[junitlauncher] Tests run: 10, Failures: 0, Aborted: 0, Skipped: 0, Time elapsed: 0.376000 sec
[junitlauncher] Running org.apache.poi.xwpf.TestNecessaryOOXMLClasses
[junitlauncher] 
[junitlauncher] Running org.apache.poi.xwpf.TestNecessaryOOXMLClasses
[junitlauncher] Tests run: 1, Failures: 0, Aborted: 0, Skipped: 0, Time elapsed: 0.008000 sec
[junitlauncher] Running org.apache.poi.xwpf.TestPackageCorePropertiesGetKeywords
[junitlauncher] 
[junitlauncher] Running org.apache.poi.xwpf.TestPackageCorePropertiesGetKeywords
[junitlauncher] Tests run: 1, Failures: 0, Aborted: 0, Skipped: 0, Time elapsed: 0.022000 sec
[junitlauncher] Running org.apache.poi.xwpf.TestXWPFBugs
[junitlauncher] 
[junitlauncher] Running org.apache.poi.xwpf.TestXWPFBugs
[junitlauncher] Tests run: 14, Failures: 0, Aborted: 0, Skipped: 0, Time elapsed: 3.418000 sec
[junitlauncher] Running org.apache.poi.xwpf.extractor.TestExternalEntities
[junitlauncher] 
[junitlauncher] Running org.apache.poi.xwpf.extractor.TestExternalEntities
[junitlauncher] Tests run: 1, Failures: 0, Aborted: 0, Skipped: 0, Time elapsed: 0.018000 sec
[junitlauncher] Running org.apache.poi.xwpf.extractor.TestXWPFWordExtractor
[junitlauncher] 
[junitlauncher] Running org.apache.poi.xwpf.extractor.TestXWPFWordExtractor
[junitlauncher] Tests run: 27, Failures: 0, Aborted: 0, Skipped: 0, Time elapsed: 0.685000 sec
[junitlauncher] Running org.apache.poi.xwpf.model.TestMultiSectionHeaders
[junitlauncher] 
[junitlauncher] Running org.apache.poi.xwpf.model.TestMultiSectionHeaders
[junitlauncher] Tests run: 2, Failures: 0, Aborted: 0, Skipped: 0, Time elapsed: 0.004000 sec
[junitlauncher] Running org.apache.poi.xwpf.model.TestXWPFDecorators
[junitlauncher] 
[junitlauncher] Running org.apache.poi.xwpf.model.TestXWPFDecorators
[junitlauncher] Tests run: 2, Failures: 0, Aborted: 0, Skipped: 0, Time elapsed: 0.076000 sec
[junitlauncher] Running org.apache.poi.xwpf.model.TestXWPFHeaderFooterPolicy
[junitlauncher] 
[junitlauncher] Running org.apache.poi.xwpf.model.TestXWPFHeaderFooterPolicy
[junitlauncher] Tests run: 3, Failures: 0, Aborted: 0, Skipped: 0, Time elapsed: 0.206000 sec
[junitlauncher] Running org.apache.poi.xwpf.usermodel.TestChangeTracking
[junitlauncher] 
[junitlauncher] Running org.apache.poi.xwpf.usermodel.TestChangeTracking
[junitlauncher] Tests run: 3, Failures: 0, Aborted: 0, Skipped: 0, Time elapsed: 0.028000 sec
[junitlauncher] Running org.apache.poi.xwpf.usermodel.TestColumn
[junitlauncher] 
[junitlauncher] Running org.apache.poi.xwpf.usermodel.TestColumn
[junitlauncher] Tests run: 4, Failures: 0, Aborted: 0, Skipped: 0, Time elapsed: 0.023000 sec
[junitlauncher] Running org.apache.poi.xwpf.usermodel.TestXWPFAbstractNum
[junitlauncher] 
[junitlauncher] Running org.apache.poi.xwpf.usermodel.TestXWPFAbstractNum
[junitlauncher] Tests run: 1, Failures: 0, Aborted: 0, Skipped: 0, Time elapsed: 0.000000 sec
[junitlauncher] Running org.apache.poi.xwpf.usermodel.TestXWPFBugs
[junitlauncher] 
[junitlauncher] Running org.apache.poi.xwpf.usermodel.TestXWPFBugs
[junitlauncher] Tests run: 15, Failures: 0, Aborted: 0, Skipped: 0, Time elapsed: 0.388000 sec
[junitlauncher] Running org.apache.poi.xwpf.usermodel.TestXWPFChart
[junitlauncher] 
[junitlauncher] Running org.apache.poi.xwpf.usermodel.TestXWPFChart
[junitlauncher] Tests run: 4, Failures: 0, Aborted: 0, Skipped: 0, Time elapsed: 0.054000 sec
[junitlauncher] Running org.apache.poi.xwpf.usermodel.TestXWPFComment
[junitlauncher] 
[junitlauncher] Running org.apache.poi.xwpf.usermodel.TestXWPFComment
[junitlauncher] Tests run: 6, Failures: 0, Aborted: 0, Skipped: 0, Time elapsed: 1.823000 sec
[junitlauncher] Running org.apache.poi.xwpf.usermodel.TestXWPFComments
[junitlauncher] 
[junitlauncher] Running org.apache.poi.xwpf.usermodel.TestXWPFComments
[junitlauncher] Tests run: 2, Failures: 0, Aborted: 0, Skipped: 0, Time elapsed: 0.019000 sec
[junitlauncher] Running org.apache.poi.xwpf.usermodel.TestXWPFDocument
[junitlauncher] 
[junitlauncher] Running org.apache.poi.xwpf.usermodel.TestXWPFDocument
[junitlauncher] Tests run: 28, Failures: 0, Aborted: 0, Skipped: 1, Time elapsed: 0.420000 sec
[junitlauncher] Running org.apache.poi.xwpf.usermodel.TestXWPFEndnote
[junitlauncher] 
[junitlauncher] Running org.apache.poi.xwpf.usermodel.TestXWPFEndnote
[junitlauncher] Tests run: 4, Failures: 0, Aborted: 0, Skipped: 0, Time elapsed: 0.022000 sec
[junitlauncher] Running org.apache.poi.xwpf.usermodel.TestXWPFEndnotes
[junitlauncher] 
[junitlauncher] Running org.apache.poi.xwpf.usermodel.TestXWPFEndnotes
[junitlauncher] Tests run: 2, Failures: 0, Aborted: 0, Skipped: 0, Time elapsed: 0.009000 sec
[junitlauncher] Running org.apache.poi.xwpf.usermodel.TestXWPFFootnote
[junitlauncher] 
[junitlauncher] Running org.apache.poi.xwpf.usermodel.TestXWPFFootnote
[junitlauncher] Tests run: 4, Failures: 0, Aborted: 0, Skipped: 0, Time elapsed: 0.019000 sec
[junitlauncher] Running org.apache.poi.xwpf.usermodel.TestXWPFFootnotes
[junitlauncher] 
[junitlauncher] Running org.apache.poi.xwpf.usermodel.TestXWPFFootnotes
[junitlauncher] Tests run: 3, Failures: 0, Aborted: 0, Skipped: 0, Time elapsed: 0.024000 sec
[junitlauncher] Running org.apache.poi.xwpf.usermodel.TestXWPFHeader
[junitlauncher] 
[junitlauncher] Running org.apache.poi.xwpf.usermodel.TestXWPFHeader
[junitlauncher] Tests run: 6, Failures: 0, Aborted: 0, Skipped: 0, Time elapsed: 0.116000 sec
[junitlauncher] Running org.apache.poi.xwpf.usermodel.TestXWPFHeadings
[junitlauncher] 
[junitlauncher] Running org.apache.poi.xwpf.usermodel.TestXWPFHeadings
[junitlauncher] Tests run: 1, Failures: 0, Aborted: 0, Skipped: 0, Time elapsed: 0.032000 sec
[junitlauncher] Running org.apache.poi.xwpf.usermodel.TestXWPFNumbering
[junitlauncher] 
[junitlauncher] Running org.apache.poi.xwpf.usermodel.TestXWPFNumbering
[junitlauncher] Tests run: 10, Failures: 0, Aborted: 0, Skipped: 0, Time elapsed: 0.113000 sec
[junitlauncher] Running org.apache.poi.xwpf.usermodel.TestXWPFParagraph
[junitlauncher] 
[junitlauncher] Running org.apache.poi.xwpf.usermodel.TestXWPFParagraph
[junitlauncher] Tests run: 32, Failures: 0, Aborted: 0, Skipped: 0, Time elapsed: 0.205000 sec
[junitlauncher] Running org.apache.poi.xwpf.usermodel.TestXWPFPictureData
[junitlauncher] 
[junitlauncher] Running org.apache.poi.xwpf.usermodel.TestXWPFPictureData
[junitlauncher] Tests run: 6, Failures: 0, Aborted: 0, Skipped: 0, Time elapsed: 0.156000 sec
[junitlauncher] Running org.apache.poi.xwpf.usermodel.TestXWPFRun
[junitlauncher] 
[junitlauncher] Running org.apache.poi.xwpf.usermodel.TestXWPFRun
[junitlauncher] Tests run: 42, Failures: 0, Aborted: 0, Skipped: 0, Time elapsed: 0.237000 sec
[junitlauncher] Running org.apache.poi.xwpf.usermodel.TestXWPFSDT
[junitlauncher] 
[junitlauncher] Running org.apache.poi.xwpf.usermodel.TestXWPFSDT
[junitlauncher] Tests run: 8, Failures: 0, Aborted: 0, Skipped: 0, Time elapsed: 0.109000 sec
[junitlauncher] Running org.apache.poi.xwpf.usermodel.TestXWPFSmartTag
[junitlauncher] 
[junitlauncher] Running org.apache.poi.xwpf.usermodel.TestXWPFSmartTag
[junitlauncher] Tests run: 1, Failures: 0, Aborted: 0, Skipped: 0, Time elapsed: 0.009000 sec
[junitlauncher] Running org.apache.poi.xwpf.usermodel.TestXWPFStyles
[junitlauncher] 
[junitlauncher] Running org.apache.poi.xwpf.usermodel.TestXWPFStyles
[junitlauncher] Tests run: 11, Failures: 0, Aborted: 0, Skipped: 0, Time elapsed: 0.128000 sec
[junitlauncher] Running org.apache.poi.xwpf.usermodel.TestXWPFTable
[junitlauncher] 
[junitlauncher] Running org.apache.poi.xwpf.usermodel.TestXWPFTable
[junitlauncher] Tests run: 20, Failures: 0, Aborted: 0, Skipped: 0, Time elapsed: 0.112000 sec
[junitlauncher] Running org.apache.poi.xwpf.usermodel.TestXWPFTableCell
[junitlauncher] 
[junitlauncher] Running org.apache.poi.xwpf.usermodel.TestXWPFTableCell
[junitlauncher] Tests run: 13, Failures: 0, Aborted: 0, Skipped: 0, Time elapsed: 0.057000 sec
[junitlauncher] Running org.apache.poi.xwpf.usermodel.TestXWPFTableRow
[junitlauncher] 
[junitlauncher] Running org.apache.poi.xwpf.usermodel.TestXWPFTableRow
[junitlauncher] Tests run: 9, Failures: 0, Aborted: 0, Skipped: 0, Time elapsed: 0.039000 sec
[junitlauncher] Running org.apache.poi.xwpf.usermodel.TestXWPFTheme
[junitlauncher] 
[junitlauncher] Running org.apache.poi.xwpf.usermodel.TestXWPFTheme
[junitlauncher] Tests run: 1, Failures: 0, Aborted: 0, Skipped: 0, Time elapsed: 0.015000 sec

-test-ooxml-write-testfile:

compile-ooxml-lite:
     [echo] Create ooxml-lite schemas
    [javac] Compiling 1 source file to <https://ci-builds.apache.org/job/POI/job/POI-DSL-IBM-JDK/ws/poi-ooxml-lite/src/main/java9>
     [copy] Copying 1 file to <https://ci-builds.apache.org/job/POI/job/POI-DSL-IBM-JDK/ws/src/resources>
     [copy] Copying 1 file to <https://ci-builds.apache.org/job/POI/job/POI-DSL-IBM-JDK/ws/src/resources>
     [copy] Copying 1 file to <https://ci-builds.apache.org/job/POI/job/POI-DSL-IBM-JDK/ws/src/resources>
    [mkdir] Created dir: <https://ci-builds.apache.org/job/POI/job/POI-DSL-IBM-JDK/ws/build/dist/maven/poi-ooxml-lite>
      [jar] Building jar: <https://ci-builds.apache.org/job/POI/job/POI-DSL-IBM-JDK/310/artifact/build/dist/maven/poi-ooxml-lite/poi-ooxml-lite-6.0.0-SNAPSHOT.jar>
   [delete] Deleting: <https://ci-builds.apache.org/job/POI/job/POI-DSL-IBM-JDK/ws/src/resources/ooxml-lite-report.clazz1>
   [delete] Deleting: <https://ci-builds.apache.org/job/POI/job/POI-DSL-IBM-JDK/ws/src/resources/ooxml-lite-report.clazz2>
   [delete] Deleting: <https://ci-builds.apache.org/job/POI/job/POI-DSL-IBM-JDK/ws/src/resources/ooxml-lite-report.xsb2>

-test-excelant-check:

test-excelant:
[junitlauncher] Apr 19, 2026 7:42:05 AM sun.util.locale.provider.LocaleProviderAdapter <clinit>
[junitlauncher] WARNING: COMPAT locale provider will be removed in a future release
[junitlauncher] Running org.apache.poi.ss.excelant.TestBuildFile
[junitlauncher] 
[junitlauncher] Running org.apache.poi.ss.excelant.TestBuildFile
[junitlauncher] Tests run: 14, Failures: 0, Aborted: 0, Skipped: 0, Time elapsed: 4.503000 sec
[junitlauncher] Running org.apache.poi.ss.excelant.TestExcelAntPrecision
[junitlauncher] 
[junitlauncher] Running org.apache.poi.ss.excelant.TestExcelAntPrecision
[junitlauncher] Tests run: 1, Failures: 0, Aborted: 0, Skipped: 0, Time elapsed: 0.003000 sec
[junitlauncher] Running org.apache.poi.ss.excelant.TestExcelAntSet
[junitlauncher] 
[junitlauncher] Running org.apache.poi.ss.excelant.TestExcelAntSet
[junitlauncher] Tests run: 2, Failures: 0, Aborted: 0, Skipped: 0, Time elapsed: 0.038000 sec
[junitlauncher] Running org.apache.poi.ss.excelant.TestExcelAntSetDoubleCell
[junitlauncher] 
[junitlauncher] Running org.apache.poi.ss.excelant.TestExcelAntSetDoubleCell
[junitlauncher] Tests run: 1, Failures: 0, Aborted: 0, Skipped: 0, Time elapsed: 0.004000 sec
[junitlauncher] Running org.apache.poi.ss.excelant.TestExcelAntUserDefinedFunction
[junitlauncher] 
[junitlauncher] Running org.apache.poi.ss.excelant.TestExcelAntUserDefinedFunction
[junitlauncher] Tests run: 2, Failures: 0, Aborted: 0, Skipped: 0, Time elapsed: 0.005000 sec
[junitlauncher] Running org.apache.poi.ss.excelant.util.TestExcelAntEvaluationResult
[junitlauncher] 
[junitlauncher] Running org.apache.poi.ss.excelant.util.TestExcelAntEvaluationResult
[junitlauncher] Tests run: 4, Failures: 0, Aborted: 0, Skipped: 0, Time elapsed: 0.009000 sec
[junitlauncher] Running org.apache.poi.ss.excelant.util.TestExcelAntWorkbookUtil
[junitlauncher] 
[junitlauncher] Running org.apache.poi.ss.excelant.util.TestExcelAntWorkbookUtil
[junitlauncher] Tests run: 23, Failures: 0, Aborted: 0, Skipped: 0, Time elapsed: 1.598000 sec
[junitlauncher] Running org.apache.poi.ss.excelant.util.TestExcelAntWorkbookUtilFactory
[junitlauncher] 
[junitlauncher] Running org.apache.poi.ss.excelant.util.TestExcelAntWorkbookUtilFactory
[junitlauncher] Tests run: 2, Failures: 0, Aborted: 0, Skipped: 0, Time elapsed: 0.003000 sec

-test-excelant-write-testfile:

test:

compile-integration:
    [javac] Compiling 30 source files to <https://ci-builds.apache.org/job/POI/job/POI-DSL-IBM-JDK/ws/poi-integration/build/test-classes>
    [javac] Ignoring source, target and bootclasspath as release has been set
    [javac] Note: Annotation processing is enabled because one or more processors were found
    [javac]   on the class path. A future release of javac may disable annotation processing
    [javac]   unless at least one processor is specified by name (-processor), or a search
    [javac]   path is specified (--processor-path, --processor-module-path), or annotation
    [javac]   processing is enabled explicitly (-proc:only, -proc:full).
    [javac]   Use -Xlint:-options to suppress this message.
    [javac]   Use -proc:none to disable annotation processing.
    [javac] Note: <https://ci-builds.apache.org/job/POI/job/POI-DSL-IBM-JDK/ws/poi-integration/src/test/java/org/apache/poi/stress/OptimizedNullPrintStream.java> uses or overrides a deprecated API.
    [javac] Note: Recompile with -Xlint:deprecation for details.
    [mkdir] Created dir: <https://ci-builds.apache.org/job/POI/job/POI-DSL-IBM-JDK/ws/poi-integration/build/test-classes/META-INF/versions/9>
    [javac] Compiling 1 source file to <https://ci-builds.apache.org/job/POI/job/POI-DSL-IBM-JDK/ws/poi-integration/build/test-classes/META-INF/versions/9>
      [jar] Building jar: <https://ci-builds.apache.org/job/POI/job/POI-DSL-IBM-JDK/310/artifact/build/dist/maven/poi-integration/poi-integration-6.0.0-SNAPSHOT.jar>

-test-integration-check:

test-integration:
[junitlauncher] Apr 19, 2026 7:42:22 AM sun.util.locale.provider.LocaleProviderAdapter <clinit>
[junitlauncher] WARNING: COMPAT locale provider will be removed in a future release
[junitlauncher] Running org.apache.poi.stress.TestAllFiles
[junitlauncher] 
[junitlauncher] Running org.apache.poi.stress.TestAllFiles
[junitlauncher]    Failed: handleFile(String, FileHandlerKnown, String, Class, String): java.lang.NoClassDefFoundError: org.apache.commons.csv.CSVFormat
[junitlauncher]    Failed: handleAdditional(String, FileHandlerKnown, String, Class, String): java.lang.NoClassDefFoundError: org.apache.commons.csv.CSVFormat
[junitlauncher]    Failed: handleExtracting(String, FileHandlerKnown, String, Class, String): java.lang.NoClassDefFoundError: org.apache.commons.csv.CSVFormat
[junitlauncher] Tests run: 3, Failures: 3, Aborted: 0, Skipped: 0, Time elapsed: 0.148000 sec

BUILD FAILED
<https://ci-builds.apache.org/job/POI/job/POI-DSL-IBM-JDK/ws/build.xml>:1850: The following error occurred while executing this line:
<https://ci-builds.apache.org/job/POI/job/POI-DSL-IBM-JDK/ws/build.xml>:1394: Some test(s) have failure(s)

Total time: 13 minutes 45 seconds
Build step 'Invoke Ant' marked build as failure
[SpotBugs] Skipping execution of recorder since overall result is 'FAILURE'
ERROR: Not all environment variables could be successfully injected. Check for similarly-named environment variables.
Archiving artifacts
ERROR: Not all environment variables could be successfully injected. Check for similarly-named environment variables.
Recording test results
ERROR: Not all environment variables could be successfully injected. Check for similarly-named environment variables.
[Checks API] No suitable checks publisher found.
ERROR: Not all environment variables could be successfully injected. Check for similarly-named environment variables.

---------------------------------------------------------------------
To unsubscribe, e-mail: dev-unsubscribe@poi.apache.org
For additional commands, e-mail: dev-help@poi.apache.org


Build failed in Jenkins: POI » POI-DSL-IBM-JDK #309

Posted by Apache Jenkins Server <je...@builds.apache.org>.
See <https://ci-builds.apache.org/job/POI/job/POI-DSL-IBM-JDK/309/display/redirect?page=changes>

Changes:

[github] Fix Row.setRowStyle() not propagating styles to cells in XSSFCell and


------------------------------------------
[...truncated 303.18 KiB...]
[junitlauncher] Tests run: 2, Failures: 0, Aborted: 0, Skipped: 0, Time elapsed: 0.001000 sec
[junitlauncher] Running org.apache.poi.xssf.util.TestEvilUnclosedBRFixingInputStream
[junitlauncher] 
[junitlauncher] Running org.apache.poi.xssf.util.TestEvilUnclosedBRFixingInputStream
[junitlauncher] Tests run: 3, Failures: 0, Aborted: 0, Skipped: 0, Time elapsed: 0.044000 sec
[junitlauncher] Running org.apache.poi.xssf.util.TestNumericRanges
[junitlauncher] 
[junitlauncher] Running org.apache.poi.xssf.util.TestNumericRanges
[junitlauncher] Tests run: 2, Failures: 0, Aborted: 0, Skipped: 0, Time elapsed: 0.000000 sec
[junitlauncher] Running org.apache.poi.xwpf.TestAllExtendedProperties
[junitlauncher] 
[junitlauncher] Running org.apache.poi.xwpf.TestAllExtendedProperties
[junitlauncher] Tests run: 1, Failures: 0, Aborted: 0, Skipped: 0, Time elapsed: 0.048000 sec
[junitlauncher] Running org.apache.poi.xwpf.TestDocumentProtection
[junitlauncher] 
[junitlauncher] Running org.apache.poi.xwpf.TestDocumentProtection
[junitlauncher] Tests run: 10, Failures: 0, Aborted: 0, Skipped: 0, Time elapsed: 0.607000 sec
[junitlauncher] Running org.apache.poi.xwpf.TestNecessaryOOXMLClasses
[junitlauncher] 
[junitlauncher] Running org.apache.poi.xwpf.TestNecessaryOOXMLClasses
[junitlauncher] Tests run: 1, Failures: 0, Aborted: 0, Skipped: 0, Time elapsed: 0.011000 sec
[junitlauncher] Running org.apache.poi.xwpf.TestPackageCorePropertiesGetKeywords
[junitlauncher] 
[junitlauncher] Running org.apache.poi.xwpf.TestPackageCorePropertiesGetKeywords
[junitlauncher] Tests run: 1, Failures: 0, Aborted: 0, Skipped: 0, Time elapsed: 0.050000 sec
[junitlauncher] Running org.apache.poi.xwpf.TestXWPFBugs
[junitlauncher] 
[junitlauncher] Running org.apache.poi.xwpf.TestXWPFBugs
[junitlauncher] Tests run: 14, Failures: 0, Aborted: 0, Skipped: 0, Time elapsed: 9.165000 sec
[junitlauncher] Running org.apache.poi.xwpf.extractor.TestExternalEntities
[junitlauncher] 
[junitlauncher] Running org.apache.poi.xwpf.extractor.TestExternalEntities
[junitlauncher] Tests run: 1, Failures: 0, Aborted: 0, Skipped: 0, Time elapsed: 0.045000 sec
[junitlauncher] Running org.apache.poi.xwpf.extractor.TestXWPFWordExtractor
[junitlauncher] 
[junitlauncher] Running org.apache.poi.xwpf.extractor.TestXWPFWordExtractor
[junitlauncher] Tests run: 27, Failures: 0, Aborted: 0, Skipped: 0, Time elapsed: 1.407000 sec
[junitlauncher] Running org.apache.poi.xwpf.model.TestMultiSectionHeaders
[junitlauncher] 
[junitlauncher] Running org.apache.poi.xwpf.model.TestMultiSectionHeaders
[junitlauncher] Tests run: 2, Failures: 0, Aborted: 0, Skipped: 0, Time elapsed: 0.031000 sec
[junitlauncher] Running org.apache.poi.xwpf.model.TestXWPFDecorators
[junitlauncher] 
[junitlauncher] Running org.apache.poi.xwpf.model.TestXWPFDecorators
[junitlauncher] Tests run: 2, Failures: 0, Aborted: 0, Skipped: 0, Time elapsed: 0.143000 sec
[junitlauncher] Running org.apache.poi.xwpf.model.TestXWPFHeaderFooterPolicy
[junitlauncher] 
[junitlauncher] Running org.apache.poi.xwpf.model.TestXWPFHeaderFooterPolicy
[junitlauncher] Tests run: 3, Failures: 0, Aborted: 0, Skipped: 0, Time elapsed: 0.421000 sec
[junitlauncher] Running org.apache.poi.xwpf.usermodel.TestChangeTracking
[junitlauncher] 
[junitlauncher] Running org.apache.poi.xwpf.usermodel.TestChangeTracking
[junitlauncher] Tests run: 3, Failures: 0, Aborted: 0, Skipped: 0, Time elapsed: 0.067000 sec
[junitlauncher] Running org.apache.poi.xwpf.usermodel.TestColumn
[junitlauncher] 
[junitlauncher] Running org.apache.poi.xwpf.usermodel.TestColumn
[junitlauncher] Tests run: 4, Failures: 0, Aborted: 0, Skipped: 0, Time elapsed: 0.038000 sec
[junitlauncher] Running org.apache.poi.xwpf.usermodel.TestXWPFAbstractNum
[junitlauncher] 
[junitlauncher] Running org.apache.poi.xwpf.usermodel.TestXWPFAbstractNum
[junitlauncher] Tests run: 1, Failures: 0, Aborted: 0, Skipped: 0, Time elapsed: 0.000000 sec
[junitlauncher] Running org.apache.poi.xwpf.usermodel.TestXWPFBugs
[junitlauncher] 
[junitlauncher] Running org.apache.poi.xwpf.usermodel.TestXWPFBugs
[junitlauncher] Tests run: 15, Failures: 0, Aborted: 0, Skipped: 0, Time elapsed: 1.049000 sec
[junitlauncher] Running org.apache.poi.xwpf.usermodel.TestXWPFChart
[junitlauncher] 
[junitlauncher] Running org.apache.poi.xwpf.usermodel.TestXWPFChart
[junitlauncher] Tests run: 4, Failures: 0, Aborted: 0, Skipped: 0, Time elapsed: 0.082000 sec
[junitlauncher] Running org.apache.poi.xwpf.usermodel.TestXWPFComment
[junitlauncher] 
[junitlauncher] Running org.apache.poi.xwpf.usermodel.TestXWPFComment
[junitlauncher] Tests run: 6, Failures: 0, Aborted: 0, Skipped: 0, Time elapsed: 0.351000 sec
[junitlauncher] Running org.apache.poi.xwpf.usermodel.TestXWPFComments
[junitlauncher] 
[junitlauncher] Running org.apache.poi.xwpf.usermodel.TestXWPFComments
[junitlauncher] Tests run: 2, Failures: 0, Aborted: 0, Skipped: 0, Time elapsed: 0.029000 sec
[junitlauncher] Running org.apache.poi.xwpf.usermodel.TestXWPFDocument
[junitlauncher] 
[junitlauncher] Running org.apache.poi.xwpf.usermodel.TestXWPFDocument
[junitlauncher] Tests run: 28, Failures: 0, Aborted: 0, Skipped: 1, Time elapsed: 0.891000 sec
[junitlauncher] Running org.apache.poi.xwpf.usermodel.TestXWPFEndnote
[junitlauncher] 
[junitlauncher] Running org.apache.poi.xwpf.usermodel.TestXWPFEndnote
[junitlauncher] Tests run: 4, Failures: 0, Aborted: 0, Skipped: 0, Time elapsed: 0.033000 sec
[junitlauncher] Running org.apache.poi.xwpf.usermodel.TestXWPFEndnotes
[junitlauncher] 
[junitlauncher] Running org.apache.poi.xwpf.usermodel.TestXWPFEndnotes
[junitlauncher] Tests run: 2, Failures: 0, Aborted: 0, Skipped: 0, Time elapsed: 0.009000 sec
[junitlauncher] Running org.apache.poi.xwpf.usermodel.TestXWPFFootnote
[junitlauncher] 
[junitlauncher] Running org.apache.poi.xwpf.usermodel.TestXWPFFootnote
[junitlauncher] Tests run: 4, Failures: 0, Aborted: 0, Skipped: 0, Time elapsed: 0.022000 sec
[junitlauncher] Running org.apache.poi.xwpf.usermodel.TestXWPFFootnotes
[junitlauncher] 
[junitlauncher] Running org.apache.poi.xwpf.usermodel.TestXWPFFootnotes
[junitlauncher] Tests run: 3, Failures: 0, Aborted: 0, Skipped: 0, Time elapsed: 0.034000 sec
[junitlauncher] Running org.apache.poi.xwpf.usermodel.TestXWPFHeader
[junitlauncher] 
[junitlauncher] Running org.apache.poi.xwpf.usermodel.TestXWPFHeader
[junitlauncher] Tests run: 6, Failures: 0, Aborted: 0, Skipped: 0, Time elapsed: 0.269000 sec
[junitlauncher] Running org.apache.poi.xwpf.usermodel.TestXWPFHeadings
[junitlauncher] 
[junitlauncher] Running org.apache.poi.xwpf.usermodel.TestXWPFHeadings
[junitlauncher] Tests run: 1, Failures: 0, Aborted: 0, Skipped: 0, Time elapsed: 0.035000 sec
[junitlauncher] Running org.apache.poi.xwpf.usermodel.TestXWPFNumbering
[junitlauncher] 
[junitlauncher] Running org.apache.poi.xwpf.usermodel.TestXWPFNumbering
[junitlauncher] Tests run: 10, Failures: 0, Aborted: 0, Skipped: 0, Time elapsed: 0.300000 sec
[junitlauncher] Running org.apache.poi.xwpf.usermodel.TestXWPFParagraph
[junitlauncher] 
[junitlauncher] Running org.apache.poi.xwpf.usermodel.TestXWPFParagraph
[junitlauncher] Tests run: 32, Failures: 0, Aborted: 0, Skipped: 0, Time elapsed: 0.335000 sec
[junitlauncher] Running org.apache.poi.xwpf.usermodel.TestXWPFPictureData
[junitlauncher] 
[junitlauncher] Running org.apache.poi.xwpf.usermodel.TestXWPFPictureData
[junitlauncher] Tests run: 6, Failures: 0, Aborted: 0, Skipped: 0, Time elapsed: 0.334000 sec
[junitlauncher] Running org.apache.poi.xwpf.usermodel.TestXWPFRun
[junitlauncher] 
[junitlauncher] Running org.apache.poi.xwpf.usermodel.TestXWPFRun
[junitlauncher] Tests run: 42, Failures: 0, Aborted: 0, Skipped: 0, Time elapsed: 0.364000 sec
[junitlauncher] Running org.apache.poi.xwpf.usermodel.TestXWPFSDT
[junitlauncher] 
[junitlauncher] Running org.apache.poi.xwpf.usermodel.TestXWPFSDT
[junitlauncher] Tests run: 8, Failures: 0, Aborted: 0, Skipped: 0, Time elapsed: 0.252000 sec
[junitlauncher] Running org.apache.poi.xwpf.usermodel.TestXWPFSmartTag
[junitlauncher] 
[junitlauncher] Running org.apache.poi.xwpf.usermodel.TestXWPFSmartTag
[junitlauncher] Tests run: 1, Failures: 0, Aborted: 0, Skipped: 0, Time elapsed: 0.020000 sec
[junitlauncher] Running org.apache.poi.xwpf.usermodel.TestXWPFStyles
[junitlauncher] 
[junitlauncher] Running org.apache.poi.xwpf.usermodel.TestXWPFStyles
[junitlauncher] Tests run: 11, Failures: 0, Aborted: 0, Skipped: 0, Time elapsed: 0.287000 sec
[junitlauncher] Running org.apache.poi.xwpf.usermodel.TestXWPFTable
[junitlauncher] 
[junitlauncher] Running org.apache.poi.xwpf.usermodel.TestXWPFTable
[junitlauncher] Tests run: 20, Failures: 0, Aborted: 0, Skipped: 0, Time elapsed: 0.179000 sec
[junitlauncher] Running org.apache.poi.xwpf.usermodel.TestXWPFTableCell
[junitlauncher] 
[junitlauncher] Running org.apache.poi.xwpf.usermodel.TestXWPFTableCell
[junitlauncher] Tests run: 13, Failures: 0, Aborted: 0, Skipped: 0, Time elapsed: 0.091000 sec
[junitlauncher] Running org.apache.poi.xwpf.usermodel.TestXWPFTableRow
[junitlauncher] 
[junitlauncher] Running org.apache.poi.xwpf.usermodel.TestXWPFTableRow
[junitlauncher] Tests run: 9, Failures: 0, Aborted: 0, Skipped: 0, Time elapsed: 0.057000 sec
[junitlauncher] Running org.apache.poi.xwpf.usermodel.TestXWPFTheme
[junitlauncher] 
[junitlauncher] Running org.apache.poi.xwpf.usermodel.TestXWPFTheme
[junitlauncher] Tests run: 1, Failures: 0, Aborted: 0, Skipped: 0, Time elapsed: 0.023000 sec

-test-ooxml-write-testfile:

compile-ooxml-lite:
     [echo] Create ooxml-lite schemas
    [javac] Compiling 1 source file to <https://ci-builds.apache.org/job/POI/job/POI-DSL-IBM-JDK/ws/poi-ooxml-lite/src/main/java9>
     [copy] Copying 1 file to <https://ci-builds.apache.org/job/POI/job/POI-DSL-IBM-JDK/ws/src/resources>
     [copy] Copying 1 file to <https://ci-builds.apache.org/job/POI/job/POI-DSL-IBM-JDK/ws/src/resources>
     [copy] Copying 1 file to <https://ci-builds.apache.org/job/POI/job/POI-DSL-IBM-JDK/ws/src/resources>
    [mkdir] Created dir: <https://ci-builds.apache.org/job/POI/job/POI-DSL-IBM-JDK/ws/build/dist/maven/poi-ooxml-lite>
      [jar] Building jar: <https://ci-builds.apache.org/job/POI/job/POI-DSL-IBM-JDK/309/artifact/build/dist/maven/poi-ooxml-lite/poi-ooxml-lite-6.0.0-SNAPSHOT.jar>
   [delete] Deleting: <https://ci-builds.apache.org/job/POI/job/POI-DSL-IBM-JDK/ws/src/resources/ooxml-lite-report.clazz1>
   [delete] Deleting: <https://ci-builds.apache.org/job/POI/job/POI-DSL-IBM-JDK/ws/src/resources/ooxml-lite-report.clazz2>
   [delete] Deleting: <https://ci-builds.apache.org/job/POI/job/POI-DSL-IBM-JDK/ws/src/resources/ooxml-lite-report.xsb2>

-test-excelant-check:

test-excelant:
[junitlauncher] Apr 12, 2026 7:45:49 AM sun.util.locale.provider.LocaleProviderAdapter <clinit>
[junitlauncher] WARNING: COMPAT locale provider will be removed in a future release
[junitlauncher] Running org.apache.poi.ss.excelant.TestBuildFile
[junitlauncher] 
[junitlauncher] Running org.apache.poi.ss.excelant.TestBuildFile
[junitlauncher] Tests run: 14, Failures: 0, Aborted: 0, Skipped: 0, Time elapsed: 5.576000 sec
[junitlauncher] Running org.apache.poi.ss.excelant.TestExcelAntPrecision
[junitlauncher] 
[junitlauncher] Running org.apache.poi.ss.excelant.TestExcelAntPrecision
[junitlauncher] Tests run: 1, Failures: 0, Aborted: 0, Skipped: 0, Time elapsed: 0.003000 sec
[junitlauncher] Running org.apache.poi.ss.excelant.TestExcelAntSet
[junitlauncher] 
[junitlauncher] Running org.apache.poi.ss.excelant.TestExcelAntSet
[junitlauncher] Tests run: 2, Failures: 0, Aborted: 0, Skipped: 0, Time elapsed: 0.043000 sec
[junitlauncher] Running org.apache.poi.ss.excelant.TestExcelAntSetDoubleCell
[junitlauncher] 
[junitlauncher] Running org.apache.poi.ss.excelant.TestExcelAntSetDoubleCell
[junitlauncher] Tests run: 1, Failures: 0, Aborted: 0, Skipped: 0, Time elapsed: 0.006000 sec
[junitlauncher] Running org.apache.poi.ss.excelant.TestExcelAntUserDefinedFunction
[junitlauncher] 
[junitlauncher] Running org.apache.poi.ss.excelant.TestExcelAntUserDefinedFunction
[junitlauncher] Tests run: 2, Failures: 0, Aborted: 0, Skipped: 0, Time elapsed: 0.004000 sec
[junitlauncher] Running org.apache.poi.ss.excelant.util.TestExcelAntEvaluationResult
[junitlauncher] 
[junitlauncher] Running org.apache.poi.ss.excelant.util.TestExcelAntEvaluationResult
[junitlauncher] Tests run: 4, Failures: 0, Aborted: 0, Skipped: 0, Time elapsed: 0.009000 sec
[junitlauncher] Running org.apache.poi.ss.excelant.util.TestExcelAntWorkbookUtil
[junitlauncher] 
[junitlauncher] Running org.apache.poi.ss.excelant.util.TestExcelAntWorkbookUtil
[junitlauncher] Tests run: 23, Failures: 0, Aborted: 0, Skipped: 0, Time elapsed: 2.057000 sec
[junitlauncher] Running org.apache.poi.ss.excelant.util.TestExcelAntWorkbookUtilFactory
[junitlauncher] 
[junitlauncher] Running org.apache.poi.ss.excelant.util.TestExcelAntWorkbookUtilFactory
[junitlauncher] Tests run: 2, Failures: 0, Aborted: 0, Skipped: 0, Time elapsed: 0.003000 sec

-test-excelant-write-testfile:

test:

compile-integration:
    [javac] Compiling 30 source files to <https://ci-builds.apache.org/job/POI/job/POI-DSL-IBM-JDK/ws/poi-integration/build/test-classes>
    [javac] Ignoring source, target and bootclasspath as release has been set
    [javac] Note: Annotation processing is enabled because one or more processors were found
    [javac]   on the class path. A future release of javac may disable annotation processing
    [javac]   unless at least one processor is specified by name (-processor), or a search
    [javac]   path is specified (--processor-path, --processor-module-path), or annotation
    [javac]   processing is enabled explicitly (-proc:only, -proc:full).
    [javac]   Use -Xlint:-options to suppress this message.
    [javac]   Use -proc:none to disable annotation processing.
    [javac] Note: <https://ci-builds.apache.org/job/POI/job/POI-DSL-IBM-JDK/ws/poi-integration/src/test/java/org/apache/poi/stress/OptimizedNullPrintStream.java> uses or overrides a deprecated API.
    [javac] Note: Recompile with -Xlint:deprecation for details.
    [mkdir] Created dir: <https://ci-builds.apache.org/job/POI/job/POI-DSL-IBM-JDK/ws/poi-integration/build/test-classes/META-INF/versions/9>
    [javac] Compiling 1 source file to <https://ci-builds.apache.org/job/POI/job/POI-DSL-IBM-JDK/ws/poi-integration/build/test-classes/META-INF/versions/9>
      [jar] Building jar: <https://ci-builds.apache.org/job/POI/job/POI-DSL-IBM-JDK/309/artifact/build/dist/maven/poi-integration/poi-integration-6.0.0-SNAPSHOT.jar>

-test-integration-check:

test-integration:
[junitlauncher] Apr 12, 2026 7:46:13 AM sun.util.locale.provider.LocaleProviderAdapter <clinit>
[junitlauncher] WARNING: COMPAT locale provider will be removed in a future release
[junitlauncher] Running org.apache.poi.stress.TestAllFiles
[junitlauncher] 
[junitlauncher] Running org.apache.poi.stress.TestAllFiles
[junitlauncher]    Failed: handleExtracting(String, FileHandlerKnown, String, Class, String): java.lang.NoClassDefFoundError: org.apache.commons.csv.CSVFormat
[junitlauncher]    Failed: handleAdditional(String, FileHandlerKnown, String, Class, String): java.lang.NoClassDefFoundError: org.apache.commons.csv.CSVFormat
[junitlauncher]    Failed: handleFile(String, FileHandlerKnown, String, Class, String): java.lang.NoClassDefFoundError: org.apache.commons.csv.CSVFormat
[junitlauncher] Tests run: 3, Failures: 3, Aborted: 0, Skipped: 0, Time elapsed: 0.170000 sec

BUILD FAILED
<https://ci-builds.apache.org/job/POI/job/POI-DSL-IBM-JDK/ws/build.xml>:1850: The following error occurred while executing this line:
<https://ci-builds.apache.org/job/POI/job/POI-DSL-IBM-JDK/ws/build.xml>:1394: Some test(s) have failure(s)

Total time: 17 minutes 49 seconds
Build step 'Invoke Ant' marked build as failure
[SpotBugs] Skipping execution of recorder since overall result is 'FAILURE'
ERROR: Not all environment variables could be successfully injected. Check for similarly-named environment variables.
Archiving artifacts
ERROR: Not all environment variables could be successfully injected. Check for similarly-named environment variables.
Recording test results
ERROR: Not all environment variables could be successfully injected. Check for similarly-named environment variables.
[Checks API] No suitable checks publisher found.
ERROR: Not all environment variables could be successfully injected. Check for similarly-named environment variables.

---------------------------------------------------------------------
To unsubscribe, e-mail: dev-unsubscribe@poi.apache.org
For additional commands, e-mail: dev-help@poi.apache.org


Build failed in Jenkins: POI » POI-DSL-IBM-JDK #308

Posted by Apache Jenkins Server <je...@builds.apache.org>.
See <https://ci-builds.apache.org/job/POI/job/POI-DSL-IBM-JDK/308/display/redirect?page=changes>

Changes:

[github] Bump org.sonarqube from 7.2.2.6593 to 7.2.3.7755 (#1037)

[github] Remove redundant stripe style settings in CreateTable (#1040)


------------------------------------------
[...truncated 316.92 KiB...]
[junitlauncher] Tests run: 2, Failures: 0, Aborted: 0, Skipped: 0, Time elapsed: 0.001000 sec
[junitlauncher] Running org.apache.poi.xssf.util.TestEvilUnclosedBRFixingInputStream
[junitlauncher] 
[junitlauncher] Running org.apache.poi.xssf.util.TestEvilUnclosedBRFixingInputStream
[junitlauncher] Tests run: 3, Failures: 0, Aborted: 0, Skipped: 0, Time elapsed: 0.063000 sec
[junitlauncher] Running org.apache.poi.xssf.util.TestNumericRanges
[junitlauncher] 
[junitlauncher] Running org.apache.poi.xssf.util.TestNumericRanges
[junitlauncher] Tests run: 2, Failures: 0, Aborted: 0, Skipped: 0, Time elapsed: 0.001000 sec
[junitlauncher] Running org.apache.poi.xwpf.TestAllExtendedProperties
[junitlauncher] 
[junitlauncher] Running org.apache.poi.xwpf.TestAllExtendedProperties
[junitlauncher] Tests run: 1, Failures: 0, Aborted: 0, Skipped: 0, Time elapsed: 0.036000 sec
[junitlauncher] Running org.apache.poi.xwpf.TestDocumentProtection
[junitlauncher] 
[junitlauncher] Running org.apache.poi.xwpf.TestDocumentProtection
[junitlauncher] Tests run: 10, Failures: 0, Aborted: 0, Skipped: 0, Time elapsed: 0.457000 sec
[junitlauncher] Running org.apache.poi.xwpf.TestNecessaryOOXMLClasses
[junitlauncher] 
[junitlauncher] Running org.apache.poi.xwpf.TestNecessaryOOXMLClasses
[junitlauncher] Tests run: 1, Failures: 0, Aborted: 0, Skipped: 0, Time elapsed: 0.011000 sec
[junitlauncher] Running org.apache.poi.xwpf.TestPackageCorePropertiesGetKeywords
[junitlauncher] 
[junitlauncher] Running org.apache.poi.xwpf.TestPackageCorePropertiesGetKeywords
[junitlauncher] Tests run: 1, Failures: 0, Aborted: 0, Skipped: 0, Time elapsed: 0.037000 sec
[junitlauncher] Running org.apache.poi.xwpf.TestXWPFBugs
[junitlauncher] 
[junitlauncher] Running org.apache.poi.xwpf.TestXWPFBugs
[junitlauncher] Tests run: 14, Failures: 0, Aborted: 0, Skipped: 0, Time elapsed: 4.859000 sec
[junitlauncher] Running org.apache.poi.xwpf.extractor.TestExternalEntities
[junitlauncher] 
[junitlauncher] Running org.apache.poi.xwpf.extractor.TestExternalEntities
[junitlauncher] Tests run: 1, Failures: 0, Aborted: 0, Skipped: 0, Time elapsed: 0.024000 sec
[junitlauncher] Running org.apache.poi.xwpf.extractor.TestXWPFWordExtractor
[junitlauncher] 
[junitlauncher] Running org.apache.poi.xwpf.extractor.TestXWPFWordExtractor
[junitlauncher] Tests run: 27, Failures: 0, Aborted: 0, Skipped: 0, Time elapsed: 0.913000 sec
[junitlauncher] Running org.apache.poi.xwpf.model.TestMultiSectionHeaders
[junitlauncher] 
[junitlauncher] Running org.apache.poi.xwpf.model.TestMultiSectionHeaders
[junitlauncher] Tests run: 2, Failures: 0, Aborted: 0, Skipped: 0, Time elapsed: 0.009000 sec
[junitlauncher] Running org.apache.poi.xwpf.model.TestXWPFDecorators
[junitlauncher] 
[junitlauncher] Running org.apache.poi.xwpf.model.TestXWPFDecorators
[junitlauncher] Tests run: 2, Failures: 0, Aborted: 0, Skipped: 0, Time elapsed: 0.101000 sec
[junitlauncher] Running org.apache.poi.xwpf.model.TestXWPFHeaderFooterPolicy
[junitlauncher] 
[junitlauncher] Running org.apache.poi.xwpf.model.TestXWPFHeaderFooterPolicy
[junitlauncher] Tests run: 3, Failures: 0, Aborted: 0, Skipped: 0, Time elapsed: 0.332000 sec
[junitlauncher] Running org.apache.poi.xwpf.usermodel.TestChangeTracking
[junitlauncher] 
[junitlauncher] Running org.apache.poi.xwpf.usermodel.TestChangeTracking
[junitlauncher] Tests run: 3, Failures: 0, Aborted: 0, Skipped: 0, Time elapsed: 0.030000 sec
[junitlauncher] Running org.apache.poi.xwpf.usermodel.TestColumn
[junitlauncher] 
[junitlauncher] Running org.apache.poi.xwpf.usermodel.TestColumn
[junitlauncher] Tests run: 4, Failures: 0, Aborted: 0, Skipped: 0, Time elapsed: 0.033000 sec
[junitlauncher] Running org.apache.poi.xwpf.usermodel.TestXWPFAbstractNum
[junitlauncher] 
[junitlauncher] Running org.apache.poi.xwpf.usermodel.TestXWPFAbstractNum
[junitlauncher] Tests run: 1, Failures: 0, Aborted: 0, Skipped: 0, Time elapsed: 0.000000 sec
[junitlauncher] Running org.apache.poi.xwpf.usermodel.TestXWPFBugs
[junitlauncher] 
[junitlauncher] Running org.apache.poi.xwpf.usermodel.TestXWPFBugs
[junitlauncher] Tests run: 15, Failures: 0, Aborted: 0, Skipped: 0, Time elapsed: 0.573000 sec
[junitlauncher] Running org.apache.poi.xwpf.usermodel.TestXWPFChart
[junitlauncher] 
[junitlauncher] Running org.apache.poi.xwpf.usermodel.TestXWPFChart
[junitlauncher] Tests run: 4, Failures: 0, Aborted: 0, Skipped: 0, Time elapsed: 0.062000 sec
[junitlauncher] Running org.apache.poi.xwpf.usermodel.TestXWPFComment
[junitlauncher] 
[junitlauncher] Running org.apache.poi.xwpf.usermodel.TestXWPFComment
[junitlauncher] Tests run: 6, Failures: 0, Aborted: 0, Skipped: 0, Time elapsed: 0.486000 sec
[junitlauncher] Running org.apache.poi.xwpf.usermodel.TestXWPFComments
[junitlauncher] 
[junitlauncher] Running org.apache.poi.xwpf.usermodel.TestXWPFComments
[junitlauncher] Tests run: 2, Failures: 0, Aborted: 0, Skipped: 0, Time elapsed: 0.026000 sec
[junitlauncher] Running org.apache.poi.xwpf.usermodel.TestXWPFDocument
[junitlauncher] 
[junitlauncher] Running org.apache.poi.xwpf.usermodel.TestXWPFDocument
[junitlauncher] Tests run: 28, Failures: 0, Aborted: 0, Skipped: 1, Time elapsed: 0.572000 sec
[junitlauncher] Running org.apache.poi.xwpf.usermodel.TestXWPFEndnote
[junitlauncher] 
[junitlauncher] Running org.apache.poi.xwpf.usermodel.TestXWPFEndnote
[junitlauncher] Tests run: 4, Failures: 0, Aborted: 0, Skipped: 0, Time elapsed: 0.022000 sec
[junitlauncher] Running org.apache.poi.xwpf.usermodel.TestXWPFEndnotes
[junitlauncher] 
[junitlauncher] Running org.apache.poi.xwpf.usermodel.TestXWPFEndnotes
[junitlauncher] Tests run: 2, Failures: 0, Aborted: 0, Skipped: 0, Time elapsed: 0.009000 sec
[junitlauncher] Running org.apache.poi.xwpf.usermodel.TestXWPFFootnote
[junitlauncher] 
[junitlauncher] Running org.apache.poi.xwpf.usermodel.TestXWPFFootnote
[junitlauncher] Tests run: 4, Failures: 0, Aborted: 0, Skipped: 0, Time elapsed: 0.027000 sec
[junitlauncher] Running org.apache.poi.xwpf.usermodel.TestXWPFFootnotes
[junitlauncher] 
[junitlauncher] Running org.apache.poi.xwpf.usermodel.TestXWPFFootnotes
[junitlauncher] Tests run: 3, Failures: 0, Aborted: 0, Skipped: 0, Time elapsed: 0.032000 sec
[junitlauncher] Running org.apache.poi.xwpf.usermodel.TestXWPFHeader
[junitlauncher] 
[junitlauncher] Running org.apache.poi.xwpf.usermodel.TestXWPFHeader
[junitlauncher] Tests run: 6, Failures: 0, Aborted: 0, Skipped: 0, Time elapsed: 0.203000 sec
[junitlauncher] Running org.apache.poi.xwpf.usermodel.TestXWPFHeadings
[junitlauncher] 
[junitlauncher] Running org.apache.poi.xwpf.usermodel.TestXWPFHeadings
[junitlauncher] Tests run: 1, Failures: 0, Aborted: 0, Skipped: 0, Time elapsed: 0.045000 sec
[junitlauncher] Running org.apache.poi.xwpf.usermodel.TestXWPFNumbering
[junitlauncher] 
[junitlauncher] Running org.apache.poi.xwpf.usermodel.TestXWPFNumbering
[junitlauncher] Tests run: 10, Failures: 0, Aborted: 0, Skipped: 0, Time elapsed: 0.165000 sec
[junitlauncher] Running org.apache.poi.xwpf.usermodel.TestXWPFParagraph
[junitlauncher] 
[junitlauncher] Running org.apache.poi.xwpf.usermodel.TestXWPFParagraph
[junitlauncher] Tests run: 32, Failures: 0, Aborted: 0, Skipped: 0, Time elapsed: 0.266000 sec
[junitlauncher] Running org.apache.poi.xwpf.usermodel.TestXWPFPictureData
[junitlauncher] 
[junitlauncher] Running org.apache.poi.xwpf.usermodel.TestXWPFPictureData
[junitlauncher] Tests run: 6, Failures: 0, Aborted: 0, Skipped: 0, Time elapsed: 0.179000 sec
[junitlauncher] Running org.apache.poi.xwpf.usermodel.TestXWPFRun
[junitlauncher] 
[junitlauncher] Running org.apache.poi.xwpf.usermodel.TestXWPFRun
[junitlauncher] Tests run: 42, Failures: 0, Aborted: 0, Skipped: 0, Time elapsed: 0.288000 sec
[junitlauncher] Running org.apache.poi.xwpf.usermodel.TestXWPFSDT
[junitlauncher] 
[junitlauncher] Running org.apache.poi.xwpf.usermodel.TestXWPFSDT
[junitlauncher] Tests run: 8, Failures: 0, Aborted: 0, Skipped: 0, Time elapsed: 0.159000 sec
[junitlauncher] Running org.apache.poi.xwpf.usermodel.TestXWPFSmartTag
[junitlauncher] 
[junitlauncher] Running org.apache.poi.xwpf.usermodel.TestXWPFSmartTag
[junitlauncher] Tests run: 1, Failures: 0, Aborted: 0, Skipped: 0, Time elapsed: 0.010000 sec
[junitlauncher] Running org.apache.poi.xwpf.usermodel.TestXWPFStyles
[junitlauncher] 
[junitlauncher] Running org.apache.poi.xwpf.usermodel.TestXWPFStyles
[junitlauncher] Tests run: 11, Failures: 0, Aborted: 0, Skipped: 0, Time elapsed: 0.182000 sec
[junitlauncher] Running org.apache.poi.xwpf.usermodel.TestXWPFTable
[junitlauncher] 
[junitlauncher] Running org.apache.poi.xwpf.usermodel.TestXWPFTable
[junitlauncher] Tests run: 20, Failures: 0, Aborted: 0, Skipped: 0, Time elapsed: 0.140000 sec
[junitlauncher] Running org.apache.poi.xwpf.usermodel.TestXWPFTableCell
[junitlauncher] 
[junitlauncher] Running org.apache.poi.xwpf.usermodel.TestXWPFTableCell
[junitlauncher] Tests run: 13, Failures: 0, Aborted: 0, Skipped: 0, Time elapsed: 0.067000 sec
[junitlauncher] Running org.apache.poi.xwpf.usermodel.TestXWPFTableRow
[junitlauncher] 
[junitlauncher] Running org.apache.poi.xwpf.usermodel.TestXWPFTableRow
[junitlauncher] Tests run: 9, Failures: 0, Aborted: 0, Skipped: 0, Time elapsed: 0.047000 sec
[junitlauncher] Running org.apache.poi.xwpf.usermodel.TestXWPFTheme
[junitlauncher] 
[junitlauncher] Running org.apache.poi.xwpf.usermodel.TestXWPFTheme
[junitlauncher] Tests run: 1, Failures: 0, Aborted: 0, Skipped: 0, Time elapsed: 0.019000 sec

-test-ooxml-write-testfile:

compile-ooxml-lite:
     [echo] Create ooxml-lite schemas
    [javac] Compiling 1 source file to <https://ci-builds.apache.org/job/POI/job/POI-DSL-IBM-JDK/ws/poi-ooxml-lite/src/main/java9>
     [copy] Copying 1 file to <https://ci-builds.apache.org/job/POI/job/POI-DSL-IBM-JDK/ws/src/resources>
     [copy] Copying 1 file to <https://ci-builds.apache.org/job/POI/job/POI-DSL-IBM-JDK/ws/src/resources>
     [copy] Copying 1 file to <https://ci-builds.apache.org/job/POI/job/POI-DSL-IBM-JDK/ws/src/resources>
    [mkdir] Created dir: <https://ci-builds.apache.org/job/POI/job/POI-DSL-IBM-JDK/ws/build/dist/maven/poi-ooxml-lite>
      [jar] Building jar: <https://ci-builds.apache.org/job/POI/job/POI-DSL-IBM-JDK/308/artifact/build/dist/maven/poi-ooxml-lite/poi-ooxml-lite-6.0.0-SNAPSHOT.jar>
   [delete] Deleting: <https://ci-builds.apache.org/job/POI/job/POI-DSL-IBM-JDK/ws/src/resources/ooxml-lite-report.clazz1>
   [delete] Deleting: <https://ci-builds.apache.org/job/POI/job/POI-DSL-IBM-JDK/ws/src/resources/ooxml-lite-report.clazz2>
   [delete] Deleting: <https://ci-builds.apache.org/job/POI/job/POI-DSL-IBM-JDK/ws/src/resources/ooxml-lite-report.xsb2>

-test-excelant-check:

test-excelant:
[junitlauncher] Mar 29, 2026 7:45:41 AM sun.util.locale.provider.LocaleProviderAdapter <clinit>
[junitlauncher] WARNING: COMPAT locale provider will be removed in a future release
[junitlauncher] Running org.apache.poi.ss.excelant.TestBuildFile
[junitlauncher] 
[junitlauncher] Running org.apache.poi.ss.excelant.TestBuildFile
[junitlauncher] Tests run: 14, Failures: 0, Aborted: 0, Skipped: 0, Time elapsed: 6.123000 sec
[junitlauncher] Running org.apache.poi.ss.excelant.TestExcelAntPrecision
[junitlauncher] 
[junitlauncher] Running org.apache.poi.ss.excelant.TestExcelAntPrecision
[junitlauncher] Tests run: 1, Failures: 0, Aborted: 0, Skipped: 0, Time elapsed: 0.004000 sec
[junitlauncher] Running org.apache.poi.ss.excelant.TestExcelAntSet
[junitlauncher] 
[junitlauncher] Running org.apache.poi.ss.excelant.TestExcelAntSet
[junitlauncher] Tests run: 2, Failures: 0, Aborted: 0, Skipped: 0, Time elapsed: 0.041000 sec
[junitlauncher] Running org.apache.poi.ss.excelant.TestExcelAntSetDoubleCell
[junitlauncher] 
[junitlauncher] Running org.apache.poi.ss.excelant.TestExcelAntSetDoubleCell
[junitlauncher] Tests run: 1, Failures: 0, Aborted: 0, Skipped: 0, Time elapsed: 0.003000 sec
[junitlauncher] Running org.apache.poi.ss.excelant.TestExcelAntUserDefinedFunction
[junitlauncher] 
[junitlauncher] Running org.apache.poi.ss.excelant.TestExcelAntUserDefinedFunction
[junitlauncher] Tests run: 2, Failures: 0, Aborted: 0, Skipped: 0, Time elapsed: 0.005000 sec
[junitlauncher] Running org.apache.poi.ss.excelant.util.TestExcelAntEvaluationResult
[junitlauncher] 
[junitlauncher] Running org.apache.poi.ss.excelant.util.TestExcelAntEvaluationResult
[junitlauncher] Tests run: 4, Failures: 0, Aborted: 0, Skipped: 0, Time elapsed: 0.011000 sec
[junitlauncher] Running org.apache.poi.ss.excelant.util.TestExcelAntWorkbookUtil
[junitlauncher] 
[junitlauncher] Running org.apache.poi.ss.excelant.util.TestExcelAntWorkbookUtil
[junitlauncher] Tests run: 23, Failures: 0, Aborted: 0, Skipped: 0, Time elapsed: 2.574000 sec
[junitlauncher] Running org.apache.poi.ss.excelant.util.TestExcelAntWorkbookUtilFactory
[junitlauncher] 
[junitlauncher] Running org.apache.poi.ss.excelant.util.TestExcelAntWorkbookUtilFactory
[junitlauncher] Tests run: 2, Failures: 0, Aborted: 0, Skipped: 0, Time elapsed: 0.005000 sec

-test-excelant-write-testfile:

test:

compile-integration:
    [javac] Compiling 30 source files to <https://ci-builds.apache.org/job/POI/job/POI-DSL-IBM-JDK/ws/poi-integration/build/test-classes>
    [javac] Ignoring source, target and bootclasspath as release has been set
    [javac] Note: Annotation processing is enabled because one or more processors were found
    [javac]   on the class path. A future release of javac may disable annotation processing
    [javac]   unless at least one processor is specified by name (-processor), or a search
    [javac]   path is specified (--processor-path, --processor-module-path), or annotation
    [javac]   processing is enabled explicitly (-proc:only, -proc:full).
    [javac]   Use -Xlint:-options to suppress this message.
    [javac]   Use -proc:none to disable annotation processing.
    [javac] Note: <https://ci-builds.apache.org/job/POI/job/POI-DSL-IBM-JDK/ws/poi-integration/src/test/java/org/apache/poi/stress/OptimizedNullPrintStream.java> uses or overrides a deprecated API.
    [javac] Note: Recompile with -Xlint:deprecation for details.
    [mkdir] Created dir: <https://ci-builds.apache.org/job/POI/job/POI-DSL-IBM-JDK/ws/poi-integration/build/test-classes/META-INF/versions/9>
    [javac] Compiling 1 source file to <https://ci-builds.apache.org/job/POI/job/POI-DSL-IBM-JDK/ws/poi-integration/build/test-classes/META-INF/versions/9>
      [jar] Building jar: <https://ci-builds.apache.org/job/POI/job/POI-DSL-IBM-JDK/308/artifact/build/dist/maven/poi-integration/poi-integration-6.0.0-SNAPSHOT.jar>

-test-integration-check:

test-integration:
[junitlauncher] Mar 29, 2026 7:46:07 AM sun.util.locale.provider.LocaleProviderAdapter <clinit>
[junitlauncher] WARNING: COMPAT locale provider will be removed in a future release
[junitlauncher] Running org.apache.poi.stress.TestAllFiles
[junitlauncher] 
[junitlauncher] Running org.apache.poi.stress.TestAllFiles
[junitlauncher]    Failed: handleExtracting(String, FileHandlerKnown, String, Class, String): java.lang.NoClassDefFoundError: org.apache.commons.csv.CSVFormat
[junitlauncher]    Failed: handleAdditional(String, FileHandlerKnown, String, Class, String): java.lang.NoClassDefFoundError: org.apache.commons.csv.CSVFormat
[junitlauncher]    Failed: handleFile(String, FileHandlerKnown, String, Class, String): java.lang.NoClassDefFoundError: org.apache.commons.csv.CSVFormat
[junitlauncher] Tests run: 3, Failures: 3, Aborted: 0, Skipped: 0, Time elapsed: 0.224000 sec

BUILD FAILED
<https://ci-builds.apache.org/job/POI/job/POI-DSL-IBM-JDK/ws/build.xml>:1850: The following error occurred while executing this line:
<https://ci-builds.apache.org/job/POI/job/POI-DSL-IBM-JDK/ws/build.xml>:1394: Some test(s) have failure(s)

Total time: 17 minutes 27 seconds
Build step 'Invoke Ant' marked build as failure
[SpotBugs] Skipping execution of recorder since overall result is 'FAILURE'
ERROR: Not all environment variables could be successfully injected. Check for similarly-named environment variables.
Archiving artifacts
ERROR: Not all environment variables could be successfully injected. Check for similarly-named environment variables.
Recording test results
ERROR: Not all environment variables could be successfully injected. Check for similarly-named environment variables.
[Checks API] No suitable checks publisher found.
ERROR: Not all environment variables could be successfully injected. Check for similarly-named environment variables.

---------------------------------------------------------------------
To unsubscribe, e-mail: dev-unsubscribe@poi.apache.org
For additional commands, e-mail: dev-help@poi.apache.org


Build failed in Jenkins: POI » POI-DSL-IBM-JDK #307

Posted by Apache Jenkins Server <je...@builds.apache.org>.
See <https://ci-builds.apache.org/job/POI/job/POI-DSL-IBM-JDK/307/display/redirect?page=changes>

Changes:

[github] Bump org.mockito:mockito-core from 5.21.0 to 5.22.0 (#1019)

[github] Fix ArrayIndexOutOfBoundsException in XSSFTextParagraph when auto number

[github] Bump org.mockito:mockito-core from 5.22.0 to 5.23.0 (#1034)


------------------------------------------
[...truncated 303.19 KiB...]
[junitlauncher] Tests run: 2, Failures: 0, Aborted: 0, Skipped: 0, Time elapsed: 0.000000 sec
[junitlauncher] Running org.apache.poi.xssf.util.TestEvilUnclosedBRFixingInputStream
[junitlauncher] 
[junitlauncher] Running org.apache.poi.xssf.util.TestEvilUnclosedBRFixingInputStream
[junitlauncher] Tests run: 3, Failures: 0, Aborted: 0, Skipped: 0, Time elapsed: 0.016000 sec
[junitlauncher] Running org.apache.poi.xssf.util.TestNumericRanges
[junitlauncher] 
[junitlauncher] Running org.apache.poi.xssf.util.TestNumericRanges
[junitlauncher] Tests run: 2, Failures: 0, Aborted: 0, Skipped: 0, Time elapsed: 0.000000 sec
[junitlauncher] Running org.apache.poi.xwpf.TestAllExtendedProperties
[junitlauncher] 
[junitlauncher] Running org.apache.poi.xwpf.TestAllExtendedProperties
[junitlauncher] Tests run: 1, Failures: 0, Aborted: 0, Skipped: 0, Time elapsed: 0.018000 sec
[junitlauncher] Running org.apache.poi.xwpf.TestDocumentProtection
[junitlauncher] 
[junitlauncher] Running org.apache.poi.xwpf.TestDocumentProtection
[junitlauncher] Tests run: 10, Failures: 0, Aborted: 0, Skipped: 0, Time elapsed: 0.222000 sec
[junitlauncher] Running org.apache.poi.xwpf.TestNecessaryOOXMLClasses
[junitlauncher] 
[junitlauncher] Running org.apache.poi.xwpf.TestNecessaryOOXMLClasses
[junitlauncher] Tests run: 1, Failures: 0, Aborted: 0, Skipped: 0, Time elapsed: 0.005000 sec
[junitlauncher] Running org.apache.poi.xwpf.TestPackageCorePropertiesGetKeywords
[junitlauncher] 
[junitlauncher] Running org.apache.poi.xwpf.TestPackageCorePropertiesGetKeywords
[junitlauncher] Tests run: 1, Failures: 0, Aborted: 0, Skipped: 0, Time elapsed: 0.014000 sec
[junitlauncher] Running org.apache.poi.xwpf.TestXWPFBugs
[junitlauncher] 
[junitlauncher] Running org.apache.poi.xwpf.TestXWPFBugs
[junitlauncher] Tests run: 14, Failures: 0, Aborted: 0, Skipped: 0, Time elapsed: 1.651000 sec
[junitlauncher] Running org.apache.poi.xwpf.extractor.TestExternalEntities
[junitlauncher] 
[junitlauncher] Running org.apache.poi.xwpf.extractor.TestExternalEntities
[junitlauncher] Tests run: 1, Failures: 0, Aborted: 0, Skipped: 0, Time elapsed: 0.005000 sec
[junitlauncher] Running org.apache.poi.xwpf.extractor.TestXWPFWordExtractor
[junitlauncher] 
[junitlauncher] Running org.apache.poi.xwpf.extractor.TestXWPFWordExtractor
[junitlauncher] Tests run: 27, Failures: 0, Aborted: 0, Skipped: 0, Time elapsed: 0.394000 sec
[junitlauncher] Running org.apache.poi.xwpf.model.TestMultiSectionHeaders
[junitlauncher] 
[junitlauncher] Running org.apache.poi.xwpf.model.TestMultiSectionHeaders
[junitlauncher] Tests run: 2, Failures: 0, Aborted: 0, Skipped: 0, Time elapsed: 0.002000 sec
[junitlauncher] Running org.apache.poi.xwpf.model.TestXWPFDecorators
[junitlauncher] 
[junitlauncher] Running org.apache.poi.xwpf.model.TestXWPFDecorators
[junitlauncher] Tests run: 2, Failures: 0, Aborted: 0, Skipped: 0, Time elapsed: 0.039000 sec
[junitlauncher] Running org.apache.poi.xwpf.model.TestXWPFHeaderFooterPolicy
[junitlauncher] 
[junitlauncher] Running org.apache.poi.xwpf.model.TestXWPFHeaderFooterPolicy
[junitlauncher] Tests run: 3, Failures: 0, Aborted: 0, Skipped: 0, Time elapsed: 0.111000 sec
[junitlauncher] Running org.apache.poi.xwpf.usermodel.TestChangeTracking
[junitlauncher] 
[junitlauncher] Running org.apache.poi.xwpf.usermodel.TestChangeTracking
[junitlauncher] Tests run: 3, Failures: 0, Aborted: 0, Skipped: 0, Time elapsed: 0.013000 sec
[junitlauncher] Running org.apache.poi.xwpf.usermodel.TestColumn
[junitlauncher] 
[junitlauncher] Running org.apache.poi.xwpf.usermodel.TestColumn
[junitlauncher] Tests run: 4, Failures: 0, Aborted: 0, Skipped: 0, Time elapsed: 0.010000 sec
[junitlauncher] Running org.apache.poi.xwpf.usermodel.TestXWPFAbstractNum
[junitlauncher] 
[junitlauncher] Running org.apache.poi.xwpf.usermodel.TestXWPFAbstractNum
[junitlauncher] Tests run: 1, Failures: 0, Aborted: 0, Skipped: 0, Time elapsed: 0.000000 sec
[junitlauncher] Running org.apache.poi.xwpf.usermodel.TestXWPFBugs
[junitlauncher] 
[junitlauncher] Running org.apache.poi.xwpf.usermodel.TestXWPFBugs
[junitlauncher] Tests run: 15, Failures: 0, Aborted: 0, Skipped: 0, Time elapsed: 0.194000 sec
[junitlauncher] Running org.apache.poi.xwpf.usermodel.TestXWPFChart
[junitlauncher] 
[junitlauncher] Running org.apache.poi.xwpf.usermodel.TestXWPFChart
[junitlauncher] Tests run: 4, Failures: 0, Aborted: 0, Skipped: 0, Time elapsed: 0.025000 sec
[junitlauncher] Running org.apache.poi.xwpf.usermodel.TestXWPFComment
[junitlauncher] 
[junitlauncher] Running org.apache.poi.xwpf.usermodel.TestXWPFComment
[junitlauncher] Tests run: 6, Failures: 0, Aborted: 0, Skipped: 0, Time elapsed: 0.153000 sec
[junitlauncher] Running org.apache.poi.xwpf.usermodel.TestXWPFComments
[junitlauncher] 
[junitlauncher] Running org.apache.poi.xwpf.usermodel.TestXWPFComments
[junitlauncher] Tests run: 2, Failures: 0, Aborted: 0, Skipped: 0, Time elapsed: 0.010000 sec
[junitlauncher] Running org.apache.poi.xwpf.usermodel.TestXWPFDocument
[junitlauncher] 
[junitlauncher] Running org.apache.poi.xwpf.usermodel.TestXWPFDocument
[junitlauncher] Tests run: 28, Failures: 0, Aborted: 0, Skipped: 1, Time elapsed: 0.222000 sec
[junitlauncher] Running org.apache.poi.xwpf.usermodel.TestXWPFEndnote
[junitlauncher] 
[junitlauncher] Running org.apache.poi.xwpf.usermodel.TestXWPFEndnote
[junitlauncher] Tests run: 4, Failures: 0, Aborted: 0, Skipped: 0, Time elapsed: 0.013000 sec
[junitlauncher] Running org.apache.poi.xwpf.usermodel.TestXWPFEndnotes
[junitlauncher] 
[junitlauncher] Running org.apache.poi.xwpf.usermodel.TestXWPFEndnotes
[junitlauncher] Tests run: 2, Failures: 0, Aborted: 0, Skipped: 0, Time elapsed: 0.004000 sec
[junitlauncher] Running org.apache.poi.xwpf.usermodel.TestXWPFFootnote
[junitlauncher] 
[junitlauncher] Running org.apache.poi.xwpf.usermodel.TestXWPFFootnote
[junitlauncher] Tests run: 4, Failures: 0, Aborted: 0, Skipped: 0, Time elapsed: 0.012000 sec
[junitlauncher] Running org.apache.poi.xwpf.usermodel.TestXWPFFootnotes
[junitlauncher] 
[junitlauncher] Running org.apache.poi.xwpf.usermodel.TestXWPFFootnotes
[junitlauncher] Tests run: 3, Failures: 0, Aborted: 0, Skipped: 0, Time elapsed: 0.012000 sec
[junitlauncher] Running org.apache.poi.xwpf.usermodel.TestXWPFHeader
[junitlauncher] 
[junitlauncher] Running org.apache.poi.xwpf.usermodel.TestXWPFHeader
[junitlauncher] Tests run: 6, Failures: 0, Aborted: 0, Skipped: 0, Time elapsed: 0.056000 sec
[junitlauncher] Running org.apache.poi.xwpf.usermodel.TestXWPFHeadings
[junitlauncher] 
[junitlauncher] Running org.apache.poi.xwpf.usermodel.TestXWPFHeadings
[junitlauncher] Tests run: 1, Failures: 0, Aborted: 0, Skipped: 0, Time elapsed: 0.018000 sec
[junitlauncher] Running org.apache.poi.xwpf.usermodel.TestXWPFNumbering
[junitlauncher] 
[junitlauncher] Running org.apache.poi.xwpf.usermodel.TestXWPFNumbering
[junitlauncher] Tests run: 10, Failures: 0, Aborted: 0, Skipped: 0, Time elapsed: 0.060000 sec
[junitlauncher] Running org.apache.poi.xwpf.usermodel.TestXWPFParagraph
[junitlauncher] 
[junitlauncher] Running org.apache.poi.xwpf.usermodel.TestXWPFParagraph
[junitlauncher] Tests run: 32, Failures: 0, Aborted: 0, Skipped: 0, Time elapsed: 0.104000 sec
[junitlauncher] Running org.apache.poi.xwpf.usermodel.TestXWPFPictureData
[junitlauncher] 
[junitlauncher] Running org.apache.poi.xwpf.usermodel.TestXWPFPictureData
[junitlauncher] Tests run: 6, Failures: 0, Aborted: 0, Skipped: 0, Time elapsed: 0.079000 sec
[junitlauncher] Running org.apache.poi.xwpf.usermodel.TestXWPFRun
[junitlauncher] 
[junitlauncher] Running org.apache.poi.xwpf.usermodel.TestXWPFRun
[junitlauncher] Tests run: 42, Failures: 0, Aborted: 0, Skipped: 0, Time elapsed: 0.117000 sec
[junitlauncher] Running org.apache.poi.xwpf.usermodel.TestXWPFSDT
[junitlauncher] 
[junitlauncher] Running org.apache.poi.xwpf.usermodel.TestXWPFSDT
[junitlauncher] Tests run: 8, Failures: 0, Aborted: 0, Skipped: 0, Time elapsed: 0.061000 sec
[junitlauncher] Running org.apache.poi.xwpf.usermodel.TestXWPFSmartTag
[junitlauncher] 
[junitlauncher] Running org.apache.poi.xwpf.usermodel.TestXWPFSmartTag
[junitlauncher] Tests run: 1, Failures: 0, Aborted: 0, Skipped: 0, Time elapsed: 0.004000 sec
[junitlauncher] Running org.apache.poi.xwpf.usermodel.TestXWPFStyles
[junitlauncher] 
[junitlauncher] Running org.apache.poi.xwpf.usermodel.TestXWPFStyles
[junitlauncher] Tests run: 11, Failures: 0, Aborted: 0, Skipped: 0, Time elapsed: 0.057000 sec
[junitlauncher] Running org.apache.poi.xwpf.usermodel.TestXWPFTable
[junitlauncher] 
[junitlauncher] Running org.apache.poi.xwpf.usermodel.TestXWPFTable
[junitlauncher] Tests run: 20, Failures: 0, Aborted: 0, Skipped: 0, Time elapsed: 0.058000 sec
[junitlauncher] Running org.apache.poi.xwpf.usermodel.TestXWPFTableCell
[junitlauncher] 
[junitlauncher] Running org.apache.poi.xwpf.usermodel.TestXWPFTableCell
[junitlauncher] Tests run: 13, Failures: 0, Aborted: 0, Skipped: 0, Time elapsed: 0.029000 sec
[junitlauncher] Running org.apache.poi.xwpf.usermodel.TestXWPFTableRow
[junitlauncher] 
[junitlauncher] Running org.apache.poi.xwpf.usermodel.TestXWPFTableRow
[junitlauncher] Tests run: 9, Failures: 0, Aborted: 0, Skipped: 0, Time elapsed: 0.018000 sec
[junitlauncher] Running org.apache.poi.xwpf.usermodel.TestXWPFTheme
[junitlauncher] 
[junitlauncher] Running org.apache.poi.xwpf.usermodel.TestXWPFTheme
[junitlauncher] Tests run: 1, Failures: 0, Aborted: 0, Skipped: 0, Time elapsed: 0.010000 sec

-test-ooxml-write-testfile:

compile-ooxml-lite:
     [echo] Create ooxml-lite schemas
    [javac] Compiling 1 source file to <https://ci-builds.apache.org/job/POI/job/POI-DSL-IBM-JDK/ws/poi-ooxml-lite/src/main/java9>
     [copy] Copying 1 file to <https://ci-builds.apache.org/job/POI/job/POI-DSL-IBM-JDK/ws/src/resources>
     [copy] Copying 1 file to <https://ci-builds.apache.org/job/POI/job/POI-DSL-IBM-JDK/ws/src/resources>
     [copy] Copying 1 file to <https://ci-builds.apache.org/job/POI/job/POI-DSL-IBM-JDK/ws/src/resources>
    [mkdir] Created dir: <https://ci-builds.apache.org/job/POI/job/POI-DSL-IBM-JDK/ws/build/dist/maven/poi-ooxml-lite>
      [jar] Building jar: <https://ci-builds.apache.org/job/POI/job/POI-DSL-IBM-JDK/307/artifact/build/dist/maven/poi-ooxml-lite/poi-ooxml-lite-6.0.0-SNAPSHOT.jar>
   [delete] Deleting: <https://ci-builds.apache.org/job/POI/job/POI-DSL-IBM-JDK/ws/src/resources/ooxml-lite-report.clazz1>
   [delete] Deleting: <https://ci-builds.apache.org/job/POI/job/POI-DSL-IBM-JDK/ws/src/resources/ooxml-lite-report.clazz2>
   [delete] Deleting: <https://ci-builds.apache.org/job/POI/job/POI-DSL-IBM-JDK/ws/src/resources/ooxml-lite-report.xsb2>

-test-excelant-check:

test-excelant:
[junitlauncher] Mar 22, 2026 7:36:04 AM sun.util.locale.provider.LocaleProviderAdapter <clinit>
[junitlauncher] WARNING: COMPAT locale provider will be removed in a future release
[junitlauncher] Running org.apache.poi.ss.excelant.TestBuildFile
[junitlauncher] 
[junitlauncher] Running org.apache.poi.ss.excelant.TestBuildFile
[junitlauncher] Tests run: 14, Failures: 0, Aborted: 0, Skipped: 0, Time elapsed: 2.455000 sec
[junitlauncher] Running org.apache.poi.ss.excelant.TestExcelAntPrecision
[junitlauncher] 
[junitlauncher] Running org.apache.poi.ss.excelant.TestExcelAntPrecision
[junitlauncher] Tests run: 1, Failures: 0, Aborted: 0, Skipped: 0, Time elapsed: 0.002000 sec
[junitlauncher] Running org.apache.poi.ss.excelant.TestExcelAntSet
[junitlauncher] 
[junitlauncher] Running org.apache.poi.ss.excelant.TestExcelAntSet
[junitlauncher] Tests run: 2, Failures: 0, Aborted: 0, Skipped: 0, Time elapsed: 0.016000 sec
[junitlauncher] Running org.apache.poi.ss.excelant.TestExcelAntSetDoubleCell
[junitlauncher] 
[junitlauncher] Running org.apache.poi.ss.excelant.TestExcelAntSetDoubleCell
[junitlauncher] Tests run: 1, Failures: 0, Aborted: 0, Skipped: 0, Time elapsed: 0.002000 sec
[junitlauncher] Running org.apache.poi.ss.excelant.TestExcelAntUserDefinedFunction
[junitlauncher] 
[junitlauncher] Running org.apache.poi.ss.excelant.TestExcelAntUserDefinedFunction
[junitlauncher] Tests run: 2, Failures: 0, Aborted: 0, Skipped: 0, Time elapsed: 0.002000 sec
[junitlauncher] Running org.apache.poi.ss.excelant.util.TestExcelAntEvaluationResult
[junitlauncher] 
[junitlauncher] Running org.apache.poi.ss.excelant.util.TestExcelAntEvaluationResult
[junitlauncher] Tests run: 4, Failures: 0, Aborted: 0, Skipped: 0, Time elapsed: 0.004000 sec
[junitlauncher] Running org.apache.poi.ss.excelant.util.TestExcelAntWorkbookUtil
[junitlauncher] 
[junitlauncher] Running org.apache.poi.ss.excelant.util.TestExcelAntWorkbookUtil
[junitlauncher] Tests run: 23, Failures: 0, Aborted: 0, Skipped: 0, Time elapsed: 0.917000 sec
[junitlauncher] Running org.apache.poi.ss.excelant.util.TestExcelAntWorkbookUtilFactory
[junitlauncher] 
[junitlauncher] Running org.apache.poi.ss.excelant.util.TestExcelAntWorkbookUtilFactory
[junitlauncher] Tests run: 2, Failures: 0, Aborted: 0, Skipped: 0, Time elapsed: 0.002000 sec

-test-excelant-write-testfile:

test:

compile-integration:
    [javac] Compiling 30 source files to <https://ci-builds.apache.org/job/POI/job/POI-DSL-IBM-JDK/ws/poi-integration/build/test-classes>
    [javac] Ignoring source, target and bootclasspath as release has been set
    [javac] Note: Annotation processing is enabled because one or more processors were found
    [javac]   on the class path. A future release of javac may disable annotation processing
    [javac]   unless at least one processor is specified by name (-processor), or a search
    [javac]   path is specified (--processor-path, --processor-module-path), or annotation
    [javac]   processing is enabled explicitly (-proc:only, -proc:full).
    [javac]   Use -Xlint:-options to suppress this message.
    [javac]   Use -proc:none to disable annotation processing.
    [javac] Note: <https://ci-builds.apache.org/job/POI/job/POI-DSL-IBM-JDK/ws/poi-integration/src/test/java/org/apache/poi/stress/OptimizedNullPrintStream.java> uses or overrides a deprecated API.
    [javac] Note: Recompile with -Xlint:deprecation for details.
    [mkdir] Created dir: <https://ci-builds.apache.org/job/POI/job/POI-DSL-IBM-JDK/ws/poi-integration/build/test-classes/META-INF/versions/9>
    [javac] Compiling 1 source file to <https://ci-builds.apache.org/job/POI/job/POI-DSL-IBM-JDK/ws/poi-integration/build/test-classes/META-INF/versions/9>
      [jar] Building jar: <https://ci-builds.apache.org/job/POI/job/POI-DSL-IBM-JDK/307/artifact/build/dist/maven/poi-integration/poi-integration-6.0.0-SNAPSHOT.jar>

-test-integration-check:

test-integration:
[junitlauncher] Mar 22, 2026 7:36:14 AM sun.util.locale.provider.LocaleProviderAdapter <clinit>
[junitlauncher] WARNING: COMPAT locale provider will be removed in a future release
[junitlauncher] Running org.apache.poi.stress.TestAllFiles
[junitlauncher] 
[junitlauncher] Running org.apache.poi.stress.TestAllFiles
[junitlauncher]    Failed: handleAdditional(String, FileHandlerKnown, String, Class, String): java.lang.NoClassDefFoundError: org.apache.commons.csv.CSVFormat
[junitlauncher]    Failed: handleFile(String, FileHandlerKnown, String, Class, String): java.lang.NoClassDefFoundError: org.apache.commons.csv.CSVFormat
[junitlauncher]    Failed: handleExtracting(String, FileHandlerKnown, String, Class, String): java.lang.NoClassDefFoundError: org.apache.commons.csv.CSVFormat
[junitlauncher] Tests run: 3, Failures: 3, Aborted: 0, Skipped: 0, Time elapsed: 0.095000 sec

BUILD FAILED
<https://ci-builds.apache.org/job/POI/job/POI-DSL-IBM-JDK/ws/build.xml>:1850: The following error occurred while executing this line:
<https://ci-builds.apache.org/job/POI/job/POI-DSL-IBM-JDK/ws/build.xml>:1394: Some test(s) have failure(s)

Total time: 7 minutes 54 seconds
Build step 'Invoke Ant' marked build as failure
[SpotBugs] Skipping execution of recorder since overall result is 'FAILURE'
ERROR: Not all environment variables could be successfully injected. Check for similarly-named environment variables.
Archiving artifacts
ERROR: Not all environment variables could be successfully injected. Check for similarly-named environment variables.
Recording test results
ERROR: Not all environment variables could be successfully injected. Check for similarly-named environment variables.
[Checks API] No suitable checks publisher found.
ERROR: Not all environment variables could be successfully injected. Check for similarly-named environment variables.

---------------------------------------------------------------------
To unsubscribe, e-mail: dev-unsubscribe@poi.apache.org
For additional commands, e-mail: dev-help@poi.apache.org


Build failed in Jenkins: POI » POI-DSL-IBM-JDK #306

Posted by Apache Jenkins Server <je...@builds.apache.org>.
See <https://ci-builds.apache.org/job/POI/job/POI-DSL-IBM-JDK/306/display/redirect?page=changes>

Changes:

[PJ Fanning] work around poi-scratchpad issue

[PJ Fanning] Update StressMap.java

[github] [fuzz] Integrate CIFuzz GitHub Action for continuous security testing

[github] Bump github/codeql-action from 2 to 4 (#1030)

[github] Bump actions/upload-artifact from 4 to 7 (#1029)


------------------------------------------
[...truncated 303.17 KiB...]
[junitlauncher] Tests run: 2, Failures: 0, Aborted: 0, Skipped: 0, Time elapsed: 0.000000 sec
[junitlauncher] Running org.apache.poi.xssf.util.TestEvilUnclosedBRFixingInputStream
[junitlauncher] 
[junitlauncher] Running org.apache.poi.xssf.util.TestEvilUnclosedBRFixingInputStream
[junitlauncher] Tests run: 3, Failures: 0, Aborted: 0, Skipped: 0, Time elapsed: 0.021000 sec
[junitlauncher] Running org.apache.poi.xssf.util.TestNumericRanges
[junitlauncher] 
[junitlauncher] Running org.apache.poi.xssf.util.TestNumericRanges
[junitlauncher] Tests run: 2, Failures: 0, Aborted: 0, Skipped: 0, Time elapsed: 0.000000 sec
[junitlauncher] Running org.apache.poi.xwpf.TestAllExtendedProperties
[junitlauncher] 
[junitlauncher] Running org.apache.poi.xwpf.TestAllExtendedProperties
[junitlauncher] Tests run: 1, Failures: 0, Aborted: 0, Skipped: 0, Time elapsed: 0.021000 sec
[junitlauncher] Running org.apache.poi.xwpf.TestDocumentProtection
[junitlauncher] 
[junitlauncher] Running org.apache.poi.xwpf.TestDocumentProtection
[junitlauncher] Tests run: 10, Failures: 0, Aborted: 0, Skipped: 0, Time elapsed: 0.260000 sec
[junitlauncher] Running org.apache.poi.xwpf.TestNecessaryOOXMLClasses
[junitlauncher] 
[junitlauncher] Running org.apache.poi.xwpf.TestNecessaryOOXMLClasses
[junitlauncher] Tests run: 1, Failures: 0, Aborted: 0, Skipped: 0, Time elapsed: 0.008000 sec
[junitlauncher] Running org.apache.poi.xwpf.TestPackageCorePropertiesGetKeywords
[junitlauncher] 
[junitlauncher] Running org.apache.poi.xwpf.TestPackageCorePropertiesGetKeywords
[junitlauncher] Tests run: 1, Failures: 0, Aborted: 0, Skipped: 0, Time elapsed: 0.013000 sec
[junitlauncher] Running org.apache.poi.xwpf.TestXWPFBugs
[junitlauncher] 
[junitlauncher] Running org.apache.poi.xwpf.TestXWPFBugs
[junitlauncher] Tests run: 14, Failures: 0, Aborted: 0, Skipped: 0, Time elapsed: 1.663000 sec
[junitlauncher] Running org.apache.poi.xwpf.extractor.TestExternalEntities
[junitlauncher] 
[junitlauncher] Running org.apache.poi.xwpf.extractor.TestExternalEntities
[junitlauncher] Tests run: 1, Failures: 0, Aborted: 0, Skipped: 0, Time elapsed: 0.006000 sec
[junitlauncher] Running org.apache.poi.xwpf.extractor.TestXWPFWordExtractor
[junitlauncher] 
[junitlauncher] Running org.apache.poi.xwpf.extractor.TestXWPFWordExtractor
[junitlauncher] Tests run: 27, Failures: 0, Aborted: 0, Skipped: 0, Time elapsed: 0.278000 sec
[junitlauncher] Running org.apache.poi.xwpf.model.TestMultiSectionHeaders
[junitlauncher] 
[junitlauncher] Running org.apache.poi.xwpf.model.TestMultiSectionHeaders
[junitlauncher] Tests run: 2, Failures: 0, Aborted: 0, Skipped: 0, Time elapsed: 0.002000 sec
[junitlauncher] Running org.apache.poi.xwpf.model.TestXWPFDecorators
[junitlauncher] 
[junitlauncher] Running org.apache.poi.xwpf.model.TestXWPFDecorators
[junitlauncher] Tests run: 2, Failures: 0, Aborted: 0, Skipped: 0, Time elapsed: 0.033000 sec
[junitlauncher] Running org.apache.poi.xwpf.model.TestXWPFHeaderFooterPolicy
[junitlauncher] 
[junitlauncher] Running org.apache.poi.xwpf.model.TestXWPFHeaderFooterPolicy
[junitlauncher] Tests run: 3, Failures: 0, Aborted: 0, Skipped: 0, Time elapsed: 0.114000 sec
[junitlauncher] Running org.apache.poi.xwpf.usermodel.TestChangeTracking
[junitlauncher] 
[junitlauncher] Running org.apache.poi.xwpf.usermodel.TestChangeTracking
[junitlauncher] Tests run: 3, Failures: 0, Aborted: 0, Skipped: 0, Time elapsed: 0.021000 sec
[junitlauncher] Running org.apache.poi.xwpf.usermodel.TestColumn
[junitlauncher] 
[junitlauncher] Running org.apache.poi.xwpf.usermodel.TestColumn
[junitlauncher] Tests run: 4, Failures: 0, Aborted: 0, Skipped: 0, Time elapsed: 0.013000 sec
[junitlauncher] Running org.apache.poi.xwpf.usermodel.TestXWPFAbstractNum
[junitlauncher] 
[junitlauncher] Running org.apache.poi.xwpf.usermodel.TestXWPFAbstractNum
[junitlauncher] Tests run: 1, Failures: 0, Aborted: 0, Skipped: 0, Time elapsed: 0.000000 sec
[junitlauncher] Running org.apache.poi.xwpf.usermodel.TestXWPFBugs
[junitlauncher] 
[junitlauncher] Running org.apache.poi.xwpf.usermodel.TestXWPFBugs
[junitlauncher] Tests run: 15, Failures: 0, Aborted: 0, Skipped: 0, Time elapsed: 0.169000 sec
[junitlauncher] Running org.apache.poi.xwpf.usermodel.TestXWPFChart
[junitlauncher] 
[junitlauncher] Running org.apache.poi.xwpf.usermodel.TestXWPFChart
[junitlauncher] Tests run: 4, Failures: 0, Aborted: 0, Skipped: 0, Time elapsed: 0.031000 sec
[junitlauncher] Running org.apache.poi.xwpf.usermodel.TestXWPFComment
[junitlauncher] 
[junitlauncher] Running org.apache.poi.xwpf.usermodel.TestXWPFComment
[junitlauncher] Tests run: 6, Failures: 0, Aborted: 0, Skipped: 0, Time elapsed: 0.312000 sec
[junitlauncher] Running org.apache.poi.xwpf.usermodel.TestXWPFComments
[junitlauncher] 
[junitlauncher] Running org.apache.poi.xwpf.usermodel.TestXWPFComments
[junitlauncher] Tests run: 2, Failures: 0, Aborted: 0, Skipped: 0, Time elapsed: 0.013000 sec
[junitlauncher] Running org.apache.poi.xwpf.usermodel.TestXWPFDocument
[junitlauncher] 
[junitlauncher] Running org.apache.poi.xwpf.usermodel.TestXWPFDocument
[junitlauncher] Tests run: 28, Failures: 0, Aborted: 0, Skipped: 1, Time elapsed: 0.204000 sec
[junitlauncher] Running org.apache.poi.xwpf.usermodel.TestXWPFEndnote
[junitlauncher] 
[junitlauncher] Running org.apache.poi.xwpf.usermodel.TestXWPFEndnote
[junitlauncher] Tests run: 4, Failures: 0, Aborted: 0, Skipped: 0, Time elapsed: 0.013000 sec
[junitlauncher] Running org.apache.poi.xwpf.usermodel.TestXWPFEndnotes
[junitlauncher] 
[junitlauncher] Running org.apache.poi.xwpf.usermodel.TestXWPFEndnotes
[junitlauncher] Tests run: 2, Failures: 0, Aborted: 0, Skipped: 0, Time elapsed: 0.004000 sec
[junitlauncher] Running org.apache.poi.xwpf.usermodel.TestXWPFFootnote
[junitlauncher] 
[junitlauncher] Running org.apache.poi.xwpf.usermodel.TestXWPFFootnote
[junitlauncher] Tests run: 4, Failures: 0, Aborted: 0, Skipped: 0, Time elapsed: 0.011000 sec
[junitlauncher] Running org.apache.poi.xwpf.usermodel.TestXWPFFootnotes
[junitlauncher] 
[junitlauncher] Running org.apache.poi.xwpf.usermodel.TestXWPFFootnotes
[junitlauncher] Tests run: 3, Failures: 0, Aborted: 0, Skipped: 0, Time elapsed: 0.016000 sec
[junitlauncher] Running org.apache.poi.xwpf.usermodel.TestXWPFHeader
[junitlauncher] 
[junitlauncher] Running org.apache.poi.xwpf.usermodel.TestXWPFHeader
[junitlauncher] Tests run: 6, Failures: 0, Aborted: 0, Skipped: 0, Time elapsed: 0.055000 sec
[junitlauncher] Running org.apache.poi.xwpf.usermodel.TestXWPFHeadings
[junitlauncher] 
[junitlauncher] Running org.apache.poi.xwpf.usermodel.TestXWPFHeadings
[junitlauncher] Tests run: 1, Failures: 0, Aborted: 0, Skipped: 0, Time elapsed: 0.019000 sec
[junitlauncher] Running org.apache.poi.xwpf.usermodel.TestXWPFNumbering
[junitlauncher] 
[junitlauncher] Running org.apache.poi.xwpf.usermodel.TestXWPFNumbering
[junitlauncher] Tests run: 10, Failures: 0, Aborted: 0, Skipped: 0, Time elapsed: 0.052000 sec
[junitlauncher] Running org.apache.poi.xwpf.usermodel.TestXWPFParagraph
[junitlauncher] 
[junitlauncher] Running org.apache.poi.xwpf.usermodel.TestXWPFParagraph
[junitlauncher] Tests run: 32, Failures: 0, Aborted: 0, Skipped: 0, Time elapsed: 0.094000 sec
[junitlauncher] Running org.apache.poi.xwpf.usermodel.TestXWPFPictureData
[junitlauncher] 
[junitlauncher] Running org.apache.poi.xwpf.usermodel.TestXWPFPictureData
[junitlauncher] Tests run: 6, Failures: 0, Aborted: 0, Skipped: 0, Time elapsed: 0.076000 sec
[junitlauncher] Running org.apache.poi.xwpf.usermodel.TestXWPFRun
[junitlauncher] 
[junitlauncher] Running org.apache.poi.xwpf.usermodel.TestXWPFRun
[junitlauncher] Tests run: 42, Failures: 0, Aborted: 0, Skipped: 0, Time elapsed: 0.115000 sec
[junitlauncher] Running org.apache.poi.xwpf.usermodel.TestXWPFSDT
[junitlauncher] 
[junitlauncher] Running org.apache.poi.xwpf.usermodel.TestXWPFSDT
[junitlauncher] Tests run: 8, Failures: 0, Aborted: 0, Skipped: 0, Time elapsed: 0.071000 sec
[junitlauncher] Running org.apache.poi.xwpf.usermodel.TestXWPFSmartTag
[junitlauncher] 
[junitlauncher] Running org.apache.poi.xwpf.usermodel.TestXWPFSmartTag
[junitlauncher] Tests run: 1, Failures: 0, Aborted: 0, Skipped: 0, Time elapsed: 0.005000 sec
[junitlauncher] Running org.apache.poi.xwpf.usermodel.TestXWPFStyles
[junitlauncher] 
[junitlauncher] Running org.apache.poi.xwpf.usermodel.TestXWPFStyles
[junitlauncher] Tests run: 11, Failures: 0, Aborted: 0, Skipped: 0, Time elapsed: 0.073000 sec
[junitlauncher] Running org.apache.poi.xwpf.usermodel.TestXWPFTable
[junitlauncher] 
[junitlauncher] Running org.apache.poi.xwpf.usermodel.TestXWPFTable
[junitlauncher] Tests run: 20, Failures: 0, Aborted: 0, Skipped: 0, Time elapsed: 0.057000 sec
[junitlauncher] Running org.apache.poi.xwpf.usermodel.TestXWPFTableCell
[junitlauncher] 
[junitlauncher] Running org.apache.poi.xwpf.usermodel.TestXWPFTableCell
[junitlauncher] Tests run: 13, Failures: 0, Aborted: 0, Skipped: 0, Time elapsed: 0.037000 sec
[junitlauncher] Running org.apache.poi.xwpf.usermodel.TestXWPFTableRow
[junitlauncher] 
[junitlauncher] Running org.apache.poi.xwpf.usermodel.TestXWPFTableRow
[junitlauncher] Tests run: 9, Failures: 0, Aborted: 0, Skipped: 0, Time elapsed: 0.021000 sec
[junitlauncher] Running org.apache.poi.xwpf.usermodel.TestXWPFTheme
[junitlauncher] 
[junitlauncher] Running org.apache.poi.xwpf.usermodel.TestXWPFTheme
[junitlauncher] Tests run: 1, Failures: 0, Aborted: 0, Skipped: 0, Time elapsed: 0.009000 sec

-test-ooxml-write-testfile:

compile-ooxml-lite:
     [echo] Create ooxml-lite schemas
    [javac] Compiling 1 source file to <https://ci-builds.apache.org/job/POI/job/POI-DSL-IBM-JDK/ws/poi-ooxml-lite/src/main/java9>
     [copy] Copying 1 file to <https://ci-builds.apache.org/job/POI/job/POI-DSL-IBM-JDK/ws/src/resources>
     [copy] Copying 1 file to <https://ci-builds.apache.org/job/POI/job/POI-DSL-IBM-JDK/ws/src/resources>
     [copy] Copying 1 file to <https://ci-builds.apache.org/job/POI/job/POI-DSL-IBM-JDK/ws/src/resources>
    [mkdir] Created dir: <https://ci-builds.apache.org/job/POI/job/POI-DSL-IBM-JDK/ws/build/dist/maven/poi-ooxml-lite>
      [jar] Building jar: <https://ci-builds.apache.org/job/POI/job/POI-DSL-IBM-JDK/306/artifact/build/dist/maven/poi-ooxml-lite/poi-ooxml-lite-6.0.0-SNAPSHOT.jar>
   [delete] Deleting: <https://ci-builds.apache.org/job/POI/job/POI-DSL-IBM-JDK/ws/src/resources/ooxml-lite-report.clazz1>
   [delete] Deleting: <https://ci-builds.apache.org/job/POI/job/POI-DSL-IBM-JDK/ws/src/resources/ooxml-lite-report.clazz2>
   [delete] Deleting: <https://ci-builds.apache.org/job/POI/job/POI-DSL-IBM-JDK/ws/src/resources/ooxml-lite-report.xsb2>

-test-excelant-check:

test-excelant:
[junitlauncher] Mar 15, 2026 7:35:15 AM sun.util.locale.provider.LocaleProviderAdapter <clinit>
[junitlauncher] WARNING: COMPAT locale provider will be removed in a future release
[junitlauncher] Running org.apache.poi.ss.excelant.TestBuildFile
[junitlauncher] 
[junitlauncher] Running org.apache.poi.ss.excelant.TestBuildFile
[junitlauncher] Tests run: 14, Failures: 0, Aborted: 0, Skipped: 0, Time elapsed: 2.467000 sec
[junitlauncher] Running org.apache.poi.ss.excelant.TestExcelAntPrecision
[junitlauncher] 
[junitlauncher] Running org.apache.poi.ss.excelant.TestExcelAntPrecision
[junitlauncher] Tests run: 1, Failures: 0, Aborted: 0, Skipped: 0, Time elapsed: 0.002000 sec
[junitlauncher] Running org.apache.poi.ss.excelant.TestExcelAntSet
[junitlauncher] 
[junitlauncher] Running org.apache.poi.ss.excelant.TestExcelAntSet
[junitlauncher] Tests run: 2, Failures: 0, Aborted: 0, Skipped: 0, Time elapsed: 0.021000 sec
[junitlauncher] Running org.apache.poi.ss.excelant.TestExcelAntSetDoubleCell
[junitlauncher] 
[junitlauncher] Running org.apache.poi.ss.excelant.TestExcelAntSetDoubleCell
[junitlauncher] Tests run: 1, Failures: 0, Aborted: 0, Skipped: 0, Time elapsed: 0.002000 sec
[junitlauncher] Running org.apache.poi.ss.excelant.TestExcelAntUserDefinedFunction
[junitlauncher] 
[junitlauncher] Running org.apache.poi.ss.excelant.TestExcelAntUserDefinedFunction
[junitlauncher] Tests run: 2, Failures: 0, Aborted: 0, Skipped: 0, Time elapsed: 0.003000 sec
[junitlauncher] Running org.apache.poi.ss.excelant.util.TestExcelAntEvaluationResult
[junitlauncher] 
[junitlauncher] Running org.apache.poi.ss.excelant.util.TestExcelAntEvaluationResult
[junitlauncher] Tests run: 4, Failures: 0, Aborted: 0, Skipped: 0, Time elapsed: 0.005000 sec
[junitlauncher] Running org.apache.poi.ss.excelant.util.TestExcelAntWorkbookUtil
[junitlauncher] 
[junitlauncher] Running org.apache.poi.ss.excelant.util.TestExcelAntWorkbookUtil
[junitlauncher] Tests run: 23, Failures: 0, Aborted: 0, Skipped: 0, Time elapsed: 1.014000 sec
[junitlauncher] Running org.apache.poi.ss.excelant.util.TestExcelAntWorkbookUtilFactory
[junitlauncher] 
[junitlauncher] Running org.apache.poi.ss.excelant.util.TestExcelAntWorkbookUtilFactory
[junitlauncher] Tests run: 2, Failures: 0, Aborted: 0, Skipped: 0, Time elapsed: 0.002000 sec

-test-excelant-write-testfile:

test:

compile-integration:
    [javac] Compiling 30 source files to <https://ci-builds.apache.org/job/POI/job/POI-DSL-IBM-JDK/ws/poi-integration/build/test-classes>
    [javac] Ignoring source, target and bootclasspath as release has been set
    [javac] Note: Annotation processing is enabled because one or more processors were found
    [javac]   on the class path. A future release of javac may disable annotation processing
    [javac]   unless at least one processor is specified by name (-processor), or a search
    [javac]   path is specified (--processor-path, --processor-module-path), or annotation
    [javac]   processing is enabled explicitly (-proc:only, -proc:full).
    [javac]   Use -Xlint:-options to suppress this message.
    [javac]   Use -proc:none to disable annotation processing.
    [javac] Note: <https://ci-builds.apache.org/job/POI/job/POI-DSL-IBM-JDK/ws/poi-integration/src/test/java/org/apache/poi/stress/OptimizedNullPrintStream.java> uses or overrides a deprecated API.
    [javac] Note: Recompile with -Xlint:deprecation for details.
    [mkdir] Created dir: <https://ci-builds.apache.org/job/POI/job/POI-DSL-IBM-JDK/ws/poi-integration/build/test-classes/META-INF/versions/9>
    [javac] Compiling 1 source file to <https://ci-builds.apache.org/job/POI/job/POI-DSL-IBM-JDK/ws/poi-integration/build/test-classes/META-INF/versions/9>
      [jar] Building jar: <https://ci-builds.apache.org/job/POI/job/POI-DSL-IBM-JDK/306/artifact/build/dist/maven/poi-integration/poi-integration-6.0.0-SNAPSHOT.jar>

-test-integration-check:

test-integration:
[junitlauncher] Mar 15, 2026 7:35:26 AM sun.util.locale.provider.LocaleProviderAdapter <clinit>
[junitlauncher] WARNING: COMPAT locale provider will be removed in a future release
[junitlauncher] Running org.apache.poi.stress.TestAllFiles
[junitlauncher] 
[junitlauncher] Running org.apache.poi.stress.TestAllFiles
[junitlauncher]    Failed: handleExtracting(String, FileHandlerKnown, String, Class, String): java.lang.NoClassDefFoundError: org.apache.commons.csv.CSVFormat
[junitlauncher]    Failed: handleFile(String, FileHandlerKnown, String, Class, String): java.lang.NoClassDefFoundError: org.apache.commons.csv.CSVFormat
[junitlauncher]    Failed: handleAdditional(String, FileHandlerKnown, String, Class, String): java.lang.NoClassDefFoundError: org.apache.commons.csv.CSVFormat
[junitlauncher] Tests run: 3, Failures: 3, Aborted: 0, Skipped: 0, Time elapsed: 0.113000 sec

BUILD FAILED
<https://ci-builds.apache.org/job/POI/job/POI-DSL-IBM-JDK/ws/build.xml>:1850: The following error occurred while executing this line:
<https://ci-builds.apache.org/job/POI/job/POI-DSL-IBM-JDK/ws/build.xml>:1394: Some test(s) have failure(s)

Total time: 7 minutes 6 seconds
Build step 'Invoke Ant' marked build as failure
[SpotBugs] Skipping execution of recorder since overall result is 'FAILURE'
ERROR: Not all environment variables could be successfully injected. Check for similarly-named environment variables.
Archiving artifacts
ERROR: Not all environment variables could be successfully injected. Check for similarly-named environment variables.
Recording test results
ERROR: Not all environment variables could be successfully injected. Check for similarly-named environment variables.
[Checks API] No suitable checks publisher found.
ERROR: Not all environment variables could be successfully injected. Check for similarly-named environment variables.

---------------------------------------------------------------------
To unsubscribe, e-mail: dev-unsubscribe@poi.apache.org
For additional commands, e-mail: dev-help@poi.apache.org