You are viewing a plain text version of this content. The canonical link for it is here.
Posted to dev@lucene.apache.org by Apache Jenkins Server <je...@builds.apache.org> on 2019/08/03 15:11:37 UTC
[JENKINS] Lucene-Solr-Tests-8.x - Build # 344 - Still Unstable
Build: https://builds.apache.org/job/Lucene-Solr-Tests-8.x/344/
1 tests failed.
FAILED: org.apache.solr.handler.admin.StatsReloadRaceTest.testParallelReloadAndStats
Error Message:
Key SEARCHER.searcher.indexVersion not found in registry solr.core.collection1
Stack Trace:
java.lang.AssertionError: Key SEARCHER.searcher.indexVersion not found in registry solr.core.collection1
at __randomizedtesting.SeedInfo.seed([49C8C2382EBA0661:8656A701A14B6E3E]:0)
at org.junit.Assert.fail(Assert.java:88)
at org.junit.Assert.assertTrue(Assert.java:41)
at org.apache.solr.handler.admin.StatsReloadRaceTest.requestMetrics(StatsReloadRaceTest.java:143)
at org.apache.solr.handler.admin.StatsReloadRaceTest.testParallelReloadAndStats(StatsReloadRaceTest.java:77)
at sun.reflect.NativeMethodAccessorImpl.invoke0(Native Method)
at sun.reflect.NativeMethodAccessorImpl.invoke(NativeMethodAccessorImpl.java:62)
at sun.reflect.DelegatingMethodAccessorImpl.invoke(DelegatingMethodAccessorImpl.java:43)
at java.lang.reflect.Method.invoke(Method.java:498)
at com.carrotsearch.randomizedtesting.RandomizedRunner.invoke(RandomizedRunner.java:1750)
at com.carrotsearch.randomizedtesting.RandomizedRunner$8.evaluate(RandomizedRunner.java:938)
at com.carrotsearch.randomizedtesting.RandomizedRunner$9.evaluate(RandomizedRunner.java:974)
at com.carrotsearch.randomizedtesting.RandomizedRunner$10.evaluate(RandomizedRunner.java:988)
at com.carrotsearch.randomizedtesting.rules.SystemPropertiesRestoreRule$1.evaluate(SystemPropertiesRestoreRule.java:57)
at org.apache.lucene.util.TestRuleSetupTeardownChained$1.evaluate(TestRuleSetupTeardownChained.java:49)
at org.apache.lucene.util.AbstractBeforeAfterRule$1.evaluate(AbstractBeforeAfterRule.java:45)
at org.apache.lucene.util.TestRuleThreadAndTestName$1.evaluate(TestRuleThreadAndTestName.java:48)
at org.apache.lucene.util.TestRuleIgnoreAfterMaxFailures$1.evaluate(TestRuleIgnoreAfterMaxFailures.java:64)
at org.apache.lucene.util.TestRuleMarkFailure$1.evaluate(TestRuleMarkFailure.java:47)
at com.carrotsearch.randomizedtesting.rules.StatementAdapter.evaluate(StatementAdapter.java:36)
at com.carrotsearch.randomizedtesting.ThreadLeakControl$StatementRunner.run(ThreadLeakControl.java:368)
at com.carrotsearch.randomizedtesting.ThreadLeakControl.forkTimeoutingTask(ThreadLeakControl.java:817)
at com.carrotsearch.randomizedtesting.ThreadLeakControl$3.evaluate(ThreadLeakControl.java:468)
at com.carrotsearch.randomizedtesting.RandomizedRunner.runSingleTest(RandomizedRunner.java:947)
at com.carrotsearch.randomizedtesting.RandomizedRunner$5.evaluate(RandomizedRunner.java:832)
at com.carrotsearch.randomizedtesting.RandomizedRunner$6.evaluate(RandomizedRunner.java:883)
at com.carrotsearch.randomizedtesting.RandomizedRunner$7.evaluate(RandomizedRunner.java:894)
at com.carrotsearch.randomizedtesting.rules.StatementAdapter.evaluate(StatementAdapter.java:36)
at com.carrotsearch.randomizedtesting.rules.SystemPropertiesRestoreRule$1.evaluate(SystemPropertiesRestoreRule.java:57)
at org.apache.lucene.util.AbstractBeforeAfterRule$1.evaluate(AbstractBeforeAfterRule.java:45)
at com.carrotsearch.randomizedtesting.rules.StatementAdapter.evaluate(StatementAdapter.java:36)
at org.apache.lucene.util.TestRuleStoreClassName$1.evaluate(TestRuleStoreClassName.java:41)
at com.carrotsearch.randomizedtesting.rules.NoShadowingOrOverridesOnMethodsRule$1.evaluate(NoShadowingOrOverridesOnMethodsRule.java:40)
at com.carrotsearch.randomizedtesting.rules.NoShadowingOrOverridesOnMethodsRule$1.evaluate(NoShadowingOrOverridesOnMethodsRule.java:40)
at com.carrotsearch.randomizedtesting.rules.StatementAdapter.evaluate(StatementAdapter.java:36)
at com.carrotsearch.randomizedtesting.rules.StatementAdapter.evaluate(StatementAdapter.java:36)
at com.carrotsearch.randomizedtesting.rules.StatementAdapter.evaluate(StatementAdapter.java:36)
at org.apache.lucene.util.TestRuleAssertionsRequired$1.evaluate(TestRuleAssertionsRequired.java:53)
at org.apache.lucene.util.TestRuleMarkFailure$1.evaluate(TestRuleMarkFailure.java:47)
at org.apache.lucene.util.TestRuleIgnoreAfterMaxFailures$1.evaluate(TestRuleIgnoreAfterMaxFailures.java:64)
at org.apache.lucene.util.TestRuleIgnoreTestSuites$1.evaluate(TestRuleIgnoreTestSuites.java:54)
at com.carrotsearch.randomizedtesting.rules.StatementAdapter.evaluate(StatementAdapter.java:36)
at com.carrotsearch.randomizedtesting.ThreadLeakControl$StatementRunner.run(ThreadLeakControl.java:368)
at java.lang.Thread.run(Thread.java:748)
Build Log:
[...truncated 14013 lines...]
[junit4] Suite: org.apache.solr.handler.admin.StatsReloadRaceTest
[junit4] 2> 1319567 INFO (SUITE-StatsReloadRaceTest-seed#[49C8C2382EBA0661]-worker) [ ] o.a.s.SolrTestCaseJ4 Created dataDir: /home/jenkins/jenkins-slave/workspace/Lucene-Solr-Tests-8.x/solr/build/solr-core/test/J2/temp/solr.handler.admin.StatsReloadRaceTest_49C8C2382EBA0661-001/data-dir-88-001
[junit4] 2> 1319567 INFO (SUITE-StatsReloadRaceTest-seed#[49C8C2382EBA0661]-worker) [ ] o.a.s.SolrTestCaseJ4 Using PointFields (NUMERIC_POINTS_SYSPROP=true) w/NUMERIC_DOCVALUES_SYSPROP=true
[junit4] 2> 1319568 INFO (SUITE-StatsReloadRaceTest-seed#[49C8C2382EBA0661]-worker) [ ] o.a.s.SolrTestCaseJ4 Randomized ssl (false) and clientAuth (true) via: @org.apache.solr.util.RandomizeSSL(reason=, ssl=NaN, value=NaN, clientAuth=NaN)
[junit4] 2> 1319568 INFO (SUITE-StatsReloadRaceTest-seed#[49C8C2382EBA0661]-worker) [ ] o.a.s.SolrTestCaseJ4 SecureRandom sanity checks: test.solr.allowed.securerandom=null & java.security.egd=file:/dev/./urandom
[junit4] 2> 1319568 INFO (SUITE-StatsReloadRaceTest-seed#[49C8C2382EBA0661]-worker) [ ] o.a.s.SolrTestCaseJ4 ####initCore
[junit4] 2> 1319568 INFO (SUITE-StatsReloadRaceTest-seed#[49C8C2382EBA0661]-worker) [ ] o.a.s.c.SolrResourceLoader [null] Added 2 libs to classloader, from paths: [/home/jenkins/jenkins-slave/workspace/Lucene-Solr-Tests-8.x/solr/core/src/test-files/solr/collection1/lib, /home/jenkins/jenkins-slave/workspace/Lucene-Solr-Tests-8.x/solr/core/src/test-files/solr/collection1/lib/classes]
[junit4] 2> 1319656 INFO (SUITE-StatsReloadRaceTest-seed#[49C8C2382EBA0661]-worker) [ ] o.a.s.c.SolrConfig Using Lucene MatchVersion: 8.3.0
[junit4] 2> 1319688 INFO (SUITE-StatsReloadRaceTest-seed#[49C8C2382EBA0661]-worker) [ ] o.a.s.s.IndexSchema [null] Schema name=test
[junit4] 2> 1319843 INFO (SUITE-StatsReloadRaceTest-seed#[49C8C2382EBA0661]-worker) [ ] o.a.s.s.IndexSchema Loaded schema test/1.0 with uniqueid field id
[junit4] 2> 1320091 INFO (SUITE-StatsReloadRaceTest-seed#[49C8C2382EBA0661]-worker) [ ] o.a.s.h.c.HttpShardHandlerFactory Host whitelist initialized: WhitelistHostChecker [whitelistHosts=null, whitelistHostCheckingEnabled=true]
[junit4] 2> 1320106 WARN (SUITE-StatsReloadRaceTest-seed#[49C8C2382EBA0661]-worker) [ ] o.e.j.u.s.S.config Trusting all certificates configured for Client@6b938366[provider=null,keyStore=null,trustStore=null]
[junit4] 2> 1320106 WARN (SUITE-StatsReloadRaceTest-seed#[49C8C2382EBA0661]-worker) [ ] o.e.j.u.s.S.config No Client EndPointIdentificationAlgorithm configured for Client@6b938366[provider=null,keyStore=null,trustStore=null]
[junit4] 2> 1320109 WARN (SUITE-StatsReloadRaceTest-seed#[49C8C2382EBA0661]-worker) [ ] o.e.j.u.s.S.config Trusting all certificates configured for Client@488d4e21[provider=null,keyStore=null,trustStore=null]
[junit4] 2> 1320109 WARN (SUITE-StatsReloadRaceTest-seed#[49C8C2382EBA0661]-worker) [ ] o.e.j.u.s.S.config No Client EndPointIdentificationAlgorithm configured for Client@488d4e21[provider=null,keyStore=null,trustStore=null]
[junit4] 2> 1320133 INFO (SUITE-StatsReloadRaceTest-seed#[49C8C2382EBA0661]-worker) [ ] o.a.s.c.TransientSolrCoreCacheDefault Allocating transient cache for 2147483647 transient cores
[junit4] 2> 1320133 INFO (SUITE-StatsReloadRaceTest-seed#[49C8C2382EBA0661]-worker) [ ] o.a.s.h.a.MetricsHistoryHandler No .system collection, keeping metrics history in memory.
[junit4] 2> 1320145 INFO (SUITE-StatsReloadRaceTest-seed#[49C8C2382EBA0661]-worker) [ ] o.a.s.m.r.SolrJmxReporter JMX monitoring for 'solr.node' (registry 'solr.node') enabled at server: com.sun.jmx.mbeanserver.JmxMBeanServer@617ea053
[junit4] 2> 1320151 INFO (SUITE-StatsReloadRaceTest-seed#[49C8C2382EBA0661]-worker) [ ] o.a.s.m.r.SolrJmxReporter JMX monitoring for 'solr.jvm' (registry 'solr.jvm') enabled at server: com.sun.jmx.mbeanserver.JmxMBeanServer@617ea053
[junit4] 2> 1320151 INFO (SUITE-StatsReloadRaceTest-seed#[49C8C2382EBA0661]-worker) [ ] o.a.s.m.r.SolrJmxReporter JMX monitoring for 'solr.jetty' (registry 'solr.jetty') enabled at server: com.sun.jmx.mbeanserver.JmxMBeanServer@617ea053
[junit4] 2> 1320152 INFO (coreLoadExecutor-2909-thread-1) [ x:collection1 ] o.a.s.c.SolrResourceLoader [null] Added 2 libs to classloader, from paths: [/home/jenkins/jenkins-slave/workspace/Lucene-Solr-Tests-8.x/solr/core/src/test-files/solr/collection1/lib, /home/jenkins/jenkins-slave/workspace/Lucene-Solr-Tests-8.x/solr/core/src/test-files/solr/collection1/lib/classes]
[junit4] 2> 1320190 INFO (coreLoadExecutor-2909-thread-1) [ x:collection1 ] o.a.s.c.SolrConfig Using Lucene MatchVersion: 8.3.0
[junit4] 2> 1320213 INFO (coreLoadExecutor-2909-thread-1) [ x:collection1 ] o.a.s.s.IndexSchema [collection1] Schema name=test
[junit4] 2> 1320360 INFO (coreLoadExecutor-2909-thread-1) [ x:collection1 ] o.a.s.s.IndexSchema Loaded schema test/1.0 with uniqueid field id
[junit4] 2> 1320378 INFO (coreLoadExecutor-2909-thread-1) [ x:collection1 ] o.a.s.c.CoreContainer Creating SolrCore 'collection1' using configuration from instancedir /home/jenkins/jenkins-slave/workspace/Lucene-Solr-Tests-8.x/solr/core/src/test-files/solr/collection1, trusted=true
[junit4] 2> 1320379 INFO (coreLoadExecutor-2909-thread-1) [ x:collection1 ] o.a.s.m.r.SolrJmxReporter JMX monitoring for 'solr.core.collection1' (registry 'solr.core.collection1') enabled at server: com.sun.jmx.mbeanserver.JmxMBeanServer@617ea053
[junit4] 2> 1320379 INFO (coreLoadExecutor-2909-thread-1) [ x:collection1 ] o.a.s.c.SolrCore [[collection1] ] Opening new SolrCore at [/home/jenkins/jenkins-slave/workspace/Lucene-Solr-Tests-8.x/solr/core/src/test-files/solr/collection1], dataDir=[/home/jenkins/jenkins-slave/workspace/Lucene-Solr-Tests-8.x/solr/build/solr-core/test/J2/temp/solr.handler.admin.StatsReloadRaceTest_49C8C2382EBA0661-001/data-dir-88-001/]
[junit4] 2> 1320380 INFO (coreLoadExecutor-2909-thread-1) [ x:collection1 ] o.a.s.u.RandomMergePolicy RandomMergePolicy wrapping class org.apache.lucene.index.LogByteSizeMergePolicy: [LogByteSizeMergePolicy: minMergeSize=1677721, mergeFactor=50, maxMergeSize=2147483648, maxMergeSizeForForcedMerge=9223372036854775807, calibrateSizeByDeletes=false, maxMergeDocs=2147483647, maxCFSSegmentSizeMB=8.796093022207999E12, noCFSRatio=0.26129146631913347]
[junit4] 2> 1320449 INFO (coreLoadExecutor-2909-thread-1) [ x:collection1 ] o.a.s.u.UpdateHandler Using UpdateLog implementation: org.apache.solr.update.UpdateLog
[junit4] 2> 1320449 INFO (coreLoadExecutor-2909-thread-1) [ x:collection1 ] o.a.s.u.UpdateLog Initializing UpdateLog: dataDir= defaultSyncLevel=FLUSH numRecordsToKeep=100 maxNumLogsToKeep=10 numVersionBuckets=65536
[junit4] 2> 1320450 INFO (coreLoadExecutor-2909-thread-1) [ x:collection1 ] o.a.s.u.CommitTracker Hard AutoCommit: disabled
[junit4] 2> 1320450 INFO (coreLoadExecutor-2909-thread-1) [ x:collection1 ] o.a.s.u.CommitTracker Soft AutoCommit: disabled
[junit4] 2> 1320451 INFO (coreLoadExecutor-2909-thread-1) [ x:collection1 ] o.a.s.u.RandomMergePolicy RandomMergePolicy wrapping class org.apache.lucene.index.LogDocMergePolicy: [LogDocMergePolicy: minMergeSize=1000, mergeFactor=27, maxMergeSize=9223372036854775807, maxMergeSizeForForcedMerge=9223372036854775807, calibrateSizeByDeletes=false, maxMergeDocs=2147483647, maxCFSSegmentSizeMB=8.796093022207999E12, noCFSRatio=0.8974535428537929]
[junit4] 2> 1320451 INFO (coreLoadExecutor-2909-thread-1) [ x:collection1 ] o.a.s.s.SolrIndexSearcher Opening [Searcher@63fc6dab[collection1] main]
[junit4] 2> 1320451 INFO (coreLoadExecutor-2909-thread-1) [ x:collection1 ] o.a.s.h.c.SpellCheckComponent Initializing spell checkers
[junit4] 2> 1320472 INFO (coreLoadExecutor-2909-thread-1) [ x:collection1 ] o.a.s.s.DirectSolrSpellChecker init: {name=direct,classname=DirectSolrSpellChecker,field=lowerfilt,minQueryLength=3}
[junit4] 2> 1320518 INFO (coreLoadExecutor-2909-thread-1) [ x:collection1 ] o.a.s.h.ReplicationHandler Commits will be reserved for 10000ms.
[junit4] 2> 1320518 INFO (coreLoadExecutor-2909-thread-1) [ x:collection1 ] o.a.s.u.UpdateLog Could not find max version in index or recent updates, using new clock 1640853434253967360
[junit4] 2> 1320520 INFO (searcherExecutor-2910-thread-1-processing-x:collection1) [ x:collection1 ] o.a.s.h.c.SpellCheckComponent Loading spell index for spellchecker: default
[junit4] 2> 1320520 INFO (searcherExecutor-2910-thread-1-processing-x:collection1) [ x:collection1 ] o.a.s.h.c.SpellCheckComponent Loading spell index for spellchecker: direct
[junit4] 2> 1320520 INFO (searcherExecutor-2910-thread-1-processing-x:collection1) [ x:collection1 ] o.a.s.h.c.SpellCheckComponent Loading spell index for spellchecker: wordbreak
[junit4] 2> 1320520 INFO (searcherExecutor-2910-thread-1-processing-x:collection1) [ x:collection1 ] o.a.s.h.c.SpellCheckComponent Loading spell index for spellchecker: multipleFields
[junit4] 2> 1320520 INFO (searcherExecutor-2910-thread-1-processing-x:collection1) [ x:collection1 ] o.a.s.h.c.SpellCheckComponent Loading spell index for spellchecker: jarowinkler
[junit4] 2> 1320521 INFO (searcherExecutor-2910-thread-1-processing-x:collection1) [ x:collection1 ] o.a.s.h.c.SpellCheckComponent Loading spell index for spellchecker: external
[junit4] 2> 1320521 INFO (searcherExecutor-2910-thread-1-processing-x:collection1) [ x:collection1 ] o.a.s.h.c.SpellCheckComponent Loading spell index for spellchecker: freq
[junit4] 2> 1320521 INFO (searcherExecutor-2910-thread-1-processing-x:collection1) [ x:collection1 ] o.a.s.h.c.SpellCheckComponent Loading spell index for spellchecker: fqcn
[junit4] 2> 1320521 INFO (searcherExecutor-2910-thread-1-processing-x:collection1) [ x:collection1 ] o.a.s.h.c.SpellCheckComponent Loading spell index for spellchecker: perDict
[junit4] 2> 1320521 INFO (SUITE-StatsReloadRaceTest-seed#[49C8C2382EBA0661]-worker) [ ] o.a.s.SolrTestCaseJ4 ####initCore end
[junit4] 2> 1320523 INFO (searcherExecutor-2910-thread-1-processing-x:collection1) [ x:collection1 ] o.a.s.c.SolrCore [collection1] Registered new searcher Searcher@63fc6dab[collection1] main{ExitableDirectoryReader(UninvertingDirectoryReader())}
[junit4] 2> 1320524 INFO (SUITE-StatsReloadRaceTest-seed#[49C8C2382EBA0661]-worker) [ ] o.a.s.u.p.LogUpdateProcessorFactory [collection1] webapp=null path=null params={}{add=[0 (1640853434258161664), 1 (1640853434259210240), 2 (1640853434259210241), 3 (1640853434259210242), 4 (1640853434259210243), 5 (1640853434260258816), 6 (1640853434260258817), 7 (1640853434260258818), 8 (1640853434260258819), 9 (1640853434260258820), ... (24 adds)]} 0 2
[junit4] 2> 1320526 INFO (SUITE-StatsReloadRaceTest-seed#[49C8C2382EBA0661]-worker) [ ] o.a.s.u.DirectUpdateHandler2 start commit{_version_=1640853434262355968,optimize=false,openSearcher=true,waitSearcher=true,expungeDeletes=false,softCommit=false,prepareCommit=false}
[junit4] 2> 1320526 INFO (SUITE-StatsReloadRaceTest-seed#[49C8C2382EBA0661]-worker) [ ] o.a.s.u.SolrIndexWriter Calling setCommitData with IW:org.apache.solr.update.SolrIndexWriter@1884fd42 commitCommandVersion:1640853434262355968
[junit4] 2> 1320559 INFO (SUITE-StatsReloadRaceTest-seed#[49C8C2382EBA0661]-worker) [ ] o.a.s.s.SolrIndexSearcher Opening [Searcher@76859232[collection1] main]
[junit4] 2> 1320559 INFO (SUITE-StatsReloadRaceTest-seed#[49C8C2382EBA0661]-worker) [ ] o.a.s.u.DirectUpdateHandler2 end_commit_flush
[junit4] 2> 1320561 INFO (searcherExecutor-2910-thread-1) [ ] o.a.s.c.SolrCore [collection1] Registered new searcher Searcher@76859232[collection1] main{ExitableDirectoryReader(UninvertingDirectoryReader(Uninverting(_0(8.3.0):C24:[diagnostics={os=Linux, java.vendor=Oracle Corporation, java.version=1.8.0_191, java.vm.version=25.191-b12, lucene.version=8.3.0, os.arch=amd64, java.runtime.version=1.8.0_191-b12, source=flush, os.version=4.4.0-112-generic, timestamp=1564839777265}]:[attributes={Lucene50StoredFieldsFormat.mode=BEST_SPEED}])))}
[junit4] 2> 1320561 INFO (SUITE-StatsReloadRaceTest-seed#[49C8C2382EBA0661]-worker) [ ] o.a.s.u.p.LogUpdateProcessorFactory [collection1] webapp=null path=null params={}{commit=} 0 35
[junit4] 2> 1320566 INFO (TEST-StatsReloadRaceTest.testParallelReloadAndStats-seed#[49C8C2382EBA0661]) [ ] o.a.s.SolrTestCaseJ4 ###Starting testParallelReloadAndStats
[junit4] 2> 1320566 ERROR (parallelCoreAdminExecutor-2906-thread-1-processing-x:collection1 1 RELOAD) [ x:collection1 ] o.a.s.c.CorePropertiesLocator Couldn't load core descriptor from /home/jenkins/jenkins-slave/workspace/Lucene-Solr-Tests-8.x/solr/core/src/test-files/solr/collection1/core.properties:java.nio.file.NoSuchFileException: /home/jenkins/jenkins-slave/workspace/Lucene-Solr-Tests-8.x/solr/core/src/test-files/solr/collection1/core.properties
[junit4] 2> 1320566 INFO (TEST-StatsReloadRaceTest.testParallelReloadAndStats-seed#[49C8C2382EBA0661]) [ ] o.a.s.h.a.CoreAdminOperation Checking request status for : 1
[junit4] 2> 1320567 INFO (parallelCoreAdminExecutor-2906-thread-1-processing-x:collection1 1 RELOAD) [ x:collection1 ] o.a.s.c.SolrResourceLoader [null] Added 2 libs to classloader, from paths: [/home/jenkins/jenkins-slave/workspace/Lucene-Solr-Tests-8.x/solr/core/src/test-files/solr/collection1/lib, /home/jenkins/jenkins-slave/workspace/Lucene-Solr-Tests-8.x/solr/core/src/test-files/solr/collection1/lib/classes]
[junit4] 2> 1320580 INFO (TEST-StatsReloadRaceTest.testParallelReloadAndStats-seed#[49C8C2382EBA0661]) [ ] o.a.s.h.a.CoreAdminOperation Checking request status for : 1
[junit4] 2> 1320580 INFO (TEST-StatsReloadRaceTest.testParallelReloadAndStats-seed#[49C8C2382EBA0661]) [ ] o.a.s.h.a.CoreAdminOperation Checking request status for : 1
[junit4] 2> 1320622 INFO (TEST-StatsReloadRaceTest.testParallelReloadAndStats-seed#[49C8C2382EBA0661]) [ ] o.a.s.h.a.CoreAdminOperation Checking request status for : 1
[junit4] 2> 1320622 INFO (TEST-StatsReloadRaceTest.testParallelReloadAndStats-seed#[49C8C2382EBA0661]) [ ] o.a.s.h.a.CoreAdminOperation Checking request status for : 1
[junit4] 2> 1320623 INFO (TEST-StatsReloadRaceTest.testParallelReloadAndStats-seed#[49C8C2382EBA0661]) [ ] o.a.s.h.a.CoreAdminOperation Checking request status for : 1
[junit4] 2> 1320623 INFO (TEST-StatsReloadRaceTest.testParallelReloadAndStats-seed#[49C8C2382EBA0661]) [ ] o.a.s.h.a.CoreAdminOperation Checking request status for : 1
[junit4] 2> 1320623 INFO (TEST-StatsReloadRaceTest.testParallelReloadAndStats-seed#[49C8C2382EBA0661]) [ ] o.a.s.h.a.CoreAdminOperation Checking request status for : 1
[junit4] 2> 1320624 INFO (TEST-StatsReloadRaceTest.testParallelReloadAndStats-seed#[49C8C2382EBA0661]) [ ] o.a.s.h.a.CoreAdminOperation Checking request status for : 1
[junit4] 2> 1320624 INFO (TEST-StatsReloadRaceTest.testParallelReloadAndStats-seed#[49C8C2382EBA0661]) [ ] o.a.s.h.a.CoreAdminOperation Checking request status for : 1
[junit4] 2> 1320624 INFO (TEST-StatsReloadRaceTest.testParallelReloadAndStats-seed#[49C8C2382EBA0661]) [ ] o.a.s.h.a.CoreAdminOperation Checking request status for : 1
[junit4] 2> 1320625 INFO (TEST-StatsReloadRaceTest.testParallelReloadAndStats-seed#[49C8C2382EBA0661]) [ ] o.a.s.h.a.CoreAdminOperation Checking request status for : 1
[junit4] 2> 1320625 INFO (TEST-StatsReloadRaceTest.testParallelReloadAndStats-seed#[49C8C2382EBA0661]) [ ] o.a.s.h.a.CoreAdminOperation Checking request status for : 1
[junit4] 2> 1320625 INFO (TEST-StatsReloadRaceTest.testParallelReloadAndStats-seed#[49C8C2382EBA0661]) [ ] o.a.s.h.a.CoreAdminOperation Checking request status for : 1
[junit4] 2> 1320626 INFO (TEST-StatsReloadRaceTest.testParallelReloadAndStats-seed#[49C8C2382EBA0661]) [ ] o.a.s.h.a.CoreAdminOperation Checking request status for : 1
[junit4] 2> 1320626 INFO (TEST-StatsReloadRaceTest.testParallelReloadAndStats-seed#[49C8C2382EBA0661]) [ ] o.a.s.h.a.CoreAdminOperation Checking request status for : 1
[junit4] 2> 1320627 INFO (TEST-StatsReloadRaceTest.testParallelReloadAndStats-seed#[49C8C2382EBA0661]) [ ] o.a.s.h.a.CoreAdminOperation Checking request status for : 1
[junit4] 2> 1320627 INFO (TEST-StatsReloadRaceTest.testParallelReloadAndStats-seed#[49C8C2382EBA0661]) [ ] o.a.s.h.a.CoreAdminOperation Checking request status for : 1
[junit4] 2> 1320627 INFO (TEST-StatsReloadRaceTest.testParallelReloadAndStats-seed#[49C8C2382EBA0661]) [ ] o.a.s.h.a.CoreAdminOperation Checking request status for : 1
[junit4] 2> 1320627 INFO (TEST-StatsReloadRaceTest.testParallelReloadAndStats-seed#[49C8C2382EBA0661]) [ ] o.a.s.h.a.CoreAdminOperation Checking request status for : 1
[junit4] 2> 1320628 INFO (TEST-StatsReloadRaceTest.testParallelReloadAndStats-seed#[49C8C2382EBA0661]) [ ] o.a.s.h.a.CoreAdminOperation Checking request status for : 1
[junit4] 2> 1320649 INFO (TEST-StatsReloadRaceTest.testParallelReloadAndStats-seed#[49C8C2382EBA0661]) [ ] o.a.s.h.a.CoreAdminOperation Checking request status for : 1
[junit4] 2> 1320649 INFO (TEST-StatsReloadRaceTest.testParallelReloadAndStats-seed#[49C8C2382EBA0661]) [ ] o.a.s.h.a.CoreAdminOperation Checking request status for : 1
[junit4] 2> 1320649 INFO (TEST-StatsReloadRaceTest.testParallelReloadAndStats-seed#[49C8C2382EBA0661]) [ ] o.a.s.h.a.CoreAdminOperation Checking request status for : 1
[junit4] 2> 1320649 INFO (TEST-StatsReloadRaceTest.testParallelReloadAndStats-seed#[49C8C2382EBA0661]) [ ] o.a.s.h.a.CoreAdminOperation Checking request status for : 1
[junit4] 2> 1320650 INFO (TEST-StatsReloadRaceTest.testParallelReloadAndStats-seed#[49C8C2382EBA0661]) [ ] o.a.s.h.a.CoreAdminOperation Checking request status for : 1
[junit4] 2> 1320650 INFO (TEST-StatsReloadRaceTest.testParallelReloadAndStats-seed#[49C8C2382EBA0661]) [ ] o.a.s.h.a.CoreAdminOperation Checking request status for : 1
[junit4] 2> 1320651 INFO (TEST-StatsReloadRaceTest.testParallelReloadAndStats-seed#[49C8C2382EBA0661]) [ ] o.a.s.h.a.CoreAdminOperation Checking request status for : 1
[junit4] 2> 1320651 INFO (TEST-StatsReloadRaceTest.testParallelReloadAndStats-seed#[49C8C2382EBA0661]) [ ] o.a.s.h.a.CoreAdminOperation Checking request status for : 1
[junit4] 2> 1320651 INFO (TEST-StatsReloadRaceTest.testParallelReloadAndStats-seed#[49C8C2382EBA0661]) [ ] o.a.s.h.a.CoreAdminOperation Checking request status for : 1
[junit4] 2> 1320652 INFO (TEST-StatsReloadRaceTest.testParallelReloadAndStats-seed#[49C8C2382EBA0661]) [ ] o.a.s.h.a.CoreAdminOperation Checking request status for : 1
[junit4] 2> 1320664 INFO (parallelCoreAdminExecutor-2906-thread-1-processing-x:collection1 1 RELOAD) [ x:collection1 ] o.a.s.c.SolrConfig Using Lucene MatchVersion: 8.3.0
[junit4] 2> 1320665 INFO (TEST-StatsReloadRaceTest.testParallelReloadAndStats-seed#[49C8C2382EBA0661]) [ ] o.a.s.h.a.CoreAdminOperation Checking request status for : 1
[junit4] 2> 1320665 INFO (TEST-StatsReloadRaceTest.testParallelReloadAndStats-seed#[49C8C2382EBA0661]) [ ] o.a.s.h.a.CoreAdminOperation Checking request status for : 1
[junit4] 2> 1320665 INFO (TEST-StatsReloadRaceTest.testParallelReloadAndStats-seed#[49C8C2382EBA0661]) [ ] o.a.s.h.a.CoreAdminOperation Checking request status for : 1
[junit4] 2> 1320666 INFO (TEST-StatsReloadRaceTest.testParallelReloadAndStats-seed#[49C8C2382EBA0661]) [ ] o.a.s.h.a.CoreAdminOperation Checking request status for : 1
[junit4] 2> 1320666 INFO (TEST-StatsReloadRaceTest.testParallelReloadAndStats-seed#[49C8C2382EBA0661]) [ ] o.a.s.h.a.CoreAdminOperation Checking request status for : 1
[junit4] 2> 1320667 INFO (TEST-StatsReloadRaceTest.testParallelReloadAndStats-seed#[49C8C2382EBA0661]) [ ] o.a.s.h.a.CoreAdminOperation Checking request status for : 1
[junit4] 2> 1320667 INFO (TEST-StatsReloadRaceTest.testParallelReloadAndStats-seed#[49C8C2382EBA0661]) [ ] o.a.s.h.a.CoreAdminOperation Checking request status for : 1
[junit4] 2> 1320667 INFO (TEST-StatsReloadRaceTest.testParallelReloadAndStats-seed#[49C8C2382EBA0661]) [ ] o.a.s.h.a.CoreAdminOperation Checking request status for : 1
[junit4] 2> 1320667 INFO (TEST-StatsReloadRaceTest.testParallelReloadAndStats-seed#[49C8C2382EBA0661]) [ ] o.a.s.h.a.CoreAdminOperation Checking request status for : 1
[junit4] 2> 1320668 INFO (TEST-StatsReloadRaceTest.testParallelReloadAndStats-seed#[49C8C2382EBA0661]) [ ] o.a.s.h.a.CoreAdminOperation Checking request status for : 1
[junit4] 2> 1320668 INFO (TEST-StatsReloadRaceTest.testParallelReloadAndStats-seed#[49C8C2382EBA0661]) [ ] o.a.s.h.a.CoreAdminOperation Checking request status for : 1
[junit4] 2> 1320685 INFO (TEST-StatsReloadRaceTest.testParallelReloadAndStats-seed#[49C8C2382EBA0661]) [ ] o.a.s.h.a.CoreAdminOperation Checking request status for : 1
[junit4] 2> 1320693 INFO (TEST-StatsReloadRaceTest.testParallelReloadAndStats-seed#[49C8C2382EBA0661]) [ ] o.a.s.h.a.CoreAdminOperation Checking request status for : 1
[junit4] 2> 1320693 INFO (TEST-StatsReloadRaceTest.testParallelReloadAndStats-seed#[49C8C2382EBA0661]) [ ] o.a.s.h.a.CoreAdminOperation Checking request status for : 1
[junit4] 2> 1320694 INFO (TEST-StatsReloadRaceTest.testParallelReloadAndStats-seed#[49C8C2382EBA0661]) [ ] o.a.s.h.a.CoreAdminOperation Checking request status for : 1
[junit4] 2> 1320694 INFO (TEST-StatsReloadRaceTest.testParallelReloadAndStats-seed#[49C8C2382EBA0661]) [ ] o.a.s.h.a.CoreAdminOperation Checking request status for : 1
[junit4] 2> 1320694 INFO (TEST-StatsReloadRaceTest.testParallelReloadAndStats-seed#[49C8C2382EBA0661]) [ ] o.a.s.h.a.CoreAdminOperation Checking request status for : 1
[junit4] 2> 1320695 INFO (TEST-StatsReloadRaceTest.testParallelReloadAndStats-seed#[49C8C2382EBA0661]) [ ] o.a.s.h.a.CoreAdminOperation Checking request status for : 1
[junit4] 2> 1320695 INFO (TEST-StatsReloadRaceTest.testParallelReloadAndStats-seed#[49C8C2382EBA0661]) [ ] o.a.s.h.a.CoreAdminOperation Checking request status for : 1
[junit4] 2> 1320695 INFO (TEST-StatsReloadRaceTest.testParallelReloadAndStats-seed#[49C8C2382EBA0661]) [ ] o.a.s.h.a.CoreAdminOperation Checking request status for : 1
[junit4] 2> 1320696 INFO (TEST-StatsReloadRaceTest.testParallelReloadAndStats-seed#[49C8C2382EBA0661]) [ ] o.a.s.h.a.CoreAdminOperation Checking request status for : 1
[junit4] 2> 1320696 INFO (TEST-StatsReloadRaceTest.testParallelReloadAndStats-seed#[49C8C2382EBA0661]) [ ] o.a.s.h.a.CoreAdminOperation Checking request status for : 1
[junit4] 2> 1320696 INFO (TEST-StatsReloadRaceTest.testParallelReloadAndStats-seed#[49C8C2382EBA0661]) [ ] o.a.s.h.a.CoreAdminOperation Checking request status for : 1
[junit4] 2> 1320697 INFO (TEST-StatsReloadRaceTest.testParallelReloadAndStats-seed#[49C8C2382EBA0661]) [ ] o.a.s.h.a.CoreAdminOperation Checking request status for : 1
[junit4] 2> 1320697 INFO (TEST-StatsReloadRaceTest.testParallelReloadAndStats-seed#[49C8C2382EBA0661]) [ ] o.a.s.h.a.CoreAdminOperation Checking request status for : 1
[junit4] 2> 1320697 INFO (TEST-StatsReloadRaceTest.testParallelReloadAndStats-seed#[49C8C2382EBA0661]) [ ] o.a.s.h.a.CoreAdminOperation Checking request status for : 1
[junit4] 2> 1320697 INFO (TEST-StatsReloadRaceTest.testParallelReloadAndStats-seed#[49C8C2382EBA0661]) [ ] o.a.s.h.a.CoreAdminOperation Checking request status for : 1
[junit4] 2> 1320698 INFO (TEST-StatsReloadRaceTest.testParallelReloadAndStats-seed#[49C8C2382EBA0661]) [ ] o.a.s.h.a.CoreAdminOperation Checking request status for : 1
[junit4] 2> 1320698 INFO (TEST-StatsReloadRaceTest.testParallelReloadAndStats-seed#[49C8C2382EBA0661]) [ ] o.a.s.h.a.CoreAdminOperation Checking request status for : 1
[junit4] 2> 1320698 INFO (TEST-StatsReloadRaceTest.testParallelReloadAndStats-seed#[49C8C2382EBA0661]) [ ] o.a.s.h.a.CoreAdminOperation Checking request status for : 1
[junit4] 2> 1320699 INFO (TEST-StatsReloadRaceTest.testParallelReloadAndStats-seed#[49C8C2382EBA0661]) [ ] o.a.s.h.a.CoreAdminOperation Checking request status for : 1
[junit4] 2> 1320699 INFO (TEST-StatsReloadRaceTest.testParallelReloadAndStats-seed#[49C8C2382EBA0661]) [ ] o.a.s.h.a.CoreAdminOperation Checking request status for : 1
[junit4] 2> 1320700 INFO (TEST-StatsReloadRaceTest.testParallelReloadAndStats-seed#[49C8C2382EBA0661]) [ ] o.a.s.h.a.CoreAdminOperation Checking request status for : 1
[junit4] 2> 1320700 INFO (TEST-StatsReloadRaceTest.testParallelReloadAndStats-seed#[49C8C2382EBA0661]) [ ] o.a.s.h.a.CoreAdminOperation Checking request status for : 1
[junit4] 2> 1320700 INFO (TEST-StatsReloadRaceTest.testParallelReloadAndStats-seed#[49C8C2382EBA0661]) [ ] o.a.s.h.a.CoreAdminOperation Checking request status for : 1
[junit4] 2> 1320701 INFO (TEST-StatsReloadRaceTest.testParallelReloadAndStats-seed#[49C8C2382EBA0661]) [ ] o.a.s.h.a.CoreAdminOperation Checking request status for : 1
[junit4] 2> 1320721 INFO (TEST-StatsReloadRaceTest.testParallelReloadAndStats-seed#[49C8C2382EBA0661]) [ ] o.a.s.h.a.CoreAdminOperation Checking request status for : 1
[junit4] 2> 1320721 INFO (TEST-StatsReloadRaceTest.testParallelReloadAndStats-seed#[49C8C2382EBA0661]) [ ] o.a.s.h.a.CoreAdminOperation Checking request status for : 1
[junit4] 2> 1320722 INFO (TEST-StatsReloadRaceTest.testParallelReloadAndStats-seed#[49C8C2382EBA0661]) [ ] o.a.s.h.a.CoreAdminOperation Checking request status for : 1
[junit4] 2> 1320722 INFO (TEST-StatsReloadRaceTest.testParallelReloadAndStats-seed#[49C8C2382EBA0661]) [ ] o.a.s.h.a.CoreAdminOperation Checking request status for : 1
[junit4] 2> 1320737 INFO (TEST-StatsReloadRaceTest.testParallelReloadAndStats-seed#[49C8C2382EBA0661]) [ ] o.a.s.h.a.CoreAdminOperation Checking request status for : 1
[junit4] 2> 1320738 INFO (TEST-StatsReloadRaceTest.testParallelReloadAndStats-seed#[49C8C2382EBA0661]) [ ] o.a.s.h.a.CoreAdminOperation Checking request status for : 1
[junit4] 2> 1320738 INFO (TEST-StatsReloadRaceTest.testParallelReloadAndStats-seed#[49C8C2382EBA0661]) [ ] o.a.s.h.a.CoreAdminOperation Checking request status for : 1
[junit4] 2> 1320739 INFO (TEST-StatsReloadRaceTest.testParallelReloadAndStats-seed#[49C8C2382EBA0661]) [ ] o.a.s.h.a.CoreAdminOperation Checking request status for : 1
[junit4] 2> 1320739 INFO (TEST-StatsReloadRaceTest.testParallelReloadAndStats-seed#[49C8C2382EBA0661]) [ ] o.a.s.h.a.CoreAdminOperation Checking request status for : 1
[junit4] 2> 1320739 INFO (TEST-StatsReloadRaceTest.testParallelReloadAndStats-seed#[49C8C2382EBA0661]) [ ] o.a.s.h.a.CoreAdminOperation Checking request status for : 1
[junit4] 2> 1320740 INFO (TEST-StatsReloadRaceTest.testParallelReloadAndStats-seed#[49C8C2382EBA0661]) [ ] o.a.s.h.a.CoreAdminOperation Checking request status for : 1
[junit4] 2> 1320740 INFO (TEST-StatsReloadRaceTest.testParallelReloadAndStats-seed#[49C8C2382EBA0661]) [ ] o.a.s.h.a.CoreAdminOperation Checking request status for : 1
[junit4] 2> 1320740 INFO (TEST-StatsReloadRaceTest.testParallelReloadAndStats-seed#[49C8C2382EBA0661]) [ ] o.a.s.h.a.CoreAdminOperation Checking request status for : 1
[junit4] 2> 1320740 INFO (TEST-StatsReloadRaceTest.testParallelReloadAndStats-seed#[49C8C2382EBA0661]) [ ] o.a.s.h.a.CoreAdminOperation Checking request status for : 1
[junit4] 2> 1320741 INFO (TEST-StatsReloadRaceTest.testParallelReloadAndStats-seed#[49C8C2382EBA0661]) [ ] o.a.s.h.a.CoreAdminOperation Checking request status for : 1
[junit4] 2> 1320741 INFO (TEST-StatsReloadRaceTest.testParallelReloadAndStats-seed#[49C8C2382EBA0661]) [ ] o.a.s.h.a.CoreAdminOperation Checking request status for : 1
[junit4] 2> 1320741 INFO (TEST-StatsReloadRaceTest.testParallelReloadAndStats-seed#[49C8C2382EBA0661]) [ ] o.a.s.h.a.CoreAdminOperation Checking request status for : 1
[junit4] 2> 1320742 INFO (TEST-StatsReloadRaceTest.testParallelReloadAndStats-seed#[49C8C2382EBA0661]) [ ] o.a.s.h.a.CoreAdminOperation Checking request status for : 1
[junit4] 2> 1320742 INFO (TEST-StatsReloadRaceTest.testParallelReloadAndStats-seed#[49C8C2382EBA0661]) [ ] o.a.s.h.a.CoreAdminOperation Checking request status for : 1
[junit4] 2> 1320742 INFO (TEST-StatsReloadRaceTest.testParallelReloadAndStats-seed#[49C8C2382EBA0661]) [ ] o.a.s.h.a.CoreAdminOperation Checking request status for : 1
[junit4] 2> 1320743 INFO (TEST-StatsReloadRaceTest.testParallelReloadAndStats-seed#[49C8C2382EBA0661]) [ ] o.a.s.h.a.CoreAdminOperation Checking request status for : 1
[junit4] 2> 1320743 INFO (TEST-StatsReloadRaceTest.testParallelReloadAndStats-seed#[49C8C2382EBA0661]) [ ] o.a.s.h.a.CoreAdminOperation Checking request status for : 1
[junit4] 2> 1320743 INFO (TEST-StatsReloadRaceTest.testParallelReloadAndStats-seed#[49C8C2382EBA0661]) [ ] o.a.s.h.a.CoreAdminOperation Checking request status for : 1
[junit4] 2> 1320744 INFO (TEST-StatsReloadRaceTest.testParallelReloadAndStats-seed#[49C8C2382EBA0661]) [ ] o.a.s.h.a.CoreAdminOperation Checking request status for : 1
[junit4] 2> 1320744 INFO (TEST-StatsReloadRaceTest.testParallelReloadAndStats-seed#[49C8C2382EBA0661]) [ ] o.a.s.h.a.CoreAdminOperation Checking request status for : 1
[junit4] 2> 1320744 INFO (TEST-StatsReloadRaceTest.testParallelReloadAndStats-seed#[49C8C2382EBA0661]) [ ] o.a.s.h.a.CoreAdminOperation Checking request status for : 1
[junit4] 2> 1320745 INFO (TEST-StatsReloadRaceTest.testParallelReloadAndStats-seed#[49C8C2382EBA0661]) [ ] o.a.s.h.a.CoreAdminOperation Checking request status for : 1
[junit4] 2> 1320745 INFO (TEST-StatsReloadRaceTest.testParallelReloadAndStats-seed#[49C8C2382EBA0661]) [ ] o.a.s.h.a.CoreAdminOperation Checking request status for : 1
[junit4] 2> 1320745 INFO (TEST-StatsReloadRaceTest.testParallelReloadAndStats-seed#[49C8C2382EBA0661]) [ ] o.a.s.h.a.CoreAdminOperation Checking request status for : 1
[junit4] 2> 1320766 INFO (TEST-StatsReloadRaceTest.testParallelReloadAndStats-seed#[49C8C2382EBA0661]) [ ] o.a.s.h.a.CoreAdminOperation Checking request status for : 1
[junit4] 2> 1320767 INFO (TEST-StatsReloadRaceTest.testParallelReloadAndStats-seed#[49C8C2382EBA0661]) [ ] o.a.s.h.a.CoreAdminOperation Checking request status for : 1
[junit4] 2> 1320767 INFO (TEST-StatsReloadRaceTest.testParallelReloadAndStats-seed#[49C8C2382EBA0661]) [ ] o.a.s.h.a.CoreAdminOperation Checking request status for : 1
[junit4] 2> 1320768 INFO (TEST-StatsReloadRaceTest.testParallelReloadAndStats-seed#[49C8C2382EBA0661]) [ ] o.a.s.h.a.CoreAdminOperation Checking request status for : 1
[junit4] 2> 1320768 INFO (TEST-StatsReloadRaceTest.testParallelReloadAndStats-seed#[49C8C2382EBA0661]) [ ] o.a.s.h.a.CoreAdminOperation Checking request status for : 1
[junit4] 2> 1320768 INFO (TEST-StatsReloadRaceTest.testParallelReloadAndStats-seed#[49C8C2382EBA0661]) [ ] o.a.s.h.a.CoreAdminOperation Checking request status for : 1
[junit4] 2> 1320769 INFO (TEST-StatsReloadRaceTest.testParallelReloadAndStats-seed#[49C8C2382EBA0661]) [ ] o.a.s.h.a.CoreAdminOperation Checking request status for : 1
[junit4] 2> 1320769 INFO (TEST-StatsReloadRaceTest.testParallelReloadAndStats-seed#[49C8C2382EBA0661]) [ ] o.a.s.h.a.CoreAdminOperation Checking request status for : 1
[junit4] 2> 1320773 INFO (parallelCoreAdminExecutor-2906-thread-1-processing-x:collection1 1 RELOAD) [ x:collection1 ] o.a.s.s.IndexSchema [collection1] Schema name=test
[junit4] 2> 1320778 INFO (TEST-StatsReloadRaceTest.testParallelReloadAndStats-seed#[49C8C2382EBA0661]) [ ] o.a.s.h.a.CoreAdminOperation Checking request status for : 1
[junit4] 2> 1320778 INFO (TEST-StatsReloadRaceTest.testParallelReloadAndStats-seed#[49C8C2382EBA0661]) [ ] o.a.s.h.a.CoreAdminOperation Checking request status for : 1
[junit4] 2> 1320779 INFO (TEST-StatsReloadRaceTest.testParallelReloadAndStats-seed#[49C8C2382EBA0661]) [ ] o.a.s.h.a.CoreAdminOperation Checking request status for : 1
[junit4] 2> 1320779 INFO (TEST-StatsReloadRaceTest.testParallelReloadAndStats-seed#[49C8C2382EBA0661]) [ ] o.a.s.h.a.CoreAdminOperation Checking request status for : 1
[junit4] 2> 1320779 INFO (TEST-StatsReloadRaceTest.testParallelReloadAndStats-seed#[49C8C2382EBA0661]) [ ] o.a.s.h.a.CoreAdminOperation Checking request status for : 1
[junit4] 2> 1320780 INFO (TEST-StatsReloadRaceTest.testParallelReloadAndStats-seed#[49C8C2382EBA0661]) [ ] o.a.s.h.a.CoreAdminOperation Checking request status for : 1
[junit4] 2> 1320780 INFO (TEST-StatsReloadRaceTest.testParallelReloadAndStats-seed#[49C8C2382EBA0661]) [ ] o.a.s.h.a.CoreAdminOperation Checking request status for : 1
[junit4] 2> 1320780 INFO (TEST-StatsReloadRaceTest.testParallelReloadAndStats-seed#[49C8C2382EBA0661]) [ ] o.a.s.h.a.CoreAdminOperation Checking request status for : 1
[junit4] 2> 1320781 INFO (TEST-StatsReloadRaceTest.testParallelReloadAndStats-seed#[49C8C2382EBA0661]) [ ] o.a.s.h.a.CoreAdminOperation Checking request status for : 1
[junit4] 2> 1320781 INFO (TEST-StatsReloadRaceTest.testParallelReloadAndStats-seed#[49C8C2382EBA0661]) [ ] o.a.s.h.a.CoreAdminOperation Checking request status for : 1
[junit4] 2> 1320781 INFO (TEST-StatsReloadRaceTest.testParallelReloadAndStats-seed#[49C8C2382EBA0661]) [ ] o.a.s.h.a.CoreAdminOperation Checking request status for : 1
[junit4] 2> 1320782 INFO (TEST-StatsReloadRaceTest.testParallelReloadAndStats-seed#[49C8C2382EBA0661]) [ ] o.a.s.h.a.CoreAdminOperation Checking request status for : 1
[junit4] 2> 1320799 INFO (TEST-StatsReloadRaceTest.testParallelReloadAndStats-seed#[49C8C2382EBA0661]) [ ] o.a.s.h.a.CoreAdminOperation Checking request status for : 1
[junit4] 2> 1320800 INFO (TEST-StatsReloadRaceTest.testParallelReloadAndStats-seed#[49C8C2382EBA0661]) [ ] o.a.s.h.a.CoreAdminOperation Checking request status for : 1
[junit4] 2> 1320800 INFO (TEST-StatsReloadRaceTest.testParallelReloadAndStats-seed#[49C8C2382EBA0661]) [ ] o.a.s.h.a.CoreAdminOperation Checking request status for : 1
[junit4] 2> 1320800 INFO (TEST-StatsReloadRaceTest.testParallelReloadAndStats-seed#[49C8C2382EBA0661]) [ ] o.a.s.h.a.CoreAdminOperation Checking request status for : 1
[junit4] 2> 1320800 INFO (TEST-StatsReloadRaceTest.testParallelReloadAndStats-seed#[49C8C2382EBA0661]) [ ] o.a.s.h.a.CoreAdminOperation Checking request status for : 1
[junit4] 2> 1320801 INFO (TEST-StatsReloadRaceTest.testParallelReloadAndStats-seed#[49C8C2382EBA0661]) [ ] o.a.s.h.a.CoreAdminOperation Checking request status for : 1
[junit4] 2> 1320801 INFO (TEST-StatsReloadRaceTest.testParallelReloadAndStats-seed#[49C8C2382EBA0661]) [ ] o.a.s.h.a.CoreAdminOperation Checking request status for : 1
[junit4] 2> 1320801 INFO (TEST-StatsReloadRaceTest.testParallelReloadAndStats-seed#[49C8C2382EBA0661]) [ ] o.a.s.h.a.CoreAdminOperation Checking request status for : 1
[junit4] 2> 1320802 INFO (TEST-StatsReloadRaceTest.testParallelReloadAndStats-seed#[49C8C2382EBA0661]) [ ] o.a.s.h.a.CoreAdminOperation Checking request status for : 1
[junit4] 2> 1320802 INFO (TEST-StatsReloadRaceTest.testParallelReloadAndStats-seed#[49C8C2382EBA0661]) [ ] o.a.s.h.a.CoreAdminOperation Checking request status for : 1
[junit4] 2> 1320810 INFO (TEST-StatsReloadRaceTest.testParallelReloadAndStats-seed#[49C8C2382EBA0661]) [ ] o.a.s.h.a.CoreAdminOperation Checking request status for : 1
[junit4] 2> 1320811 INFO (TEST-StatsReloadRaceTest.testParallelReloadAndStats-seed#[49C8C2382EBA0661]) [ ] o.a.s.h.a.CoreAdminOperation Checking request status for : 1
[junit4] 2> 1320811 INFO (TEST-StatsReloadRaceTest.testParallelReloadAndStats-seed#[49C8C2382EBA0661]) [ ] o.a.s.h.a.CoreAdminOperation Checking request status for : 1
[junit4] 2> 1320811 INFO (TEST-StatsReloadRaceTest.testParallelReloadAndStats-seed#[49C8C2382EBA0661]) [ ] o.a.s.h.a.CoreAdminOperation Checking request status for : 1
[junit4] 2> 1320811 INFO (TEST-StatsReloadRaceTest.testParallelReloadAndStats-seed#[49C8C2382EBA0661]) [ ] o.a.s.h.a.CoreAdminOperation Checking request status for : 1
[junit4] 2> 1320812 INFO (TEST-StatsReloadRaceTest.testParallelReloadAndStats-seed#[49C8C2382EBA0661]) [ ] o.a.s.h.a.CoreAdminOperation Checking request status for : 1
[junit4] 2> 1320812 INFO (TEST-StatsReloadRaceTest.testParallelReloadAndStats-seed#[49C8C2382EBA0661]) [ ] o.a.s.h.a.CoreAdminOperation Checking request status for : 1
[junit4] 2> 1320813 INFO (TEST-StatsReloadRaceTest.testParallelReloadAndStats-seed#[49C8C2382EBA0661]) [ ] o.a.s.h.a.CoreAdminOperation Checking request status for : 1
[junit4] 2> 1320813 INFO (TEST-StatsReloadRaceTest.testParallelReloadAndStats-seed#[49C8C2382EBA0661]) [ ] o.a.s.h.a.CoreAdminOperation Checking request status for : 1
[junit4] 2> 1320813 INFO (TEST-StatsReloadRaceTest.testParallelReloadAndStats-seed#[49C8C2382EBA0661]) [ ] o.a.s.h.a.CoreAdminOperation Checking request status for : 1
[junit4] 2> 1320814 INFO (TEST-StatsReloadRaceTest.testParallelReloadAndStats-seed#[49C8C2382EBA0661]) [ ] o.a.s.h.a.CoreAdminOperation Checking request status for : 1
[junit4] 2> 1320830 INFO (TEST-StatsReloadRaceTest.testParallelReloadAndStats-seed#[49C8C2382EBA0661]) [ ] o.a.s.h.a.CoreAdminOperation Checking request status for : 1
[junit4] 2> 1320831 INFO (TEST-StatsReloadRaceTest.testParallelReloadAndStats-seed#[49C8C2382EBA0661]) [ ] o.a.s.h.a.CoreAdminOperation Checking request status for : 1
[junit4] 2> 1320831 INFO (TEST-StatsReloadRaceTest.testParallelReloadAndStats-seed#[49C8C2382EBA0661]) [ ] o.a.s.h.a.CoreAdminOperation Checking request status for : 1
[junit4] 2> 1320831 INFO (TEST-StatsReloadRaceTest.testParallelReloadAndStats-seed#[49C8C2382EBA0661]) [ ] o.a.s.h.a.CoreAdminOperation Checking request status for : 1
[junit4] 2> 1320831 INFO (TEST-StatsReloadRaceTest.testParallelReloadAndStats-seed#[49C8C2382EBA0661]) [ ] o.a.s.h.a.CoreAdminOperation Checking request status for : 1
[junit4] 2> 1320832 INFO (TEST-StatsReloadRaceTest.testParallelReloadAndStats-seed#[49C8C2382EBA0661]) [ ] o.a.s.h.a.CoreAdminOperation Checking request status for : 1
[junit4] 2> 1320832 INFO (TEST-StatsReloadRaceTest.testParallelReloadAndStats-seed#[49C8C2382EBA0661]) [ ] o.a.s.h.a.CoreAdminOperation Checking request status for : 1
[junit4] 2> 1320832 INFO (TEST-StatsReloadRaceTest.testParallelReloadAndStats-seed#[49C8C2382EBA0661]) [ ] o.a.s.h.a.CoreAdminOperation Checking request status for : 1
[junit4] 2> 1320833 INFO (TEST-StatsReloadRaceTest.testParallelReloadAndStats-seed#[49C8C2382EBA0661]) [ ] o.a.s.h.a.CoreAdminOperation Checking request status for : 1
[junit4] 2> 1320833 INFO (TEST-StatsReloadRaceTest.testParallelReloadAndStats-seed#[49C8C2382EBA0661]) [ ] o.a.s.h.a.CoreAdminOperation Checking request status for : 1
[junit4] 2> 1320834 INFO (TEST-StatsReloadRaceTest.testParallelReloadAndStats-seed#[49C8C2382EBA0661]) [ ] o.a.s.h.a.CoreAdminOperation Checking request status for : 1
[junit4] 2> 1320834 INFO (TEST-StatsReloadRaceTest.testParallelReloadAndStats-seed#[49C8C2382EBA0661]) [ ] o.a.s.h.a.CoreAdminOperation Checking request status for : 1
[junit4] 2> 1320834 INFO (TEST-StatsReloadRaceTest.testParallelReloadAndStats-seed#[49C8C2382EBA0661]) [ ] o.a.s.h.a.CoreAdminOperation Checking request status for : 1
[junit4] 2> 1320847 INFO (TEST-StatsReloadRaceTest.testParallelReloadAndStats-seed#[49C8C2382EBA0661]) [ ] o.a.s.h.a.CoreAdminOperation Checking request status for : 1
[junit4] 2> 1320847 INFO (TEST-StatsReloadRaceTest.testParallelReloadAndStats-seed#[49C8C2382EBA0661]) [ ] o.a.s.h.a.CoreAdminOperation Checking request status for : 1
[junit4] 2> 1320847 INFO (TEST-StatsReloadRaceTest.testParallelReloadAndStats-seed#[49C8C2382EBA0661]) [ ] o.a.s.h.a.CoreAdminOperation Checking request status for : 1
[junit4] 2> 1320848 INFO (TEST-StatsReloadRaceTest.testParallelReloadAndStats-seed#[49C8C2382EBA0661]) [ ] o.a.s.h.a.CoreAdminOperation Checking request status for : 1
[junit4] 2> 1320848 INFO (TEST-StatsReloadRaceTest.testParallelReloadAndStats-seed#[49C8C2382EBA0661]) [ ] o.a.s.h.a.CoreAdminOperation Checking request status for : 1
[junit4] 2> 1320848 INFO (TEST-StatsReloadRaceTest.testParallelReloadAndStats-seed#[49C8C2382EBA0661]) [ ] o.a.s.h.a.CoreAdminOperation Checking request status for : 1
[junit4] 2> 1320848 INFO (TEST-StatsReloadRaceTest.testParallelReloadAndStats-seed#[49C8C2382EBA0661]) [ ] o.a.s.h.a.CoreAdminOperation Checking request status for : 1
[junit4] 2> 1320849 INFO (TEST-StatsReloadRaceTest.testParallelReloadAndStats-seed#[49C8C2382EBA0661]) [ ] o.a.s.h.a.CoreAdminOperation Checking request status for : 1
[junit4] 2> 1320849 INFO (TEST-StatsReloadRaceTest.testParallelReloadAndStats-seed#[49C8C2382EBA0661]) [ ] o.a.s.h.a.CoreAdminOperation Checking request status for : 1
[junit4] 2> 1320850 INFO (TEST-StatsReloadRaceTest.testParallelReloadAndStats-seed#[49C8C2382EBA0661]) [ ] o.a.s.h.a.CoreAdminOperation Checking request status for : 1
[junit4] 2> 1320850 INFO (TEST-StatsReloadRaceTest.testParallelReloadAndStats-seed#[49C8C2382EBA0661]) [ ] o.a.s.h.a.CoreAdminOperation Checking request status for : 1
[junit4] 2> 1320850 INFO (TEST-StatsReloadRaceTest.testParallelReloadAndStats-seed#[49C8C2382EBA0661]) [ ] o.a.s.h.a.CoreAdminOperation Checking request status for : 1
[junit4] 2> 1320850 INFO (TEST-StatsReloadRaceTest.testParallelReloadAndStats-seed#[49C8C2382EBA0661]) [ ] o.a.s.h.a.CoreAdminOperation Checking request status for : 1
[junit4] 2> 1320859 INFO (TEST-StatsReloadRaceTest.testParallelReloadAndStats-seed#[49C8C2382EBA0661]) [ ] o.a.s.h.a.CoreAdminOperation Checking request status for : 1
[junit4] 2> 1320859 INFO (TEST-StatsReloadRaceTest.testParallelReloadAndStats-seed#[49C8C2382EBA0661]) [ ] o.a.s.h.a.CoreAdminOperation Checking request status for : 1
[junit4] 2> 1320859 INFO (TEST-StatsReloadRaceTest.testParallelReloadAndStats-seed#[49C8C2382EBA0661]) [ ] o.a.s.h.a.CoreAdminOperation Checking request status for : 1
[junit4] 2> 1320860 INFO (TEST-StatsReloadRaceTest.testParallelReloadAndStats-seed#[49C8C2382EBA0661]) [ ] o.a.s.h.a.CoreAdminOperation Checking request status for : 1
[junit4] 2> 1320860 INFO (TEST-StatsReloadRaceTest.testParallelReloadAndStats-seed#[49C8C2382EBA0661]) [ ] o.a.s.h.a.CoreAdminOperation Checking request status for : 1
[junit4] 2> 1320861 INFO (TEST-StatsReloadRaceTest.testParallelReloadAndStats-seed#[49C8C2382EBA0661]) [ ] o.a.s.h.a.CoreAdminOperation Checking request status for : 1
[junit4] 2> 1320861 INFO (TEST-StatsReloadRaceTest.testParallelReloadAndStats-seed#[49C8C2382EBA0661]) [ ] o.a.s.h.a.CoreAdminOperation Checking request status for : 1
[junit4] 2> 1320861 INFO (TEST-StatsReloadRaceTest.testParallelReloadAndStats-seed#[49C8C2382EBA0661]) [ ] o.a.s.h.a.CoreAdminOperation Checking request status for : 1
[junit4] 2> 1320862 INFO (TEST-StatsReloadRaceTest.testParallelReloadAndStats-seed#[49C8C2382EBA0661]) [ ] o.a.s.h.a.CoreAdminOperation Checking request status for : 1
[junit4] 2> 1320862 INFO (TEST-StatsReloadRaceTest.testParallelReloadAndStats-seed#[49C8C2382EBA0661]) [ ] o.a.s.h.a.CoreAdminOperation Checking request status for : 1
[junit4] 2> 1320862 INFO (TEST-StatsReloadRaceTest.testParallelReloadAndStats-seed#[49C8C2382EBA0661]) [ ] o.a.s.h.a.CoreAdminOperation Checking request status for : 1
[junit4] 2> 1320863 INFO (TEST-StatsReloadRaceTest.testParallelReloadAndStats-seed#[49C8C2382EBA0661]) [ ] o.a.s.h.a.CoreAdminOperation Checking request status for : 1
[junit4] 2> 1320863 INFO (TEST-StatsReloadRaceTest.testParallelReloadAndStats-seed#[49C8C2382EBA0661]) [ ] o.a.s.h.a.CoreAdminOperation Checking request status for : 1
[junit4] 2> 1320863 INFO (TEST-StatsReloadRaceTest.testParallelReloadAndStats-seed#[49C8C2382EBA0661]) [ ] o.a.s.h.a.CoreAdminOperation Checking request status for : 1
[junit4] 2> 1320863 INFO (TEST-StatsReloadRaceTest.testParallelReloadAndStats-seed#[49C8C2382EBA0661]) [ ] o.a.s.h.a.CoreAdminOperation Checking request status for : 1
[junit4] 2> 1320864 INFO (TEST-StatsReloadRaceTest.testParallelReloadAndStats-seed#[49C8C2382EBA0661]) [ ] o.a.s.h.a.CoreAdminOperation Checking request status for : 1
[junit4] 2> 1320864 INFO (TEST-StatsReloadRaceTest.testParallelReloadAndStats-seed#[49C8C2382EBA0661]) [ ] o.a.s.h.a.CoreAdminOperation Checking request status for : 1
[junit4] 2> 1320864 INFO (TEST-StatsReloadRaceTest.testParallelReloadAndStats-seed#[49C8C2382EBA0661]) [ ] o.a.s.h.a.CoreAdminOperation Checking request status for : 1
[junit4] 2> 1320865 INFO (TEST-StatsReloadRaceTest.testParallelReloadAndStats-seed#[49C8C2382EBA0661]) [ ] o.a.s.h.a.CoreAdminOperation Checking request status for : 1
[junit4] 2> 1320865 INFO (TEST-StatsReloadRaceTest.testParallelReloadAndStats-seed#[49C8C2382EBA0661]) [ ] o.a.s.h.a.CoreAdminOperation Checking request status for : 1
[junit4] 2> 1320865 INFO (TEST-StatsReloadRaceTest.testParallelReloadAndStats-seed#[49C8C2382EBA0661]) [ ] o.a.s.h.a.CoreAdminOperation Checking request status for : 1
[junit4] 2> 1320866 INFO (TEST-StatsReloadRaceTest.testParallelReloadAndStats-seed#[49C8C2382EBA0661]) [ ] o.a.s.h.a.CoreAdminOperation Checking request status for : 1
[junit4] 2> 1320866 INFO (TEST-StatsReloadRaceTest.testParallelReloadAndStats-seed#[49C8C2382EBA0661]) [ ] o.a.s.h.a.CoreAdminOperation Checking request status for : 1
[junit4] 2> 1320866 INFO (TEST-StatsReloadRaceTest.testParallelReloadAndStats-seed#[49C8C2382EBA0661]) [ ] o.a.s.h.a.CoreAdminOperation Checking request status for : 1
[junit4] 2> 1320883 INFO (TEST-StatsReloadRaceTest.testParallelReloadAndStats-seed#[49C8C2382EBA0661]) [ ] o.a.s.h.a.CoreAdminOperation Checking request status for : 1
[junit4] 2> 1320884 INFO (TEST-StatsReloadRaceTest.testParallelReloadAndStats-seed#[49C8C2382EBA0661]) [ ] o.a.s.h.a.CoreAdminOperation Checking request status for : 1
[junit4] 2> 1320884 INFO (TEST-StatsReloadRaceTest.testParallelReloadAndStats-seed#[49C8C2382EBA0661]) [ ] o.a.s.h.a.CoreAdminOperation Checking request status for : 1
[junit4] 2> 1320884 INFO (TEST-StatsReloadRaceTest.testParallelReloadAndStats-seed#[49C8C2382EBA0661]) [ ] o.a.s.h.a.CoreAdminOperation Checking request status for : 1
[junit4] 2> 1320885 INFO (TEST-StatsReloadRaceTest.testParallelReloadAndStats-seed#[49C8C2382EBA0661]) [ ] o.a.s.h.a.CoreAdminOperation Checking request status for : 1
[junit4] 2> 1320885 INFO (TEST-StatsReloadRaceTest.testParallelReloadAndStats-seed#[49C8C2382EBA0661]) [ ] o.a.s.h.a.CoreAdminOperation Checking request status for : 1
[junit4] 2> 1320885 INFO (TEST-StatsReloadRaceTest.testParallelReloadAndStats-seed#[49C8C2382EBA0661]) [ ] o.a.s.h.a.CoreAdminOperation Checking request status for : 1
[junit4] 2> 1320885 INFO (TEST-StatsReloadRaceTest.testParallelReloadAndStats-seed#[49C8C2382EBA0661]) [ ] o.a.s.h.a.CoreAdminOperation Checking request status for : 1
[junit4] 2> 1320886 INFO (TEST-StatsReloadRaceTest.testParallelReloadAndStats-seed#[49C8C2382EBA0661]) [ ] o.a.s.h.a.CoreAdminOperation Checking request status for : 1
[junit4] 2> 1320886 INFO (TEST-StatsReloadRaceTest.testParallelReloadAndStats-seed#[49C8C2382EBA0661]) [ ] o.a.s.h.a.CoreAdminOperation Checking request status for : 1
[junit4] 2> 1320887 INFO (TEST-StatsReloadRaceTest.testParallelReloadAndStats-seed#[49C8C2382EBA0661]) [ ] o.a.s.h.a.CoreAdminOperation Checking request status for : 1
[junit4] 2> 1320895 INFO (TEST-StatsReloadRaceTest.testParallelReloadAndStats-seed#[49C8C2382EBA0661]) [ ] o.a.s.h.a.CoreAdminOperation Checking request status for : 1
[junit4] 2> 1320896 INFO (TEST-StatsReloadRaceTest.testParallelReloadAndStats-seed#[49C8C2382EBA0661]) [ ] o.a.s.h.a.CoreAdminOperation Checking request status for : 1
[junit4] 2> 1320896 INFO (TEST-StatsReloadRaceTest.testParallelReloadAndStats-seed#[49C8C2382EBA0661]) [ ] o.a.s.h.a.CoreAdminOperation Checking request status for : 1
[junit4] 2> 1320896 INFO (TEST-StatsReloadRaceTest.testParallelReloadAndStats-seed#[49C8C2382EBA0661]) [ ] o.a.s.h.a.CoreAdminOperation Checking request status for : 1
[junit4] 2> 1320897 INFO (TEST-StatsReloadRaceTest.testParallelReloadAndStats-seed#[49C8C2382EBA0661]) [ ] o.a.s.h.a.CoreAdminOperation Checking request status for : 1
[junit4] 2> 1320897 INFO (TEST-StatsReloadRaceTest.testParallelReloadAndStats-seed#[49C8C2382EBA0661]) [ ] o.a.s.h.a.CoreAdminOperation Checking request status for : 1
[junit4] 2> 1320897 INFO (TEST-StatsReloadRaceTest.testParallelReloadAndStats-seed#[49C8C2382EBA0661]) [ ] o.a.s.h.a.CoreAdminOperation Checking request status for : 1
[junit4] 2> 1320898 INFO (TEST-StatsReloadRaceTest.testParallelReloadAndStats-seed#[49C8C2382EBA0661]) [ ] o.a.s.h.a.CoreAdminOperation Checking request status for : 1
[junit4] 2> 1320898 INFO (TEST-StatsReloadRaceTest.testParallelReloadAndStats-seed#[49C8C2382EBA0661]) [ ] o.a.s.h.a.CoreAdminOperation Checking request status for : 1
[junit4] 2> 1320898 INFO (TEST-StatsReloadRaceTest.testParallelReloadAndStats-seed#[49C8C2382EBA0661]) [ ] o.a.s.h.a.CoreAdminOperation Checking request status for : 1
[junit4] 2> 1320898 INFO (TEST-StatsReloadRaceTest.testParallelReloadAndStats-seed#[49C8C2382EBA0661]) [ ] o.a.s.h.a.CoreAdminOperation Checking request status for : 1
[junit4] 2> 1320899 INFO (TEST-StatsReloadRaceTest.testParallelReloadAndStats-seed#[49C8C2382EBA0661]) [ ] o.a.s.h.a.CoreAdminOperation Checking request status for : 1
[junit4] 2> 1320899 INFO (TEST-StatsReloadRaceTest.testParallelReloadAndStats-seed#[49C8C2382EBA0661]) [ ] o.a.s.h.a.CoreAdminOperation Checking request status for : 1
[junit4] 2> 1320899 INFO (TEST-StatsReloadRaceTest.testParallelReloadAndStats-seed#[49C8C2382EBA0661]) [ ] o.a.s.h.a.CoreAdminOperation Checking request status for : 1
[junit4] 2> 1320900 INFO (TEST-StatsReloadRaceTest.testParallelReloadAndStats-seed#[49C8C2382EBA0661]) [ ] o.a.s.h.a.CoreAdminOperation Checking request status for : 1
[junit4] 2> 1320900 INFO (TEST-StatsReloadRaceTest.testParallelReloadAndStats-seed#[49C8C2382EBA0661]) [ ] o.a.s.h.a.CoreAdminOperation Checking request status for : 1
[junit4] 2> 1320900 INFO (TEST-StatsReloadRaceTest.testParallelReloadAndStats-seed#[49C8C2382EBA0661]) [ ] o.a.s.h.a.CoreAdminOperation Checking request status for : 1
[junit4] 2> 1320901 INFO (TEST-StatsReloadRaceTest.testParallelReloadAndStats-seed#[49C8C2382EBA0661]) [ ] o.a.s.h.a.CoreAdminOperation Checking request status for : 1
[junit4] 2> 1320901 INFO (TEST-StatsReloadRaceTest.testParallelReloadAndStats-seed#[49C8C2382EBA0661]) [ ] o.a.s.h.a.CoreAdminOperation Checking request status for : 1
[junit4] 2> 1320901 INFO (TEST-StatsReloadRaceTest.testParallelReloadAndStats-seed#[49C8C2382EBA0661]) [ ] o.a.s.h.a.CoreAdminOperation Checking request status for : 1
[junit4] 2> 1320901 INFO (TEST-StatsReloadRaceTest.testParallelReloadAndStats-seed#[49C8C2382EBA0661]) [ ] o.a.s.h.a.CoreAdminOperation Checking request status for : 1
[junit4] 2> 1320902 INFO (TEST-StatsReloadRaceTest.testParallelReloadAndStats-seed#[49C8C2382EBA0661]) [ ] o.a.s.h.a.CoreAdminOperation Checking request status for : 1
[junit4] 2> 1320902 INFO (TEST-StatsReloadRaceTest.testParallelReloadAndStats-seed#[49C8C2382EBA0661]) [ ] o.a.s.h.a.CoreAdminOperation Checking request status for : 1
[junit4] 2> 1320903 INFO (TEST-StatsReloadRaceTest.testParallelReloadAndStats-seed#[49C8C2382EBA0661]) [ ] o.a.s.h.a.CoreAdminOperation Checking request status for : 1
[junit4] 2> 1320903 INFO (TEST-StatsReloadRaceTest.testParallelReloadAndStats-seed#[49C8C2382EBA0661]) [ ] o.a.s.h.a.CoreAdminOperation Checking request status for : 1
[junit4] 2> 1320954 INFO (TEST-StatsReloadRaceTest.testParallelReloadAndStats-seed#[49C8C2382EBA0661]) [ ] o.a.s.h.a.CoreAdminOperation Checking request status for : 1
[junit4] 2> 1320955 INFO (TEST-StatsReloadRaceTest.testParallelReloadAndStats-seed#[49C8C2382EBA0661]) [ ] o.a.s.h.a.CoreAdminOperation Checking request status for : 1
[junit4] 2> 1320955 INFO (TEST-StatsReloadRaceTest.testParallelReloadAndStats-seed#[49C8C2382EBA0661]) [ ] o.a.s.h.a.CoreAdminOperation Checking request status for : 1
[junit4] 2> 1320955 INFO (TEST-StatsReloadRaceTest.testParallelReloadAndStats-seed#[49C8C2382EBA0661]) [ ] o.a.s.h.a.CoreAdminOperation Checking request status for : 1
[junit4] 2> 1320956 INFO (TEST-StatsReloadRaceTest.testParallelReloadAndStats-seed#[49C8C2382EBA0661]) [ ] o.a.s.h.a.CoreAdminOperation Checking request status for : 1
[junit4] 2> 1320972 INFO (TEST-StatsReloadRaceTest.testParallelReloadAndStats-seed#[49C8C2382EBA0661]) [ ] o.a.s.h.a.CoreAdminOperation Checking request status for : 1
[junit4] 2> 1320973 INFO (TEST-StatsReloadRaceTest.testParallelReloadAndStats-seed#[49C8C2382EBA0661]) [ ] o.a.s.h.a.CoreAdminOperation Checking request status for : 1
[junit4] 2> 1320973 INFO (TEST-StatsReloadRaceTest.testParallelReloadAndStats-seed#[49C8C2382EBA0661]) [ ] o.a.s.h.a.CoreAdminOperation Checking request status for : 1
[junit4] 2> 1320974 INFO (TEST-StatsReloadRaceTest.testParallelReloadAndStats-seed#[49C8C2382EBA0661]) [ ] o.a.s.h.a.CoreAdminOperation Checking request status for : 1
[junit4] 2> 1320974 INFO (TEST-StatsReloadRaceTest.testParallelReloadAndStats-seed#[49C8C2382EBA0661]) [ ] o.a.s.h.a.CoreAdminOperation Checking request status for : 1
[junit4] 2> 1320974 INFO (TEST-StatsReloadRaceTest.testParallelReloadAndStats-seed#[49C8C2382EBA0661]) [ ] o.a.s.h.a.CoreAdminOperation Checking request status for : 1
[junit4] 2> 1320975 INFO (TEST-StatsReloadRaceTest.testParallelReloadAndStats-seed#[49C8C2382EBA0661]) [ ] o.a.s.h.a.CoreAdminOperation Checking request status for : 1
[junit4] 2> 1320975 INFO (TEST-StatsReloadRaceTest.testParallelReloadAndStats-seed#[49C8C2382EBA0661]) [ ] o.a.s.h.a.CoreAdminOperation Checking request status for : 1
[junit4] 2> 1320975 INFO (TEST-StatsReloadRaceTest.testParallelReloadAndStats-seed#[49C8C2382EBA0661]) [ ] o.a.s.h.a.CoreAdminOperation Checking request status for : 1
[junit4] 2> 1320976 INFO (TEST-StatsReloadRaceTest.testParallelReloadAndStats-seed#[49C8C2382EBA0661]) [ ] o.a.s.h.a.CoreAdminOperation Checking request status for : 1
[junit4] 2> 1320976 INFO (TEST-StatsReloadRaceTest.testParallelReloadAndStats-seed#[49C8C2382EBA0661]) [ ] o.a.s.h.a.CoreAdminOperation Checking request status for : 1
[junit4] 2> 1320988 INFO (TEST-StatsReloadRaceTest.testParallelReloadAndStats-seed#[49C8C2382EBA0661]) [ ] o.a.s.h.a.CoreAdminOperation Checking request status for : 1
[junit4] 2> 1320989 INFO (TEST-StatsReloadRaceTest.testParallelReloadAndStats-seed#[49C8C2382EBA0661]) [ ] o.a.s.h.a.CoreAdminOperation Checking request status for : 1
[junit4] 2> 1320989 INFO (TEST-StatsReloadRaceTest.testParallelReloadAndStats-seed#[49C8C2382EBA0661]) [ ] o.a.s.h.a.CoreAdminOperation Checking request status for : 1
[junit4] 2> 1320990 INFO (TEST-StatsReloadRaceTest.testParallelReloadAndStats-seed#[49C8C2382EBA0661]) [ ] o.a.s.h.a.CoreAdminOperation Checking request status for : 1
[junit4] 2> 1320990 INFO (TEST-StatsReloadRaceTest.testParallelReloadAndStats-seed#[49C8C2382EBA0661]) [ ] o.a.s.h.a.CoreAdminOperation Checking request status for : 1
[junit4] 2> 1320990 INFO (TEST-StatsReloadRaceTest.testParallelReloadAndStats-seed#[49C8C2382EBA0661]) [ ] o.a.s.h.a.CoreAdminOperation Checking request status for : 1
[junit4] 2> 1320991 INFO (TEST-StatsReloadRaceTest.testParallelReloadAndStats-seed#[49C8C2382EBA0661]) [ ] o.a.s.h.a.CoreAdminOperation Checking request status for : 1
[junit4] 2> 1321005 INFO (TEST-StatsReloadRaceTest.testParallelReloadAndStats-seed#[49C8C2382EBA0661]) [ ] o.a.s.h.a.CoreAdminOperation Checking request status for : 1
[junit4] 2> 1321005 INFO (TEST-StatsReloadRaceTest.testParallelReloadAndStats-seed#[49C8C2382EBA0661]) [ ] o.a.s.h.a.CoreAdminOperation Checking request status for : 1
[junit4] 2> 1321006 INFO (TEST-StatsReloadRaceTest.testParallelReloadAndStats-seed#[49C8C2382EBA0661]) [ ] o.a.s.h.a.CoreAdminOperation Checking request status for : 1
[junit4] 2> 1321006 INFO (TEST-StatsReloadRaceTest.testParallelReloadAndStats-seed#[49C8C2382EBA0661]) [ ] o.a.s.h.a.CoreAdminOperation Checking request status for : 1
[junit4] 2> 1321006 INFO (TEST-StatsReloadRaceTest.testParallelReloadAndStats-seed#[49C8C2382EBA0661]) [ ] o.a.s.h.a.CoreAdminOperation Checking request status for : 1
[junit4] 2> 1321007 INFO (TEST-StatsReloadRaceTest.testParallelReloadAndStats-seed#[49C8C2382EBA0661]) [ ] o.a.s.h.a.CoreAdminOperation Checking request status for : 1
[junit4] 2> 1321007 INFO (TEST-StatsReloadRaceTest.testParallelReloadAndStats-seed#[49C8C2382EBA0661]) [ ] o.a.s.h.a.CoreAdminOperation Checking request status for : 1
[junit4] 2> 1321007 INFO (TEST-StatsReloadRaceTest.testParallelReloadAndStats-seed#[49C8C2382EBA0661]) [ ] o.a.s.h.a.CoreAdminOperation Checking request status for : 1
[junit4] 2> 1321008 INFO (TEST-StatsReloadRaceTest.testParallelReloadAndStats-seed#[49C8C2382EBA0661]) [ ] o.a.s.h.a.CoreAdminOperation Checking request status for : 1
[junit4] 2> 1321008 INFO (TEST-StatsReloadRaceTest.testParallelReloadAndStats-seed#[49C8C2382EBA0661]) [ ] o.a.s.h.a.CoreAdminOperation Checking request status for : 1
[junit4] 2> 1321009 INFO (TEST-StatsReloadRaceTest.testParallelReloadAndStats-seed#[49C8C2382EBA0661]) [ ] o.a.s.h.a.CoreAdminOperation Checking request status for : 1
[junit4] 2> 1321009 INFO (TEST-StatsReloadRaceTest.testParallelReloadAndStats-seed#[49C8C2382EBA0661]) [ ] o.a.s.h.a.CoreAdminOperation Checking request status for : 1
[junit4] 2> 1321009 INFO (TEST-StatsReloadRaceTest.testParallelReloadAndStats-seed#[49C8C2382EBA0661]) [ ] o.a.s.h.a.CoreAdminOperation Checking request status for : 1
[junit4] 2> 1321010 INFO (TEST-StatsReloadRaceTest.testParallelReloadAndStats-seed#[49C8C2382EBA0661]) [ ] o.a.s.h.a.CoreAdminOperation Checking request status for : 1
[junit4] 2> 1321010 INFO (TEST-StatsReloadRaceTest.testParallelReloadAndStats-seed#[49C8C2382EBA0661]) [ ] o.a.s.h.a.CoreAdminOperation Checking request status for : 1
[junit4] 2> 1321010 INFO (TEST-StatsReloadRaceTest.testParallelReloadAndStats-seed#[49C8C2382EBA0661]) [ ] o.a.s.h.a.CoreAdminOperation Checking request status for : 1
[junit4] 2> 1321011 INFO (TEST-StatsReloadRaceTest.testParallelReloadAndStats-seed#[49C8C2382EBA0661]) [ ] o.a.s.h.a.CoreAdminOperation Checking request status for : 1
[junit4] 2> 1321011 INFO (TEST-StatsReloadRaceTest.testParallelReloadAndStats-seed#[49C8C2382EBA0661]) [ ] o.a.s.h.a.CoreAdminOperation Checking request status for : 1
[junit4] 2> 1321011 INFO (TEST-StatsReloadRaceTest.testParallelReloadAndStats-seed#[49C8C2382EBA0661]) [ ] o.a.s.h.a.CoreAdminOperation Checking request status for : 1
[junit4] 2> 1321012 INFO (TEST-StatsReloadRaceTest.testParallelReloadAndStats-seed#[49C8C2382EBA0661]) [ ] o.a.s.h.a.CoreAdminOperation Checking request status for : 1
[junit4] 2> 1321012 INFO (TEST-StatsReloadRaceTest.testParallelReloadAndStats-seed#[49C8C2382EBA0661]) [ ] o.a.s.h.a.CoreAdminOperation Checking request status for : 1
[junit4] 2> 1321013 INFO (TEST-StatsReloadRaceTest.testParallelReloadAndStats-seed#[49C8C2382EBA0661]) [ ] o.a.s.h.a.CoreAdminOperation Checking request status for : 1
[junit4] 2> 1321038 INFO (TEST-StatsReloadRaceTest.testParallelReloadAndStats-seed#[49C8C2382EBA0661]) [ ] o.a.s.h.a.CoreAdminOperation Checking request status for : 1
[junit4] 2> 1321038 INFO (TEST-StatsReloadRaceTest.testParallelReloadAndStats-seed#[49C8C2382EBA0661]) [ ] o.a.s.h.a.CoreAdminOperation Checking request status for : 1
[junit4] 2> 1321038 INFO (TEST-StatsReloadRaceTest.testParallelReloadAndStats-seed#[49C8C2382EBA0661]) [ ] o.a.s.h.a.CoreAdminOperation Checking request status for : 1
[junit4] 2> 1321039 INFO (TEST-StatsReloadRaceTest.testParallelReloadAndStats-seed#[49C8C2382EBA0661]) [ ] o.a.s.h.a.CoreAdminOperation Checking request status for : 1
[junit4] 2> 1321039 INFO (TEST-StatsReloadRaceTest.testParallelReloadAndStats-seed#[49C8C2382EBA0661]) [ ] o.a.s.h.a.CoreAdminOperation Checking request status for : 1
[junit4] 2> 1321039 INFO (TEST-StatsReloadRaceTest.testParallelReloadAndStats-seed#[49C8C2382EBA0661]) [ ] o.a.s.h.a.CoreAdminOperation Checking request status for : 1
[junit4] 2> 1321039 INFO (TEST-StatsReloadRaceTest.testParallelReloadAndStats-seed#[49C8C2382EBA0661]) [ ] o.a.s.h.a.CoreAdminOperation Checking request status for : 1
[junit4] 2> 1321040 INFO (TEST-StatsReloadRaceTest.testParallelReloadAndStats-seed#[49C8C2382EBA0661]) [ ] o.a.s.h.a.CoreAdminOperation Checking request status for : 1
[junit4] 2> 1321040 INFO (TEST-StatsReloadRaceTest.testParallelReloadAndStats-seed#[49C8C2382EBA0661]) [ ] o.a.s.h.a.CoreAdminOperation Checking request status for : 1
[junit4] 2> 1321040 INFO (TEST-StatsReloadRaceTest.testParallelReloadAndStats-seed#[49C8C2382EBA0661]) [ ] o.a.s.h.a.CoreAdminOperation Checking request status for : 1
[junit4] 2> 1321040 INFO (TEST-StatsReloadRaceTest.testParallelReloadAndStats-seed#[49C8C2382EBA0661]) [ ] o.a.s.h.a.CoreAdminOperation Checking request status for : 1
[junit4] 2> 1321041 INFO (TEST-StatsReloadRaceTest.testParallelReloadAndStats-seed#[49C8C2382EBA0661]) [ ] o.a.s.h.a.CoreAdminOperation Checking request status for : 1
[junit4] 2> 1321041 INFO (TEST-StatsReloadRaceTest.testParallelReloadAndStats-seed#[49C8C2382EBA0661]) [ ] o.a.s.h.a.CoreAdminOperation Checking request status for : 1
[junit4] 2> 1321054 INFO (TEST-StatsReloadRaceTest.testParallelReloadAndStats-seed#[49C8C2382EBA0661]) [ ] o.a.s.h.a.CoreAdminOperation Checking request status for : 1
[junit4] 2> 1321054 INFO (TEST-StatsReloadRaceTest.testParallelReloadAndStats-seed#[49C8C2382EBA0661]) [ ] o.a.s.h.a.CoreAdminOperation Checking request status for : 1
[junit4] 2> 1321054 INFO (TEST-StatsReloadRaceTest.testParallelReloadAndStats-seed#[49C8C2382EBA0661]) [ ] o.a.s.h.a.CoreAdminOperation Checking request status for : 1
[junit4] 2> 1321055 INFO (TEST-StatsReloadRaceTest.testParallelReloadAndStats-seed#[49C8C2382EBA0661]) [ ] o.a.s.h.a.CoreAdminOperation Checking request status for : 1
[junit4] 2> 1321055 INFO (TEST-StatsReloadRaceTest.testParallelReloadAndStats-seed#[49C8C2382EBA0661]) [ ] o.a.s.h.a.CoreAdminOperation Checking request status for : 1
[junit4] 2> 1321055 INFO (TEST-StatsReloadRaceTest.testParallelReloadAndStats-seed#[49C8C2382EBA0661]) [ ] o.a.s.h.a.CoreAdminOperation Checking request status for : 1
[junit4] 2> 1321056 INFO (TEST-StatsReloadRaceTest.testParallelReloadAndStats-seed#[49C8C2382EBA0661]) [ ] o.a.s.h.a.CoreAdminOperation Checking request status for : 1
[junit4] 2> 1321056 INFO (TEST-StatsReloadRaceTest.testParallelReloadAndStats-seed#[49C8C2382EBA0661]) [ ] o.a.s.h.a.CoreAdminOperation Checking request status for : 1
[junit4] 2> 1321056 INFO (TEST-StatsReloadRaceTest.testParallelReloadAndStats-seed#[49C8C2382EBA0661]) [ ] o.a.s.h.a.CoreAdminOperation Checking request status for : 1
[junit4] 2> 1321059 INFO (TEST-StatsReloadRaceTest.testParallelReloadAndStats-seed#[49C8C2382EBA0661]) [ ] o.a.s.h.a.CoreAdminOperation Checking request status for : 1
[junit4] 2> 1321060 INFO (TEST-StatsReloadRaceTest.testParallelReloadAndStats-seed#[49C8C2382EBA0661]) [ ] o.a.s.h.a.CoreAdminOperation Checking request status for : 1
[junit4] 2> 1321060 INFO (TEST-StatsReloadRaceTest.testParallelReloadAndStats-seed#[49C8C2382EBA0661]) [ ] o.a.s.h.a.CoreAdminOperation Checking request status for : 1
[junit4] 2> 1321060 INFO (TEST-StatsReloadRaceTest.testParallelReloadAndStats-seed#[49C8C2382EBA0661]) [ ] o.a.s.h.a.CoreAdminOperation Checking request status for : 1
[junit4] 2> 1321061 INFO (TEST-StatsReloadRaceTest.testParallelReloadAndStats-seed#[49C8C2382EBA0661]) [ ] o.a.s.h.a.CoreAdminOperation Checking request status for : 1
[junit4] 2> 1321061 INFO (TEST-StatsReloadRaceTest.testParallelReloadAndStats-seed#[49C8C2382EBA0661]) [ ] o.a.s.h.a.CoreAdminOperation Checking request status for : 1
[junit4] 2> 1321061 INFO (TEST-StatsReloadRaceTest.testParallelReloadAndStats-seed#[49C8C2382EBA0661]) [ ] o.a.s.h.a.CoreAdminOperation Checking request status for : 1
[junit4] 2> 1321082 INFO (TEST-StatsReloadRaceTest.testParallelReloadAndStats-seed#[49C8C2382EBA0661]) [ ] o.a.s.h.a.CoreAdminOperation Checking request status for : 1
[junit4] 2> 1321082 INFO (TEST-StatsReloadRaceTest.testParallelReloadAndStats-seed#[49C8C2382EBA0661]) [ ] o.a.s.h.a.CoreAdminOperation Checking request status for : 1
[junit4] 2> 1321083 INFO (TEST-StatsReloadRaceTest.testParallelReloadAndStats-seed#[49C8C2382EBA0661]) [ ] o.a.s.h.a.CoreAdminOperation Checking request status for : 1
[junit4] 2> 1321083 INFO (TEST-StatsReloadRaceTest.testParallelReloadAndStats-seed#[49C8C2382EBA0661]) [ ] o.a.s.h.a.CoreAdminOperation Checking request status for : 1
[junit4] 2> 1321083 INFO (TEST-StatsReloadRaceTest.testParallelReloadAndStats-seed#[49C8C2382EBA0661]) [ ] o.a.s.h.a.CoreAdminOperation Checking request status for : 1
[junit4] 2> 1321084 INFO (parallelCoreAdminExecutor-2906-thread-1-processing-x:collection1 1 RELOAD) [ x:collection1 ] o.a.s.s.IndexSchema Loaded schema test/1.0 with uniqueid field id
[junit4] 2> 1321084 INFO (TEST-StatsReloadRaceTest.testParallelReloadAndStats-seed#[49C8C2382EBA0661]) [ ] o.a.s.h.a.CoreAdminOperation Checking request status for : 1
[junit4] 2> 1321084 INFO (TEST-StatsReloadRaceTest.testParallelReloadAndStats-seed#[49C8C2382EBA0661]) [ ] o.a.s.h.a.CoreAdminOperation Checking request status for : 1
[junit4] 2> 1321085 INFO (TEST-StatsReloadRaceTest.testParallelReloadAndStats-seed#[49C8C2382EBA0661]) [ ] o.a.s.h.a.CoreAdminOperation Checking request status for : 1
[junit4] 2> 1321085 INFO (TEST-StatsReloadRaceTest.testParallelReloadAndStats-seed#[49C8C2382EBA0661]) [ ] o.a.s.h.a.CoreAdminOperation Checking request status for : 1
[junit4] 2> 1321085 INFO (TEST-StatsReloadRaceTest.testParallelReloadAndStats-seed#[49C8C2382EBA0661]) [ ] o.a.s.h.a.CoreAdminOperation Checking request status for : 1
[junit4] 2> 1321098 INFO (TEST-StatsReloadRaceTest.testParallelReloadAndStats-seed#[49C8C2382EBA0661]) [ ] o.a.s.h.a.CoreAdminOperation Checking request status for : 1
[junit4] 2> 1321100 INFO (TEST-StatsReloadRaceTest.testParallelReloadAndStats-seed#[49C8C2382EBA0661]) [ ] o.a.s.h.a.CoreAdminOperation Checking request status for : 1
[junit4] 2> 1321100 INFO (TEST-StatsReloadRaceTest.testParallelReloadAndStats-seed#[49C8C2382EBA0661]) [ ] o.a.s.h.a.CoreAdminOperation Checking request status for : 1
[junit4] 2> 1321100 INFO (TEST-StatsReloadRaceTest.testParallelReloadAndStats-seed#[49C8C2382EBA0661]) [ ] o.a.s.h.a.CoreAdminOperation Checking request status for : 1
[junit4] 2> 1321101 INFO (TEST-StatsReloadRaceTest.testParallelReloadAndStats-seed#[49C8C2382EBA0661]) [ ] o.a.s.h.a.CoreAdminOperation Checking request status for : 1
[junit4] 2> 1321101 INFO (TEST-StatsReloadRaceTest.testParallelReloadAndStats-seed#[49C8C2382EBA0661]) [ ] o.a.s.h.a.CoreAdminOperation Checking request status for : 1
[junit4] 2> 1321101 INFO (TEST-StatsReloadRaceTest.testParallelReloadAndStats-seed#[49C8C2382EBA0661]) [ ] o.a.s.h.a.CoreAdminOperation Checking request status for : 1
[junit4] 2> 1321101 INFO (TEST-StatsReloadRaceTest.testParallelReloadAndStats-seed#[49C8C2382EBA0661]) [ ] o.a.s.h.a.CoreAdminOperation Checking request status for : 1
[junit4] 2> 1321102 INFO (TEST-StatsReloadRaceTest.testParallelReloadAndStats-seed#[49C8C2382EBA0661]) [ ] o.a.s.h.a.CoreAdminOperation Checking request status for : 1
[junit4] 2> 1321115 INFO (parallelCoreAdminExecutor-2906-thread-1-processing-x:collection1 1 RELOAD) [ x:collection1 ] o.a.s.c.CoreContainer Reloading SolrCore 'collection1' using configuration from instancedir /home/jenkins/jenkins-slave/workspace/Lucene-Solr-Tests-8.x/solr/core/src/test-files/solr/collection1
[junit4] 2> 1321118 INFO (TEST-StatsReloadRaceTest.testParallelReloadAndStats-seed#[49C8C2382EBA0661]) [ ] o.a.s.h.a.CoreAdminOperation Checking request status for : 1
[junit4] 2> 1321119 INFO (TEST-StatsReloadRaceTest.testParallelReloadAndStats-seed#[49C8C2382EBA0661]) [ ] o.a.s.h.a.CoreAdminOperation Checking request status for : 1
[junit4] 2> 1321119 INFO (TEST-StatsReloadRaceTest.testParallelReloadAndStats-seed#[49C8C2382EBA0661]) [ ] o.a.s.h.a.CoreAdminOperation Checking request status for : 1
[junit4] 2> 1321119 INFO (TEST-StatsReloadRaceTest.testParallelReloadAndStats-seed#[49C8C2382EBA0661]) [ ] o.a.s.h.a.CoreAdminOperation Checking request status for : 1
[junit4] 2> 1321119 INFO (TEST-StatsReloadRaceTest.testParallelReloadAndStats-seed#[49C8C2382EBA0661]) [ ] o.a.s.h.a.CoreAdminOperation Checking request status for : 1
[junit4] 2> 1321120 INFO (TEST-StatsReloadRaceTest.testParallelReloadAndStats-seed#[49C8C2382EBA0661]) [ ] o.a.s.h.a.CoreAdminOperation Checking request status for : 1
[junit4] 2> 1321120 INFO (TEST-StatsReloadRaceTest.testParallelReloadAndStats-seed#[49C8C2382EBA0661]) [ ] o.a.s.h.a.CoreAdminOperation Checking request status for : 1
[junit4] 2> 1321120 INFO (TEST-StatsReloadRaceTest.testParallelReloadAndStats-seed#[49C8C2382EBA0661]) [ ] o.a.s.h.a.CoreAdminOperation Checking request status for : 1
[junit4] 2> 1321121 INFO (TEST-StatsReloadRaceTest.testParallelReloadAndStats-seed#[49C8C2382EBA0661]) [ ] o.a.s.h.a.CoreAdminOperation Checking request status for : 1
[junit4] 2> 1321121 INFO (TEST-StatsReloadRaceTest.testParallelReloadAndStats-seed#[49C8C2382EBA0661]) [ ] o.a.s.h.a.CoreAdminOperation Checking request status for : 1
[junit4] 2> 1321121 INFO (TEST-StatsReloadRaceTest.testParallelReloadAndStats-seed#[49C8C2382EBA0661]) [ ] o.a.s.h.a.CoreAdminOperation Checking request status for : 1
[junit4] 2> 1321122 INFO (TEST-StatsReloadRaceTest.testParallelReloadAndStats-seed#[49C8C2382EBA0661]) [ ] o.a.s.h.a.CoreAdminOperation Checking request status for : 1
[junit4] 2> 1321134 INFO (TEST-StatsReloadRaceTest.testParallelReloadAndStats-seed#[49C8C2382EBA0661]) [ ] o.a.s.h.a.CoreAdminOperation Checking request status for : 1
[junit4] 2> 1321135 INFO (TEST-StatsReloadRaceTest.testParallelReloadAndStats-seed#[49C8C2382EBA0661]) [ ] o.a.s.h.a.CoreAdminOperation Checking request status for : 1
[junit4] 2> 1321135 INFO (TEST-StatsReloadRaceTest.testParallelReloadAndStats-seed#[49C8C2382EBA0661]) [ ] o.a.s.h.a.CoreAdminOperation Checking request status for : 1
[junit4] 2> 1321135 INFO (TEST-StatsReloadRaceTest.testParallelReloadAndStats-seed#[49C8C2382EBA0661]) [ ] o.a.s.h.a.CoreAdminOperation Checking request status for : 1
[junit4] 2> 1321136 INFO (TEST-StatsReloadRaceTest.testParallelReloadAndStats-seed#[49C8C2382EBA0661]) [ ] o.a.s.h.a.CoreAdminOperation Checking request status for : 1
[junit4] 2> 1321136 INFO (TEST-StatsReloadRaceTest.testParallelReloadAndStats-seed#[49C8C2382EBA0661]) [ ] o.a.s.h.a.CoreAdminOperation Checking request status for : 1
[junit4] 2> 1321136 INFO (TEST-StatsReloadRaceTest.testParallelReloadAndStats-seed#[49C8C2382EBA0661]) [ ] o.a.s.h.a.CoreAdminOperation Checking request status for : 1
[junit4] 2> 1321136 INFO (TEST-StatsReloadRaceTest.testParallelReloadAndStats-seed#[49C8C2382EBA0661]) [ ] o.a.s.h.a.CoreAdminOperation Checking request status for : 1
[junit4] 2> 1321137 INFO (TEST-StatsReloadRaceTest.testParallelReloadAndStats-seed#[49C8C2382EBA0661]) [ ] o.a.s.h.a.CoreAdminOperation Checking request status for : 1
[junit4] 2> 1321137 INFO (TEST-StatsReloadRaceTest.testParallelReloadAndStats-seed#[49C8C2382EBA0661]) [ ] o.a.s.h.a.CoreAdminOperation Checking request status for : 1
[junit4] 2> 1321163 INFO (TEST-StatsReloadRaceTest.testParallelReloadAndStats-seed#[49C8C2382EBA0661]) [ ] o.a.s.h.a.CoreAdminOperation Checking request status for : 1
[junit4] 2> 1321163 INFO (TEST-StatsReloadRaceTest.testParallelReloadAndStats-seed#[49C8C2382EBA0661]) [ ] o.a.s.h.a.CoreAdminOperation Checking request status for : 1
[junit4] 2> 1321163 INFO (TEST-StatsReloadRaceTest.testParallelReloadAndStats-seed#[49C8C2382EBA0661]) [ ] o.a.s.h.a.CoreAdminOperation Checking request status for : 1
[junit4] 2> 1321164 INFO (TEST-StatsReloadRaceTest.testParallelReloadAndStats-seed#[49C8C2382EBA0661]) [ ] o.a.s.h.a.CoreAdminOperation Checking request status for : 1
[junit4] 2> 1321164 INFO (TEST-StatsReloadRaceTest.testParallelReloadAndStats-seed#[49C8C2382EBA0661]) [ ] o.a.s.h.a.CoreAdminOperation Checking request status for : 1
[junit4] 2> 1321164 INFO (TEST-StatsReloadRaceTest.testParallelReloadAndStats-seed#[49C8C2382EBA0661]) [ ] o.a.s.h.a.CoreAdminOperation Checking request status for : 1
[junit4] 2> 1321165 INFO (TEST-StatsReloadRaceTest.testParallelReloadAndStats-seed#[49C8C2382EBA0661]) [ ] o.a.s.h.a.CoreAdminOperation Checking request status for : 1
[junit4] 2> 1321165 INFO (TEST-StatsReloadRaceTest.testParallelReloadAndStats-seed#[49C8C2382EBA0661]) [ ] o.a.s.h.a.CoreAdminOperation Checking request status for : 1
[junit4] 2> 1321165 INFO (TEST-StatsReloadRaceTest.testParallelReloadAndStats-seed#[49C8C2382EBA0661]) [ ] o.a.s.h.a.CoreAdminOperation Checking request status for : 1
[junit4] 2> 1321165 INFO (TEST-StatsReloadRaceTest.testParallelReloadAndStats-seed#[49C8C2382EBA0661]) [ ] o.a.s.h.a.CoreAdminOperation Checking request status for : 1
[junit4] 2> 1321166 INFO (TEST-StatsReloadRaceTest.testParallelReloadAndStats-seed#[49C8C2382EBA0661]) [ ] o.a.s.h.a.CoreAdminOperation Checking request status for : 1
[junit4] 2> 1321166 INFO (TEST-StatsReloadRaceTest.testParallelReloadAndStats-seed#[49C8C2382EBA0661]) [ ] o.a.s.h.a.CoreAdminOperation Checking request status for : 1
[junit4] 2> 1321184 INFO (TEST-StatsReloadRaceTest.testParallelReloadAndStats-seed#[49C8C2382EBA0661]) [ ] o.a.s.h.a.CoreAdminOperation Checking request status for : 1
[junit4] 2> 1321184 INFO (TEST-StatsReloadRaceTest.testParallelReloadAndStats-seed#[49C8C2382EBA0661]) [ ] o.a.s.h.a.CoreAdminOperation Checking request status for : 1
[junit4] 2> 1321185 INFO (TEST-StatsReloadRaceTest.testParallelReloadAndStats-seed#[49C8C2382EBA0661]) [ ] o.a.s.h.a.CoreAdminOperation Checking request status for : 1
[junit4] 2> 1321185 INFO (TEST-StatsReloadRaceTest.testParallelReloadAndStats-seed#[49C8C2382EBA0661]) [ ] o.a.s.h.a.CoreAdminOperation Checking request status for : 1
[junit4] 2> 1321185 INFO (TEST-StatsReloadRaceTest.testParallelReloadAndStats-seed#[49C8C2382EBA0661]) [ ] o.a.s.h.a.CoreAdminOperation Checking request status for : 1
[junit4] 2> 1321186 INFO (TEST-StatsReloadRaceTest.testParallelReloadAndStats-seed#[49C8C2382EBA0661]) [ ] o.a.s.h.a.CoreAdminOperation Checking request status for : 1
[junit4] 2> 1321186 INFO (TEST-StatsReloadRaceTest.testParallelReloadAndStats-seed#[49C8C2382EBA0661]) [ ] o.a.s.h.a.CoreAdminOperation Checking request status for : 1
[junit4] 2> 1321186 INFO (TEST-StatsReloadRaceTest.testParallelReloadAndStats-seed#[49C8C2382EBA0661]) [ ] o.a.s.h.a.CoreAdminOperation Checking request status for : 1
[junit4] 2> 1321187 INFO (TEST-StatsReloadRaceTest.testParallelReloadAndStats-seed#[49C8C2382EBA0661]) [ ] o.a.s.h.a.CoreAdminOperation Checking request status for : 1
[junit4] 2> 1321203 INFO (TEST-StatsReloadRaceTest.testParallelReloadAndStats-seed#[49C8C2382EBA0661]) [ ] o.a.s.h.a.CoreAdminOperation Checking request status for : 1
[junit4] 2> 1321204 INFO (TEST-StatsReloadRaceTest.testParallelReloadAndStats-seed#[49C8C2382EBA0661]) [ ] o.a.s.h.a.CoreAdminOperation Checking request status for : 1
[junit4] 2> 1321204 INFO (TEST-StatsReloadRaceTest.testParallelReloadAndStats-seed#[49C8C2382EBA0661]) [ ] o.a.s.h.a.CoreAdminOperation Checking request status for : 1
[junit4] 2> 1321204 INFO (TEST-StatsReloadRaceTest.testParallelReloadAndStats-seed#[49C8C2382EBA0661]) [ ] o.a.s.h.a.CoreAdminOperation Checking request status for : 1
[junit4] 2> 1321204 INFO (TEST-StatsReloadRaceTest.testParallelReloadAndStats-seed#[49C8C2382EBA0661]) [ ] o.a.s.h.a.CoreAdminOperation Checking request status for : 1
[junit4] 2> 1321205 INFO (TEST-StatsReloadRaceTest.testParallelReloadAndStats-seed#[49C8C2382EBA0661]) [ ] o.a.s.h.a.CoreAdminOperation Checking request status for : 1
[junit4] 2> 1321205 INFO (TEST-StatsReloadRaceTest.testParallelReloadAndStats-seed#[49C8C2382EBA0661]) [ ] o.a.s.h.a.CoreAdminOperation Checking request status for : 1
[junit4] 2> 1321205 INFO (TEST-StatsReloadRaceTest.testParallelReloadAndStats-seed#[49C8C2382EBA0661]) [ ] o.a.s.h.a.CoreAdminOperation Checking request status for : 1
[junit4] 2> 1321205 INFO (TEST-StatsReloadRaceTest.testParallelReloadAndStats-seed#[49C8C2382EBA0661]) [ ] o.a.s.h.a.CoreAdminOperation Checking request status for : 1
[junit4] 2> 1321206 INFO (TEST-StatsReloadRaceTest.testParallelReloadAndStats-seed#[49C8C2382EBA0661]) [ ] o.a.s.h.a.CoreAdminOperation Checking request status for : 1
[junit4] 2> 1321206 INFO (TEST-StatsReloadRaceTest.testParallelReloadAndStats-seed#[49C8C2382EBA0661]) [ ] o.a.s.h.a.CoreAdminOperation Checking request status for : 1
[junit4] 2> 1321206 INFO (TEST-StatsReloadRaceTest.testParallelReloadAndStats-seed#[49C8C2382EBA0661]) [ ] o.a.s.h.a.CoreAdminOperation Checking request status for : 1
[junit4] 2> 1321206 INFO (TEST-StatsReloadRaceTest.testParallelReloadAndStats-seed#[49C8C2382EBA0661]) [ ] o.a.s.h.a.CoreAdminOperation Checking request status for : 1
[junit4] 2> 1321207 INFO (TEST-StatsReloadRaceTest.testParallelReloadAndStats-seed#[49C8C2382EBA0661]) [ ] o.a.s.h.a.CoreAdminOperation Checking request status for : 1
[junit4] 2> 1321220 INFO (TEST-StatsReloadRaceTest.testParallelReloadAndStats-seed#[49C8C2382EBA0661]) [ ] o.a.s.h.a.CoreAdminOperation Checking request status for : 1
[junit4] 2> 1321220 INFO (TEST-StatsReloadRaceTest.testParallelReloadAndStats-seed#[49C8C2382EBA0661]) [ ] o.a.s.h.a.CoreAdminOperation Checking request status for : 1
[junit4] 2> 1321220 INFO (TEST-StatsReloadRaceTest.testParallelReloadAndStats-seed#[49C8C2382EBA0661]) [ ] o.a.s.h.a.CoreAdminOperation Checking request status for : 1
[junit4] 2> 1321220 INFO (TEST-StatsReloadRaceTest.testParallelReloadAndStats-seed#[49C8C2382EBA0661]) [ ] o.a.s.h.a.CoreAdminOperation Checking request status for : 1
[junit4] 2> 1321220 INFO (TEST-StatsReloadRaceTest.testParallelReloadAndStats-seed#[49C8C2382EBA0661]) [ ] o.a.s.h.a.CoreAdminOperation Checking request status for : 1
[junit4] 2> 1321221 INFO (TEST-StatsReloadRaceTest.testParallelReloadAndStats-seed#[49C8C2382EBA0661]) [ ] o.a.s.h.a.CoreAdminOperation Checking request status for : 1
[junit4] 2> 1321221 INFO (TEST-StatsReloadRaceTest.testParallelReloadAndStats-seed#[49C8C2382EBA0661]) [ ] o.a.s.h.a.CoreAdminOperation Checking request status for : 1
[junit4] 2> 1321221 INFO (TEST-StatsReloadRaceTest.testParallelReloadAndStats-seed#[49C8C2382EBA0661]) [ ] o.a.s.h.a.CoreAdminOperation Checking request status for : 1
[junit4] 2> 1321222 INFO (TEST-StatsReloadRaceTest.testParallelReloadAndStats-seed#[49C8C2382EBA0661]) [ ] o.a.s.h.a.CoreAdminOperation Checking request status for : 1
[junit4] 2> 1321222 INFO (TEST-StatsReloadRaceTest.testParallelReloadAndStats-seed#[49C8C2382EBA0661]) [ ] o.a.s.h.a.CoreAdminOperation Checking request status for : 1
[junit4] 2> 1321222 INFO (TEST-StatsReloadRaceTest.testParallelReloadAndStats-seed#[49C8C2382EBA0661]) [ ] o.a.s.h.a.CoreAdminOperation Checking request status for : 1
[junit4] 2> 1321222 INFO (TEST-StatsReloadRaceTest.testParallelReloadAndStats-seed#[49C8C2382EBA0661]) [ ] o.a.s.h.a.CoreAdminOperation Checking request status for : 1
[junit4] 2> 1321223 INFO (TEST-StatsReloadRaceTest.testParallelReloadAndStats-seed#[49C8C2382EBA0661]) [ ] o.a.s.h.a.CoreAdminOperation Checking request status for : 1
[junit4] 2> 1321226 INFO (parallelCoreAdminExecutor-2906-thread-1-processing-x:collection1 1 RELOAD) [ x:collection1 ] o.a.s.m.r.SolrJmxReporter JMX monitoring for 'solr.core.collection1' (registry 'solr.core.collection1') enabled at server: com.sun.jmx.mbeanserver.JmxMBeanServer@617ea053
[junit4] 2> 1321226 INFO (parallelCoreAdminExecutor-2906-thread-1-processing-x:collection1 1 RELOAD) [ x:collection1 ] o.a.s.c.SolrCore [[collection1] ] Opening new SolrCore at [/home/jenkins/jenkins-slave/workspace/Lucene-Solr-Tests-8.x/solr/core/src/test-files/solr/collection1], dataDir=[/home/jenkins/jenkins-slave/workspace/Lucene-Solr-Tests-8.x/solr/build/solr-core/test/J2/temp/solr.handler.admin.StatsReloadRaceTest_49C8C2382EBA0661-001/data-dir-88-001/]
[junit4] 2> 1321240 INFO (TEST-StatsReloadRaceTest.testParallelReloadAndStats-seed#[49C8C2382EBA0661]) [ ] o.a.s.h.a.CoreAdminOperation Checking request status for : 1
[junit4] 2> 1321240 INFO (TEST-StatsReloadRaceTest.testParallelReloadAndStats-seed#[49C8C2382EBA0661]) [ ] o.a.s.h.a.CoreAdminOperation Checking request status for : 1
[junit4] 2> 1321240 INFO (TEST-StatsReloadRaceTest.testParallelReloadAndStats-seed#[49C8C2382EBA0661]) [ ] o.a.s.h.a.CoreAdminOperation Checking request status for : 1
[junit4] 2> 1321240 INFO (TEST-StatsReloadRaceTest.testParallelReloadAndStats-seed#[49C8C2382EBA0661]) [ ] o.a.s.h.a.CoreAdminOperation Checking request status for : 1
[junit4] 2> 1321241 INFO (TEST-StatsReloadRaceTest.testParallelReloadAndStats-seed#[49C8C2382EBA0661]) [ ] o.a.s.h.a.CoreAdminOperation Checking request status for : 1
[junit4] 2> 1321241 INFO (TEST-StatsReloadRaceTest.testParallelReloadAndStats-seed#[49C8C2382EBA0661]) [ ] o.a.s.h.a.CoreAdminOperation Checking request status for : 1
[junit4] 2> 1321241 INFO (TEST-StatsReloadRaceTest.testParallelReloadAndStats-seed#[49C8C2382EBA0661]) [ ] o.a.s.h.a.CoreAdminOperation Checking request status for : 1
[junit4] 2> 1321241 INFO (TEST-StatsReloadRaceTest.testParallelReloadAndStats-seed#[49C8C2382EBA0661]) [ ] o.a.s.h.a.CoreAdminOperation Checking req
[...truncated too long message...]
tings :: file = /home/jenkins/jenkins-slave/workspace/Lucene-Solr-Tests-8.x/lucene/top-level-ivy-settings.xml
resolve:
ivy-availability-check:
[loadresource] Do not set property disallowed.ivy.jars.list as its length is 0.
-ivy-fail-disallowed-ivy-version:
ivy-fail:
ivy-configure:
[ivy:configure] :: loading settings :: file = /home/jenkins/jenkins-slave/workspace/Lucene-Solr-Tests-8.x/lucene/top-level-ivy-settings.xml
resolve:
ivy-availability-check:
[loadresource] Do not set property disallowed.ivy.jars.list as its length is 0.
-ivy-fail-disallowed-ivy-version:
ivy-fail:
ivy-fail:
ivy-configure:
[ivy:configure] :: loading settings :: file = /home/jenkins/jenkins-slave/workspace/Lucene-Solr-Tests-8.x/lucene/top-level-ivy-settings.xml
resolve:
ivy-availability-check:
[loadresource] Do not set property disallowed.ivy.jars.list as its length is 0.
-ivy-fail-disallowed-ivy-version:
ivy-fail:
ivy-configure:
[ivy:configure] :: loading settings :: file = /home/jenkins/jenkins-slave/workspace/Lucene-Solr-Tests-8.x/lucene/top-level-ivy-settings.xml
resolve:
ivy-availability-check:
[loadresource] Do not set property disallowed.ivy.jars.list as its length is 0.
-ivy-fail-disallowed-ivy-version:
ivy-fail:
ivy-fail:
ivy-configure:
[ivy:configure] :: loading settings :: file = /home/jenkins/jenkins-slave/workspace/Lucene-Solr-Tests-8.x/lucene/top-level-ivy-settings.xml
resolve:
ivy-availability-check:
[loadresource] Do not set property disallowed.ivy.jars.list as its length is 0.
-ivy-fail-disallowed-ivy-version:
ivy-fail:
ivy-fail:
ivy-configure:
[ivy:configure] :: loading settings :: file = /home/jenkins/jenkins-slave/workspace/Lucene-Solr-Tests-8.x/lucene/top-level-ivy-settings.xml
resolve:
ivy-availability-check:
[loadresource] Do not set property disallowed.ivy.jars.list as its length is 0.
-ivy-fail-disallowed-ivy-version:
ivy-fail:
ivy-fail:
ivy-configure:
[ivy:configure] :: loading settings :: file = /home/jenkins/jenkins-slave/workspace/Lucene-Solr-Tests-8.x/lucene/top-level-ivy-settings.xml
resolve:
ivy-availability-check:
[loadresource] Do not set property disallowed.ivy.jars.list as its length is 0.
-ivy-fail-disallowed-ivy-version:
ivy-fail:
ivy-fail:
ivy-configure:
[ivy:configure] :: loading settings :: file = /home/jenkins/jenkins-slave/workspace/Lucene-Solr-Tests-8.x/lucene/top-level-ivy-settings.xml
resolve:
ivy-availability-check:
[loadresource] Do not set property disallowed.ivy.jars.list as its length is 0.
-ivy-fail-disallowed-ivy-version:
ivy-fail:
ivy-fail:
ivy-configure:
[ivy:configure] :: loading settings :: file = /home/jenkins/jenkins-slave/workspace/Lucene-Solr-Tests-8.x/lucene/top-level-ivy-settings.xml
resolve:
ivy-availability-check:
[loadresource] Do not set property disallowed.ivy.jars.list as its length is 0.
-ivy-fail-disallowed-ivy-version:
ivy-fail:
ivy-fail:
ivy-configure:
[ivy:configure] :: loading settings :: file = /home/jenkins/jenkins-slave/workspace/Lucene-Solr-Tests-8.x/lucene/top-level-ivy-settings.xml
resolve:
ivy-availability-check:
[loadresource] Do not set property disallowed.ivy.jars.list as its length is 0.
-ivy-fail-disallowed-ivy-version:
ivy-fail:
ivy-fail:
ivy-configure:
[ivy:configure] :: loading settings :: file = /home/jenkins/jenkins-slave/workspace/Lucene-Solr-Tests-8.x/lucene/top-level-ivy-settings.xml
resolve:
ivy-availability-check:
[loadresource] Do not set property disallowed.ivy.jars.list as its length is 0.
-ivy-fail-disallowed-ivy-version:
ivy-fail:
ivy-fail:
ivy-configure:
[ivy:configure] :: loading settings :: file = /home/jenkins/jenkins-slave/workspace/Lucene-Solr-Tests-8.x/lucene/top-level-ivy-settings.xml
resolve:
ivy-availability-check:
[loadresource] Do not set property disallowed.ivy.jars.list as its length is 0.
-ivy-fail-disallowed-ivy-version:
ivy-fail:
ivy-fail:
ivy-configure:
[ivy:configure] :: loading settings :: file = /home/jenkins/jenkins-slave/workspace/Lucene-Solr-Tests-8.x/lucene/top-level-ivy-settings.xml
resolve:
ivy-availability-check:
[loadresource] Do not set property disallowed.ivy.jars.list as its length is 0.
-ivy-fail-disallowed-ivy-version:
ivy-fail:
ivy-fail:
ivy-configure:
[ivy:configure] :: loading settings :: file = /home/jenkins/jenkins-slave/workspace/Lucene-Solr-Tests-8.x/lucene/top-level-ivy-settings.xml
resolve:
ivy-availability-check:
[loadresource] Do not set property disallowed.ivy.jars.list as its length is 0.
-ivy-fail-disallowed-ivy-version:
ivy-fail:
ivy-fail:
ivy-configure:
[ivy:configure] :: loading settings :: file = /home/jenkins/jenkins-slave/workspace/Lucene-Solr-Tests-8.x/lucene/top-level-ivy-settings.xml
resolve:
jar-checksums:
[mkdir] Created dir: /home/jenkins/jenkins-slave/workspace/Lucene-Solr-Tests-8.x/solr/null964128434
[copy] Copying 249 files to /home/jenkins/jenkins-slave/workspace/Lucene-Solr-Tests-8.x/solr/null964128434
[delete] Deleting directory /home/jenkins/jenkins-slave/workspace/Lucene-Solr-Tests-8.x/solr/null964128434
check-working-copy:
[ivy:cachepath] :: resolving dependencies :: #;working@lucene2-us-west.apache.org
[ivy:cachepath] confs: [default]
[ivy:cachepath] found org.eclipse.jgit#org.eclipse.jgit;5.3.0.201903130848-r in public
[ivy:cachepath] found com.jcraft#jsch;0.1.54 in public
[ivy:cachepath] found com.jcraft#jzlib;1.1.1 in public
[ivy:cachepath] found com.googlecode.javaewah#JavaEWAH;1.1.6 in public
[ivy:cachepath] found org.slf4j#slf4j-api;1.7.2 in public
[ivy:cachepath] found org.bouncycastle#bcpg-jdk15on;1.60 in public
[ivy:cachepath] found org.bouncycastle#bcprov-jdk15on;1.60 in public
[ivy:cachepath] found org.bouncycastle#bcpkix-jdk15on;1.60 in public
[ivy:cachepath] found org.slf4j#slf4j-nop;1.7.2 in public
[ivy:cachepath] :: resolution report :: resolve 20ms :: artifacts dl 2ms
---------------------------------------------------------------------
| | modules || artifacts |
| conf | number| search|dwnlded|evicted|| number|dwnlded|
---------------------------------------------------------------------
| default | 9 | 0 | 0 | 0 || 9 | 0 |
---------------------------------------------------------------------
[wc-checker] Initializing working copy...
[wc-checker] Checking working copy status...
-jenkins-base:
BUILD SUCCESSFUL
Total time: 186 minutes 25 seconds
Archiving artifacts
java.lang.InterruptedException: no matches found within 10000
at hudson.FilePath$ValidateAntFileMask.hasMatch(FilePath.java:2847)
at hudson.FilePath$ValidateAntFileMask.invoke(FilePath.java:2726)
at hudson.FilePath$ValidateAntFileMask.invoke(FilePath.java:2707)
at hudson.FilePath$FileCallableWrapper.call(FilePath.java:3086)
Also: hudson.remoting.Channel$CallSiteStackTrace: Remote call to lucene2
at hudson.remoting.Channel.attachCallSiteStackTrace(Channel.java:1741)
at hudson.remoting.UserRequest$ExceptionResponse.retrieve(UserRequest.java:357)
at hudson.remoting.Channel.call(Channel.java:955)
at hudson.FilePath.act(FilePath.java:1072)
at hudson.FilePath.act(FilePath.java:1061)
at hudson.FilePath.validateAntFileMask(FilePath.java:2705)
at hudson.tasks.ArtifactArchiver.perform(ArtifactArchiver.java:243)
at hudson.tasks.BuildStepCompatibilityLayer.perform(BuildStepCompatibilityLayer.java:81)
at hudson.tasks.BuildStepMonitor$1.perform(BuildStepMonitor.java:20)
at hudson.model.AbstractBuild$AbstractBuildExecution.perform(AbstractBuild.java:744)
at hudson.model.AbstractBuild$AbstractBuildExecution.performAllBuildSteps(AbstractBuild.java:690)
at hudson.model.Build$BuildExecution.post2(Build.java:186)
at hudson.model.AbstractBuild$AbstractBuildExecution.post(AbstractBuild.java:635)
at hudson.model.Run.execute(Run.java:1835)
at hudson.model.FreeStyleBuild.run(FreeStyleBuild.java:43)
at hudson.model.ResourceController.execute(ResourceController.java:97)
at hudson.model.Executor.run(Executor.java:429)
Caused: hudson.FilePath$TunneledInterruptedException
at hudson.FilePath$FileCallableWrapper.call(FilePath.java:3088)
at hudson.remoting.UserRequest.perform(UserRequest.java:212)
at hudson.remoting.UserRequest.perform(UserRequest.java:54)
at hudson.remoting.Request$2.run(Request.java:369)
at hudson.remoting.InterceptingExecutorService$1.call(InterceptingExecutorService.java:72)
at java.util.concurrent.FutureTask.run(FutureTask.java:266)
at java.util.concurrent.ThreadPoolExecutor.runWorker(ThreadPoolExecutor.java:1142)
at java.util.concurrent.ThreadPoolExecutor$Worker.run(ThreadPoolExecutor.java:617)
at java.lang.Thread.run(Thread.java:748)
Caused: java.lang.InterruptedException: java.lang.InterruptedException: no matches found within 10000
at hudson.FilePath.act(FilePath.java:1074)
at hudson.FilePath.act(FilePath.java:1061)
at hudson.FilePath.validateAntFileMask(FilePath.java:2705)
at hudson.tasks.ArtifactArchiver.perform(ArtifactArchiver.java:243)
at hudson.tasks.BuildStepCompatibilityLayer.perform(BuildStepCompatibilityLayer.java:81)
at hudson.tasks.BuildStepMonitor$1.perform(BuildStepMonitor.java:20)
at hudson.model.AbstractBuild$AbstractBuildExecution.perform(AbstractBuild.java:744)
at hudson.model.AbstractBuild$AbstractBuildExecution.performAllBuildSteps(AbstractBuild.java:690)
at hudson.model.Build$BuildExecution.post2(Build.java:186)
at hudson.model.AbstractBuild$AbstractBuildExecution.post(AbstractBuild.java:635)
at hudson.model.Run.execute(Run.java:1835)
at hudson.model.FreeStyleBuild.run(FreeStyleBuild.java:43)
at hudson.model.ResourceController.execute(ResourceController.java:97)
at hudson.model.Executor.run(Executor.java:429)
No artifacts found that match the file pattern "**/*.events,heapdumps/**,**/hs_err_pid*". Configuration error?
Recording test results
Build step 'Publish JUnit test result report' changed build result to UNSTABLE
Email was triggered for: Unstable (Test Failures)
Sending email for trigger: Unstable (Test Failures)