You are viewing a plain text version of this content. The canonical link for it is here.
Posted to hdfs-dev@hadoop.apache.org by Apache Jenkins Server <je...@builds.apache.org> on 2011/12/15 15:11:25 UTC
Hadoop-Hdfs-0.23-Build - Build # 108 - Still Unstable
See https://builds.apache.org/job/Hadoop-Hdfs-0.23-Build/108/
###################################################################################
########################## LAST 60 LINES OF THE CONSOLE ###########################
[...truncated 14338 lines...]
[INFO] --- maven-source-plugin:2.1.2:jar-no-fork (hadoop-java-sources) @ hadoop-hdfs-project ---
[INFO]
[INFO] --- maven-site-plugin:3.0:attach-descriptor (attach-descriptor) @ hadoop-hdfs-project ---
[INFO]
[INFO] --- maven-install-plugin:2.3.1:install (default-install) @ hadoop-hdfs-project ---
[INFO] Installing /home/jenkins/jenkins-slave/workspace/Hadoop-Hdfs-0.23-Build/trunk/hadoop-hdfs-project/pom.xml to /home/jenkins/.m2/repository/org/apache/hadoop/hadoop-hdfs-project/0.23.1-SNAPSHOT/hadoop-hdfs-project-0.23.1-SNAPSHOT.pom
[INFO]
[INFO] --- maven-antrun-plugin:1.6:run (create-testdirs) @ hadoop-hdfs-project ---
[INFO] Executing tasks
main:
[INFO] Executed tasks
[INFO]
[INFO] --- maven-javadoc-plugin:2.7:jar (module-javadocs) @ hadoop-hdfs-project ---
[INFO] Not executing Javadoc as the project is not a Java classpath-capable package
[INFO]
[INFO] --- maven-source-plugin:2.1.2:jar-no-fork (hadoop-java-sources) @ hadoop-hdfs-project ---
[INFO]
[INFO] --- maven-site-plugin:3.0:attach-descriptor (attach-descriptor) @ hadoop-hdfs-project ---
[INFO]
[INFO] --- maven-checkstyle-plugin:2.6:checkstyle (default-cli) @ hadoop-hdfs-project ---
[INFO]
[INFO] --- findbugs-maven-plugin:2.3.2:findbugs (default-cli) @ hadoop-hdfs-project ---
[INFO] ****** FindBugsMojo execute *******
[INFO] canGenerate is false
[INFO] ------------------------------------------------------------------------
[INFO] Reactor Summary:
[INFO]
[INFO] Apache Hadoop HDFS ................................ SUCCESS [7:37.612s]
[INFO] Apache Hadoop HttpFS .............................. SUCCESS [40.972s]
[INFO] Apache Hadoop HDFS Project ........................ SUCCESS [0.057s]
[INFO] ------------------------------------------------------------------------
[INFO] BUILD SUCCESS
[INFO] ------------------------------------------------------------------------
[INFO] Total time: 8:19.062s
[INFO] Finished at: Thu Dec 15 11:44:45 UTC 2011
[INFO] Final Memory: 74M/750M
[INFO] ------------------------------------------------------------------------
+ /home/jenkins/tools/maven/latest/bin/mvn test -Dmaven.test.failure.ignore=true -Pclover -DcloverLicenseLocation=/home/jenkins/tools/clover/latest/lib/clover.license
Archiving artifacts
Publishing Clover coverage report...
Publishing Clover HTML report...
Publishing Clover XML report...
Publishing Clover coverage results...
Recording test results
Build step 'Publish JUnit test result report' changed build result to UNSTABLE
Publishing Javadoc
Recording fingerprints
Updating MAPREDUCE-3484
Updating MAPREDUCE-3398
Updating MAPREDUCE-3541
Updating MAPREDUCE-3251
Updating MAPREDUCE-3557
Updating MAPREDUCE-3531
Updating MAPREDUCE-3530
Updating MAPREDUCE-3560
Sending e-mails to: hdfs-dev@hadoop.apache.org
Email was triggered for: Unstable
Sending email for trigger: Unstable
###################################################################################
############################## FAILED TESTS (if any) ##############################
5 tests failed.
REGRESSION: org.apache.hadoop.hdfs.TestDatanodeBlockScanner.testBlockCorruptionRecoveryPolicy1
Error Message:
Timed out waiting for corrupt replicas. Waiting for 0, but only found 1
Stack Trace:
java.util.concurrent.TimeoutException: Timed out waiting for corrupt replicas. Waiting for 0, but only found 1
at org.apache.hadoop.hdfs.DFSTestUtil.waitCorruptReplicas(DFSTestUtil.java:329)
at org.apache.hadoop.hdfs.TestDatanodeBlockScanner.blockCorruptionRecoveryPolicy(TestDatanodeBlockScanner.java:297)
at org.apache.hadoop.hdfs.TestDatanodeBlockScanner.__CLR3_0_2wadu2tyry(TestDatanodeBlockScanner.java:236)
at org.apache.hadoop.hdfs.TestDatanodeBlockScanner.testBlockCorruptionRecoveryPolicy1(TestDatanodeBlockScanner.java:233)
at sun.reflect.NativeMethodAccessorImpl.invoke0(Native Method)
at sun.reflect.NativeMethodAccessorImpl.invoke(NativeMethodAccessorImpl.java:39)
at sun.reflect.DelegatingMethodAccessorImpl.invoke(DelegatingMethodAccessorImpl.java:25)
at java.lang.reflect.Method.invoke(Method.java:597)
at junit.framework.TestCase.runTest(TestCase.java:168)
at junit.framework.TestCase.runBare(TestCase.java:134)
at junit.framework.TestResult$1.protect(TestResult.java:110)
at junit.framework.TestResult.runProtected(TestResult.java:128)
at junit.framework.TestResult.run(TestResult.java:113)
at junit.framework.TestCase.run(TestCase.java:124)
at junit.framework.TestSuite.runTest(TestSuite.java:232)
at junit.framework.TestSuite.run(TestSuite.java:227)
at org.junit.internal.runners.JUnit38ClassRunner.run(JUnit38ClassRunner.java:83)
at org.apache.maven.surefire.junit4.JUnit4TestSet.execute(JUnit4TestSet.java:53)
at org.apache.maven.surefire.junit4.JUnit4Provider.executeTestSet(JUnit4Provider.java:123)
at org.apache.maven.surefire.junit4.JUnit4Provider.invoke(JUnit4Provider.java:104)
at sun.reflect.NativeMethodAccessorImpl.invoke0(Native Method)
at sun.reflect.NativeMethodAccessorImpl.invoke(NativeMethodAccessorImpl.java:39)
at sun.reflect.DelegatingMethodAccessorImpl.invoke(DelegatingMethodAccessorImpl.java:25)
at java.lang.reflect.Method.invoke(Method.java:597)
at org.apache.maven.surefire.util.ReflectionUtils.invokeMethodWithArray(ReflectionUtils.java:164)
at org.apache.maven.surefire.booter.ProviderFactory$ProviderProxy.invoke(ProviderFactory.java:110)
at org.apache.maven.surefire.booter.SurefireStarter.invokeProvider(SurefireStarter.java:175)
at org.apache.maven.surefire.booter.SurefireStarter.runSuitesInProcessWhenForked(SurefireStarter.java:81)
at org.apache.maven.surefire.booter.ForkedBooter.main(ForkedBooter.java:68)
REGRESSION: org.apache.hadoop.hdfs.TestDatanodeBlockScanner.testBlockCorruptionRecoveryPolicy2
Error Message:
Cannot lock storage /home/jenkins/jenkins-slave/workspace/Hadoop-Hdfs-0.23-Build/trunk/hadoop-hdfs-project/hadoop-hdfs/target/test/data/dfs/name1. The directory is already locked.
Stack Trace:
java.io.IOException: Cannot lock storage /home/jenkins/jenkins-slave/workspace/Hadoop-Hdfs-0.23-Build/trunk/hadoop-hdfs-project/hadoop-hdfs/target/test/data/dfs/name1. The directory is already locked.
at org.apache.hadoop.hdfs.server.common.Storage$StorageDirectory.lock(Storage.java:586)
at org.apache.hadoop.hdfs.server.common.Storage$StorageDirectory.analyzeStorage(Storage.java:435)
at org.apache.hadoop.hdfs.server.namenode.FSImage.recoverStorageDirs(FSImage.java:294)
at org.apache.hadoop.hdfs.server.namenode.FSImage.recoverTransitionRead(FSImage.java:210)
at org.apache.hadoop.hdfs.server.namenode.FSDirectory.loadFSImage(FSDirectory.java:175)
at org.apache.hadoop.hdfs.server.namenode.FSNamesystem.initialize(FSNamesystem.java:329)
at org.apache.hadoop.hdfs.server.namenode.FSNamesystem.<init>(FSNamesystem.java:301)
at org.apache.hadoop.hdfs.server.namenode.NameNode.loadNamesystem(NameNode.java:298)
at org.apache.hadoop.hdfs.server.namenode.NameNode.initialize(NameNode.java:332)
at org.apache.hadoop.hdfs.server.namenode.NameNode.<init>(NameNode.java:458)
at org.apache.hadoop.hdfs.server.namenode.NameNode.<init>(NameNode.java:450)
at org.apache.hadoop.hdfs.server.namenode.NameNode.createNameNode(NameNode.java:751)
at org.apache.hadoop.hdfs.MiniDFSCluster.createNameNode(MiniDFSCluster.java:641)
at org.apache.hadoop.hdfs.MiniDFSCluster.initMiniDFSCluster(MiniDFSCluster.java:545)
at org.apache.hadoop.hdfs.MiniDFSCluster.<init>(MiniDFSCluster.java:261)
at org.apache.hadoop.hdfs.MiniDFSCluster.<init>(MiniDFSCluster.java:85)
at org.apache.hadoop.hdfs.MiniDFSCluster$Builder.build(MiniDFSCluster.java:247)
at org.apache.hadoop.hdfs.TestDatanodeBlockScanner.blockCorruptionRecoveryPolicy(TestDatanodeBlockScanner.java:255)
at org.apache.hadoop.hdfs.TestDatanodeBlockScanner.__CLR3_0_2t1dvacys1(TestDatanodeBlockScanner.java:242)
at org.apache.hadoop.hdfs.TestDatanodeBlockScanner.testBlockCorruptionRecoveryPolicy2(TestDatanodeBlockScanner.java:239)
at sun.reflect.NativeMethodAccessorImpl.invoke0(Native Method)
at sun.reflect.NativeMethodAccessorImpl.invoke(NativeMethodAccessorImpl.java:39)
at sun.reflect.DelegatingMethodAccessorImpl.invoke(DelegatingMethodAccessorImpl.java:25)
at java.lang.reflect.Method.invoke(Method.java:597)
at junit.framework.TestCase.runTest(TestCase.java:168)
at junit.framework.TestCase.runBare(TestCase.java:134)
at junit.framework.TestResult$1.protect(TestResult.java:110)
at junit.framework.TestResult.runProtected(TestResult.java:128)
at junit.framework.TestResult.run(TestResult.java:113)
at junit.framework.TestCase.run(TestCase.java:124)
at junit.framework.TestSuite.runTest(TestSuite.java:232)
at junit.framework.TestSuite.run(TestSuite.java:227)
at org.junit.internal.runners.JUnit38ClassRunner.run(JUnit38ClassRunner.java:83)
at org.apache.maven.surefire.junit4.JUnit4TestSet.execute(JUnit4TestSet.java:53)
at org.apache.maven.surefire.junit4.JUnit4Provider.executeTestSet(JUnit4Provider.java:123)
at org.apache.maven.surefire.junit4.JUnit4Provider.invoke(JUnit4Provider.java:104)
at sun.reflect.NativeMethodAccessorImpl.invoke0(Native Method)
at sun.reflect.NativeMethodAccessorImpl.invoke(NativeMethodAccessorImpl.java:39)
at sun.reflect.DelegatingMethodAccessorImpl.invoke(DelegatingMethodAccessorImpl.java:25)
at java.lang.reflect.Method.invoke(Method.java:597)
at org.apache.maven.surefire.util.ReflectionUtils.invokeMethodWithArray(ReflectionUtils.java:164)
at org.apache.maven.surefire.booter.ProviderFactory$ProviderProxy.invoke(ProviderFactory.java:110)
at org.apache.maven.surefire.booter.SurefireStarter.invokeProvider(SurefireStarter.java:175)
at org.apache.maven.surefire.booter.SurefireStarter.runSuitesInProcessWhenForked(SurefireStarter.java:81)
at org.apache.maven.surefire.booter.ForkedBooter.main(ForkedBooter.java:68)
REGRESSION: org.apache.hadoop.hdfs.TestDatanodeBlockScanner.testTruncatedBlockReport
Error Message:
Cannot lock storage /home/jenkins/jenkins-slave/workspace/Hadoop-Hdfs-0.23-Build/trunk/hadoop-hdfs-project/hadoop-hdfs/target/test/data/dfs/name1. The directory is already locked.
Stack Trace:
java.io.IOException: Cannot lock storage /home/jenkins/jenkins-slave/workspace/Hadoop-Hdfs-0.23-Build/trunk/hadoop-hdfs-project/hadoop-hdfs/target/test/data/dfs/name1. The directory is already locked.
at org.apache.hadoop.hdfs.server.common.Storage$StorageDirectory.lock(Storage.java:586)
at org.apache.hadoop.hdfs.server.common.Storage$StorageDirectory.analyzeStorage(Storage.java:435)
at org.apache.hadoop.hdfs.server.namenode.FSImage.recoverStorageDirs(FSImage.java:294)
at org.apache.hadoop.hdfs.server.namenode.FSImage.recoverTransitionRead(FSImage.java:210)
at org.apache.hadoop.hdfs.server.namenode.FSDirectory.loadFSImage(FSDirectory.java:175)
at org.apache.hadoop.hdfs.server.namenode.FSNamesystem.initialize(FSNamesystem.java:329)
at org.apache.hadoop.hdfs.server.namenode.FSNamesystem.<init>(FSNamesystem.java:301)
at org.apache.hadoop.hdfs.server.namenode.NameNode.loadNamesystem(NameNode.java:298)
at org.apache.hadoop.hdfs.server.namenode.NameNode.initialize(NameNode.java:332)
at org.apache.hadoop.hdfs.server.namenode.NameNode.<init>(NameNode.java:458)
at org.apache.hadoop.hdfs.server.namenode.NameNode.<init>(NameNode.java:450)
at org.apache.hadoop.hdfs.server.namenode.NameNode.createNameNode(NameNode.java:751)
at org.apache.hadoop.hdfs.MiniDFSCluster.createNameNode(MiniDFSCluster.java:641)
at org.apache.hadoop.hdfs.MiniDFSCluster.initMiniDFSCluster(MiniDFSCluster.java:545)
at org.apache.hadoop.hdfs.MiniDFSCluster.<init>(MiniDFSCluster.java:261)
at org.apache.hadoop.hdfs.MiniDFSCluster.<init>(MiniDFSCluster.java:85)
at org.apache.hadoop.hdfs.MiniDFSCluster$Builder.build(MiniDFSCluster.java:247)
at org.apache.hadoop.hdfs.TestDatanodeBlockScanner.__CLR3_0_226b7dwyt0(TestDatanodeBlockScanner.java:314)
at org.apache.hadoop.hdfs.TestDatanodeBlockScanner.testTruncatedBlockReport(TestDatanodeBlockScanner.java:303)
at sun.reflect.NativeMethodAccessorImpl.invoke0(Native Method)
at sun.reflect.NativeMethodAccessorImpl.invoke(NativeMethodAccessorImpl.java:39)
at sun.reflect.DelegatingMethodAccessorImpl.invoke(DelegatingMethodAccessorImpl.java:25)
at java.lang.reflect.Method.invoke(Method.java:597)
at junit.framework.TestCase.runTest(TestCase.java:168)
at junit.framework.TestCase.runBare(TestCase.java:134)
at junit.framework.TestResult$1.protect(TestResult.java:110)
at junit.framework.TestResult.runProtected(TestResult.java:128)
at junit.framework.TestResult.run(TestResult.java:113)
at junit.framework.TestCase.run(TestCase.java:124)
at junit.framework.TestSuite.runTest(TestSuite.java:232)
at junit.framework.TestSuite.run(TestSuite.java:227)
at org.junit.internal.runners.JUnit38ClassRunner.run(JUnit38ClassRunner.java:83)
at org.apache.maven.surefire.junit4.JUnit4TestSet.execute(JUnit4TestSet.java:53)
at org.apache.maven.surefire.junit4.JUnit4Provider.executeTestSet(JUnit4Provider.java:123)
at org.apache.maven.surefire.junit4.JUnit4Provider.invoke(JUnit4Provider.java:104)
at sun.reflect.NativeMethodAccessorImpl.invoke0(Native Method)
at sun.reflect.NativeMethodAccessorImpl.invoke(NativeMethodAccessorImpl.java:39)
at sun.reflect.DelegatingMethodAccessorImpl.invoke(DelegatingMethodAccessorImpl.java:25)
at java.lang.reflect.Method.invoke(Method.java:597)
at org.apache.maven.surefire.util.ReflectionUtils.invokeMethodWithArray(ReflectionUtils.java:164)
at org.apache.maven.surefire.booter.ProviderFactory$ProviderProxy.invoke(ProviderFactory.java:110)
at org.apache.maven.surefire.booter.SurefireStarter.invokeProvider(SurefireStarter.java:175)
at org.apache.maven.surefire.booter.SurefireStarter.runSuitesInProcessWhenForked(SurefireStarter.java:81)
at org.apache.maven.surefire.booter.ForkedBooter.main(ForkedBooter.java:68)
FAILED: org.apache.hadoop.fs.http.server.TestHttpFSServer.instrumentation
Error Message:
expected:<401> but was:<200>
Stack Trace:
junit.framework.AssertionFailedError: expected:<401> but was:<200>
at junit.framework.Assert.fail(Assert.java:47)
at junit.framework.Assert.failNotEquals(Assert.java:283)
at junit.framework.Assert.assertEquals(Assert.java:64)
at junit.framework.Assert.assertEquals(Assert.java:195)
at junit.framework.Assert.assertEquals(Assert.java:201)
at org.apache.hadoop.fs.http.server.TestHttpFSServer.__CLR3_0_2bnqkmt1wc(TestHttpFSServer.java:97)
at org.apache.hadoop.fs.http.server.TestHttpFSServer.instrumentation(TestHttpFSServer.java:86)
at sun.reflect.NativeMethodAccessorImpl.invoke0(Native Method)
at sun.reflect.NativeMethodAccessorImpl.invoke(NativeMethodAccessorImpl.java:39)
at sun.reflect.DelegatingMethodAccessorImpl.invoke(DelegatingMethodAccessorImpl.java:25)
at java.lang.reflect.Method.invoke(Method.java:597)
at org.junit.runners.model.FrameworkMethod$1.runReflectiveCall(FrameworkMethod.java:44)
at org.junit.internal.runners.model.ReflectiveCallable.run(ReflectiveCallable.java:15)
at org.junit.runners.model.FrameworkMethod.invokeExplosively(FrameworkMethod.java:41)
at org.junit.internal.runners.statements.InvokeMethod.evaluate(InvokeMethod.java:20)
at org.apache.hadoop.test.TestHdfsHelper$HdfsStatement.evaluate(TestHdfsHelper.java:73)
at org.apache.hadoop.test.TestDirHelper$1.evaluate(TestDirHelper.java:108)
at org.apache.hadoop.test.TestDirHelper$1.evaluate(TestDirHelper.java:108)
at org.apache.hadoop.test.TestJettyHelper$1.evaluate(TestJettyHelper.java:51)
at org.apache.hadoop.test.TestExceptionHelper$1.evaluate(TestExceptionHelper.java:41)
at org.junit.runners.BlockJUnit4ClassRunner.runChild(BlockJUnit4ClassRunner.java:76)
at org.junit.runners.BlockJUnit4ClassRunner.runChild(BlockJUnit4ClassRunner.java:50)
at org.junit.runners.ParentRunner$3.run(ParentRunner.java:193)
at org.junit.runners.ParentRunner$1.schedule(ParentRunner.java:52)
at org.junit.runners.ParentRunner.runChildren(ParentRunner.java:191)
at org.junit.runners.ParentRunner.access$000(ParentRunner.java:42)
at org.junit.runners.ParentRunner$2.evaluate(ParentRunner.java:184)
at org.junit.runners.ParentRunner.run(ParentRunner.java:236)
at org.apache.maven.surefire.junit4.JUnit4TestSet.execute(JUnit4TestSet.java:53)
at org.apache.maven.surefire.junit4.JUnit4Provider.executeTestSet(JUnit4Provider.java:123)
at org.apache.maven.surefire.junit4.JUnit4Provider.invoke(JUnit4Provider.java:104)
at sun.reflect.NativeMethodAccessorImpl.invoke0(Native Method)
at sun.reflect.NativeMethodAccessorImpl.invoke(NativeMethodAccessorImpl.java:39)
at sun.reflect.DelegatingMethodAccessorImpl.invoke(DelegatingMethodAccessorImpl.java:25)
at java.lang.reflect.Method.invoke(Method.java:597)
at org.apache.maven.surefire.util.ReflectionUtils.invokeMethodWithArray(ReflectionUtils.java:164)
at org.apache.maven.surefire.booter.ProviderFactory$ProviderProxy.invoke(ProviderFactory.java:110)
at org.apache.maven.surefire.booter.SurefireStarter.invokeProvider(SurefireStarter.java:175)
at org.apache.maven.surefire.booter.SurefireStarter.runSuitesInProcessWhenForked(SurefireStarter.java:81)
at org.apache.maven.surefire.booter.ForkedBooter.main(ForkedBooter.java:68)
FAILED: org.apache.hadoop.lib.servlet.TestServerWebApp.lifecycle
Error Message:
null
Stack Trace:
java.lang.NullPointerException
at java.util.Properties$LineReader.readLine(Properties.java:418)
at java.util.Properties.load0(Properties.java:337)
at java.util.Properties.load(Properties.java:325)
at org.apache.hadoop.lib.server.Server.init(Server.java:348)
at org.apache.hadoop.lib.servlet.ServerWebApp.contextInitialized(ServerWebApp.java:142)
at org.apache.hadoop.lib.servlet.TestServerWebApp.__CLR3_0_2sd9si72uk(TestServerWebApp.java:56)
at org.apache.hadoop.lib.servlet.TestServerWebApp.lifecycle(TestServerWebApp.java:46)
at sun.reflect.NativeMethodAccessorImpl.invoke0(Native Method)
at sun.reflect.NativeMethodAccessorImpl.invoke(NativeMethodAccessorImpl.java:39)
at sun.reflect.DelegatingMethodAccessorImpl.invoke(DelegatingMethodAccessorImpl.java:25)
at java.lang.reflect.Method.invoke(Method.java:597)
at org.junit.runners.model.FrameworkMethod$1.runReflectiveCall(FrameworkMethod.java:44)
at org.junit.internal.runners.model.ReflectiveCallable.run(ReflectiveCallable.java:15)
at org.junit.runners.model.FrameworkMethod.invokeExplosively(FrameworkMethod.java:41)
at org.junit.internal.runners.statements.InvokeMethod.evaluate(InvokeMethod.java:20)
at org.apache.hadoop.test.TestDirHelper$1.evaluate(TestDirHelper.java:108)
at org.apache.hadoop.test.TestJettyHelper$1.evaluate(TestJettyHelper.java:51)
at org.apache.hadoop.test.TestExceptionHelper$1.evaluate(TestExceptionHelper.java:41)
at org.junit.runners.BlockJUnit4ClassRunner.runChild(BlockJUnit4ClassRunner.java:76)
at org.junit.runners.BlockJUnit4ClassRunner.runChild(BlockJUnit4ClassRunner.java:50)
at org.junit.runners.ParentRunner$3.run(ParentRunner.java:193)
at org.junit.runners.ParentRunner$1.schedule(ParentRunner.java:52)
at org.junit.runners.ParentRunner.runChildren(ParentRunner.java:191)
at org.junit.runners.ParentRunner.access$000(ParentRunner.java:42)
at org.junit.runners.ParentRunner$2.evaluate(ParentRunner.java:184)
at org.junit.runners.ParentRunner.run(ParentRunner.java:236)
at org.apache.maven.surefire.junit4.JUnit4TestSet.execute(JUnit4TestSet.java:53)
at org.apache.maven.surefire.junit4.JUnit4Provider.executeTestSet(JUnit4Provider.java:123)
at org.apache.maven.surefire.junit4.JUnit4Provider.invoke(JUnit4Provider.java:104)
at sun.reflect.NativeMethodAccessorImpl.invoke0(Native Method)
at sun.reflect.NativeMethodAccessorImpl.invoke(NativeMethodAccessorImpl.java:39)
at sun.reflect.DelegatingMethodAccessorImpl.invoke(DelegatingMethodAccessorImpl.java:25)
at java.lang.reflect.Method.invoke(Method.java:597)
at org.apache.maven.surefire.util.ReflectionUtils.invokeMethodWithArray(ReflectionUtils.java:164)
at org.apache.maven.surefire.booter.ProviderFactory$ProviderProxy.invoke(ProviderFactory.java:110)
at org.apache.maven.surefire.booter.SurefireStarter.invokeProvider(SurefireStarter.java:175)
at org.apache.maven.surefire.booter.SurefireStarter.runSuitesInProcessWhenForked(SurefireStarter.java:81)
at org.apache.maven.surefire.booter.ForkedBooter.main(ForkedBooter.java:68)