You are viewing a plain text version of this content. The canonical link for it is here.
Posted to commits@servicemix.apache.org by Apache Jenkins Server <je...@builds.apache.org> on 2015/06/06 02:31:10 UTC

Build failed in Jenkins: ServiceMix-Bundles #827

See <https://builds.apache.org/job/ServiceMix-Bundles/827/changes>

Changes:

[jbonofre] Prepare bundles release

[jbonofre] [maven-release-plugin] prepare release org.apache.servicemix.bundles.spring-web-3.2.12.RELEASE_2

[jbonofre] [maven-release-plugin] prepare for next development iteration

[jbonofre] Prepare bundles release

[jbonofre] [maven-release-plugin] prepare release org.apache.servicemix.bundles.spring-webmvc-3.2.12.RELEASE_2

[jbonofre] [maven-release-plugin] prepare for next development iteration

[jbonofre] Prepare bundles release

[jbonofre] [maven-release-plugin] prepare release org.apache.servicemix.bundles.spring-webmvc-portlet-3.2.12.RELEASE_2

[jbonofre] [maven-release-plugin] prepare for next development iteration

[jbonofre] Prepare bundles release

[jbonofre] [maven-release-plugin] prepare release org.apache.servicemix.bundles.spring-aop-3.2.13.RELEASE_2

[jbonofre] [maven-release-plugin] prepare for next development iteration

[jbonofre] Prepare bundles release

[jbonofre] [maven-release-plugin] prepare release org.apache.servicemix.bundles.spring-aspects-3.2.13.RELEASE_2

[jbonofre] [maven-release-plugin] prepare for next development iteration

[jbonofre] Prepare bundles release

[jbonofre] [maven-release-plugin] prepare release org.apache.servicemix.bundles.spring-beans-3.2.13.RELEASE_2

[jbonofre] [maven-release-plugin] prepare for next development iteration

[jbonofre] Prepare bundles release

[jbonofre] [maven-release-plugin] prepare release org.apache.servicemix.bundles.spring-context-3.2.13.RELEASE_2

[jbonofre] [maven-release-plugin] prepare for next development iteration

[jbonofre] Prepare bundles release

[jbonofre] [maven-release-plugin] prepare release org.apache.servicemix.bundles.spring-context-support-3.2.13.RELEASE_2

[jbonofre] [maven-release-plugin] prepare for next development iteration

------------------------------------------
Started by an SCM change
Building remotely on ubuntu3 (Ubuntu ubuntu legacy-ubuntu) in workspace <https://builds.apache.org/job/ServiceMix-Bundles/ws/>
 > git rev-parse --is-inside-work-tree # timeout=10
Fetching changes from the remote Git repository
 > git config remote.origin.url https://git-wip-us.apache.org/repos/asf/servicemix-bundles.git # timeout=10
Fetching upstream changes from https://git-wip-us.apache.org/repos/asf/servicemix-bundles.git
 > git --version # timeout=10
 > git fetch --tags --progress https://git-wip-us.apache.org/repos/asf/servicemix-bundles.git +refs/heads/*:refs/remotes/origin/*
 > git rev-parse refs/remotes/origin/master^{commit} # timeout=10
 > git rev-parse refs/remotes/origin/origin/master^{commit} # timeout=10
Checking out Revision 22853107d4f8a099d289160d94840d82cbc563a9 (refs/remotes/origin/master)
 > git config core.sparsecheckout # timeout=10
 > git checkout -f 22853107d4f8a099d289160d94840d82cbc563a9
 > git rev-list c0f97fa0210ef8f1ddfe06fc0d6082e927af4053 # timeout=10
Parsing POMs
Modules changed, recalculating dependency graph
maven3-agent.jar already up to date
maven3-interceptor.jar already up to date
maven3-interceptor-commons.jar already up to date
[ServiceMix-Bundles] $ /home/jenkins/tools/java/latest1.6/bin/java -da -dsa -XX:MaxPermSize=192m -Xmx512M -cp /home/jenkins/jenkins-slave/maven3-agent.jar:/home/jenkins/jenkins-slave/tools/hudson.tasks.Maven_MavenInstallation/Maven_3.0.3/boot/plexus-classworlds-2.4.jar org.jvnet.hudson.maven3.agent.Maven3Main /home/jenkins/jenkins-slave/tools/hudson.tasks.Maven_MavenInstallation/Maven_3.0.3 /x1/jenkins/jenkins-slave/slave.jar /home/jenkins/jenkins-slave/maven3-interceptor.jar /home/jenkins/jenkins-slave/maven3-interceptor-commons.jar 43158
<===[JENKINS REMOTING CAPACITY]===>   channel started
Executing Maven:  -B -f <https://builds.apache.org/job/ServiceMix-Bundles/ws/pom.xml> -Dmaven.repo.local=<https://builds.apache.org/job/ServiceMix-Bundles/ws/.repository> -B -e clean install
[INFO] Error stacktraces are turned on.
[INFO] Scanning for projects...
[ERROR] The build could not read 1 project -> [Help 1]
org.apache.maven.project.ProjectBuildingException: Some problems were encountered while processing the POMs:
[ERROR] 'modules.module[52]' specifies duplicate child module poi-3.11 @ line 98, column 17
[ERROR] 'modules.module[53]' specifies duplicate child module swagger-core_2.11-1.3.12 @ line 99, column 17

	at org.apache.maven.project.DefaultProjectBuilder.build(DefaultProjectBuilder.java:339)
	at org.apache.maven.DefaultMaven.collectProjects(DefaultMaven.java:632)
	at org.apache.maven.DefaultMaven.getProjectsForMavenReactor(DefaultMaven.java:581)
	at org.apache.maven.DefaultMaven.doExecute(DefaultMaven.java:233)
	at org.apache.maven.DefaultMaven.execute(DefaultMaven.java:156)
	at org.jvnet.hudson.maven3.launcher.Maven3Launcher.main(Maven3Launcher.java:117)
	at sun.reflect.NativeMethodAccessorImpl.invoke0(Native Method)
	at sun.reflect.NativeMethodAccessorImpl.invoke(NativeMethodAccessorImpl.java:39)
	at sun.reflect.DelegatingMethodAccessorImpl.invoke(DelegatingMethodAccessorImpl.java:25)
	at java.lang.reflect.Method.invoke(Method.java:597)
	at org.codehaus.plexus.classworlds.launcher.Launcher.launchStandard(Launcher.java:329)
	at org.codehaus.plexus.classworlds.launcher.Launcher.launch(Launcher.java:239)
	at org.jvnet.hudson.maven3.agent.Maven3Main.launch(Maven3Main.java:178)
	at sun.reflect.NativeMethodAccessorImpl.invoke0(Native Method)
	at sun.reflect.NativeMethodAccessorImpl.invoke(NativeMethodAccessorImpl.java:39)
	at sun.reflect.DelegatingMethodAccessorImpl.invoke(DelegatingMethodAccessorImpl.java:25)
	at java.lang.reflect.Method.invoke(Method.java:597)
	at hudson.maven.Maven3Builder.call(Maven3Builder.java:136)
	at hudson.maven.Maven3Builder.call(Maven3Builder.java:71)
	at hudson.remoting.UserRequest.perform(UserRequest.java:118)
	at hudson.remoting.UserRequest.perform(UserRequest.java:48)
	at hudson.remoting.Request$2.run(Request.java:328)
	at hudson.remoting.InterceptingExecutorService$1.call(InterceptingExecutorService.java:72)
	at java.util.concurrent.FutureTask$Sync.innerRun(FutureTask.java:303)
	at java.util.concurrent.FutureTask.run(FutureTask.java:138)
	at java.util.concurrent.ThreadPoolExecutor$Worker.runTask(ThreadPoolExecutor.java:895)
	at java.util.concurrent.ThreadPoolExecutor$Worker.run(ThreadPoolExecutor.java:918)
	at java.lang.Thread.run(Thread.java:662)
[ERROR]   
[ERROR]   The project org.apache.servicemix.bundles:org.apache.servicemix.bundles.pom:1-SNAPSHOT (<https://builds.apache.org/job/ServiceMix-Bundles/ws/pom.xml)> has 2 errors
[ERROR]     'modules.module[52]' specifies duplicate child module poi-3.11 @ line 98, column 17
[ERROR]     'modules.module[53]' specifies duplicate child module swagger-core_2.11-1.3.12 @ line 99, column 17
[ERROR] 
[ERROR] Re-run Maven using the -X switch to enable full debug logging.
[ERROR] 
[ERROR] For more information about the errors and possible solutions, please read the following articles:
[ERROR] [Help 1] http://cwiki.apache.org/confluence/display/MAVEN/ProjectBuildingException
channel stopped

Jenkins build is back to normal : ServiceMix-Bundles #840

Posted by Apache Jenkins Server <je...@builds.apache.org>.
See <https://builds.apache.org/job/ServiceMix-Bundles/840/changes>


Build failed in Jenkins: ServiceMix-Bundles #839

Posted by Apache Jenkins Server <je...@builds.apache.org>.
See <https://builds.apache.org/job/ServiceMix-Bundles/839/changes>

Changes:

[jbonofre] [maven-release-plugin] prepare release org.apache.servicemix.bundles.reflections-0.9.10_1

[jbonofre] [maven-release-plugin] prepare for next development iteration

[jbonofre] [maven-release-plugin] prepare release org.apache.servicemix.bundles.dbunit-2.5.1_1

[jbonofre] [maven-release-plugin] prepare for next development iteration

[jbonofre] [maven-release-plugin] prepare release org.apache.servicemix.bundles.sparkjava-core-2.2_1

[jbonofre] [maven-release-plugin] prepare for next development iteration

[jbonofre] [maven-release-plugin] prepare release org.apache.servicemix.bundles.spring-integration-core-4.1.4.RELEASE_1

[jbonofre] [maven-release-plugin] prepare for next development iteration

[jbonofre] [maven-release-plugin] prepare release org.apache.servicemix.bundles.aws-java-sdk-1.9.39_1

[jbonofre] [maven-release-plugin] prepare for next development iteration

[jbonofre] [SM-2592] Create OSGi bundle for elasticsearch 1.6.0

[jbonofre] [maven-release-plugin] prepare release org.apache.servicemix.bundles.poi-3.12_1

[jbonofre] [maven-release-plugin] prepare for next development iteration

[jbonofre] [maven-release-plugin] prepare release org.apache.servicemix.bundles.aws-java-sdk-1.9.40_1

[jbonofre] [maven-release-plugin] prepare for next development iteration

[jbonofre] Prepare bundles-2015.05 release

[jbonofre] [maven-release-plugin] prepare release org.apache.servicemix.bundles.olingo-odata2-core-2.0.0_2

[jbonofre] [maven-release-plugin] prepare for next development iteration

[jbonofre] [maven-release-plugin] prepare release org.apache.servicemix.bundles.olingo-odata2-core-2.0.3_2

[jbonofre] [maven-release-plugin] prepare for next development iteration

[jbonofre] [maven-release-plugin] prepare release org.apache.servicemix.bundles.jsch-0.1.53_1

------------------------------------------
Started by an SCM change
Building remotely on ubuntu-5 (docker Ubuntu ubuntu5 ubuntu) in workspace <https://builds.apache.org/job/ServiceMix-Bundles/ws/>
 > git rev-parse --is-inside-work-tree # timeout=10
Fetching changes from the remote Git repository
 > git config remote.origin.url https://git-wip-us.apache.org/repos/asf/servicemix-bundles.git # timeout=10
Fetching upstream changes from https://git-wip-us.apache.org/repos/asf/servicemix-bundles.git
 > git --version # timeout=10
 > git fetch --tags --progress https://git-wip-us.apache.org/repos/asf/servicemix-bundles.git +refs/heads/*:refs/remotes/origin/*
 > git rev-parse refs/remotes/origin/master^{commit} # timeout=10
 > git rev-parse refs/remotes/origin/origin/master^{commit} # timeout=10
Checking out Revision 551feccab07314016b4291bdf064318458c3f516 (refs/remotes/origin/master)
 > git config core.sparsecheckout # timeout=10
 > git checkout -f 551feccab07314016b4291bdf064318458c3f516
 > git rev-list 40e54bbd91531969824046fa3d5f2769923d7997 # timeout=10
Parsing POMs
Modules changed, recalculating dependency graph
maven3-agent.jar already up to date
maven3-interceptor.jar already up to date
maven3-interceptor-commons.jar already up to date
[ServiceMix-Bundles] $ /home/jenkins/tools/java/latest1.6/bin/java -da -dsa -XX:MaxPermSize=192m -Xmx512M -cp /home/jenkins/jenkins-slave/maven3-agent.jar:/home/jenkins/jenkins-slave/tools/hudson.tasks.Maven_MavenInstallation/Maven_3.0.3/boot/plexus-classworlds-2.4.jar org.jvnet.hudson.maven3.agent.Maven3Main /home/jenkins/jenkins-slave/tools/hudson.tasks.Maven_MavenInstallation/Maven_3.0.3 /home/jenkins/jenkins-slave/slave.jar /home/jenkins/jenkins-slave/maven3-interceptor.jar /home/jenkins/jenkins-slave/maven3-interceptor-commons.jar 50610
<===[JENKINS REMOTING CAPACITY]===>   channel started
Executing Maven:  -B -f <https://builds.apache.org/job/ServiceMix-Bundles/ws/pom.xml> -Dmaven.repo.local=<https://builds.apache.org/job/ServiceMix-Bundles/ws/.repository> -B -e clean install
[INFO] Error stacktraces are turned on.
[INFO] Scanning for projects...
[ERROR] The build could not read 1 project -> [Help 1]
org.apache.maven.project.ProjectBuildingException: Some problems were encountered while processing the POMs:
[ERROR] 'modules.module[52]' specifies duplicate child module poi-3.11 @ line 98, column 17
[ERROR] 'modules.module[53]' specifies duplicate child module swagger-core_2.11-1.3.12 @ line 99, column 17
[ERROR] 'modules.module[75]' specifies duplicate child module olingo-odata2-core-2.0.4 @ line 121, column 17

	at org.apache.maven.project.DefaultProjectBuilder.build(DefaultProjectBuilder.java:339)
	at org.apache.maven.DefaultMaven.collectProjects(DefaultMaven.java:632)
	at org.apache.maven.DefaultMaven.getProjectsForMavenReactor(DefaultMaven.java:581)
	at org.apache.maven.DefaultMaven.doExecute(DefaultMaven.java:233)
	at org.apache.maven.DefaultMaven.execute(DefaultMaven.java:156)
	at org.jvnet.hudson.maven3.launcher.Maven3Launcher.main(Maven3Launcher.java:117)
	at sun.reflect.NativeMethodAccessorImpl.invoke0(Native Method)
	at sun.reflect.NativeMethodAccessorImpl.invoke(NativeMethodAccessorImpl.java:39)
	at sun.reflect.DelegatingMethodAccessorImpl.invoke(DelegatingMethodAccessorImpl.java:25)
	at java.lang.reflect.Method.invoke(Method.java:597)
	at org.codehaus.plexus.classworlds.launcher.Launcher.launchStandard(Launcher.java:329)
	at org.codehaus.plexus.classworlds.launcher.Launcher.launch(Launcher.java:239)
	at org.jvnet.hudson.maven3.agent.Maven3Main.launch(Maven3Main.java:178)
	at sun.reflect.NativeMethodAccessorImpl.invoke0(Native Method)
	at sun.reflect.NativeMethodAccessorImpl.invoke(NativeMethodAccessorImpl.java:39)
	at sun.reflect.DelegatingMethodAccessorImpl.invoke(DelegatingMethodAccessorImpl.java:25)
	at java.lang.reflect.Method.invoke(Method.java:597)
	at hudson.maven.Maven3Builder.call(Maven3Builder.java:136)
	at hudson.maven.Maven3Builder.call(Maven3Builder.java:71)
	at hudson.remoting.UserRequest.perform(UserRequest.java:118)
	at hudson.remoting.UserRequest.perform(UserRequest.java:48)
	at hudson.remoting.Request$2.run(Request.java:328)
	at hudson.remoting.InterceptingExecutorService$1.call(InterceptingExecutorService.java:72)
	at java.util.concurrent.FutureTask$Sync.innerRun(FutureTask.java:303)
	at java.util.concurrent.FutureTask.run(FutureTask.java:138)
	at java.util.concurrent.ThreadPoolExecutor$Worker.runTask(ThreadPoolExecutor.java:895)
	at java.util.concurrent.ThreadPoolExecutor$Worker.run(ThreadPoolExecutor.java:918)
	at java.lang.Thread.run(Thread.java:662)
[ERROR]   
[ERROR]   The project org.apache.servicemix.bundles:org.apache.servicemix.bundles.pom:1-SNAPSHOT (<https://builds.apache.org/job/ServiceMix-Bundles/ws/pom.xml)> has 3 errors
[ERROR]     'modules.module[52]' specifies duplicate child module poi-3.11 @ line 98, column 17
[ERROR]     'modules.module[53]' specifies duplicate child module swagger-core_2.11-1.3.12 @ line 99, column 17
[ERROR]     'modules.module[75]' specifies duplicate child module olingo-odata2-core-2.0.4 @ line 121, column 17
[ERROR] 
[ERROR] Re-run Maven using the -X switch to enable full debug logging.
[ERROR] 
[ERROR] For more information about the errors and possible solutions, please read the following articles:
[ERROR] [Help 1] http://cwiki.apache.org/confluence/display/MAVEN/ProjectBuildingException
channel stopped

Build failed in Jenkins: ServiceMix-Bundles #838

Posted by Apache Jenkins Server <je...@builds.apache.org>.
See <https://builds.apache.org/job/ServiceMix-Bundles/838/changes>

Changes:

[jbonofre] [maven-release-plugin] prepare release org.apache.servicemix.bundles.hbase-1.1.0.1_1

[jbonofre] [maven-release-plugin] prepare for next development iteration

[jbonofre] [maven-release-plugin] prepare release org.apache.servicemix.bundles.olingo-odata2-api-2.0.4_1

[jbonofre] [maven-release-plugin] prepare for next development iteration

[jbonofre] [maven-release-plugin] prepare release org.apache.servicemix.bundles.olingo-odata2-core-2.0.4_1

[jbonofre] [maven-release-plugin] prepare for next development iteration

[jbonofre] [maven-release-plugin] prepare release org.apache.servicemix.bundles.spring-batch-core-3.0.4.RELEASE_1

[jbonofre] [maven-release-plugin] prepare for next development iteration

[jbonofre] [maven-release-plugin] prepare release org.apache.servicemix.bundles.spring-batch-infrastructure-3.0.4.RELEASE_1

[jbonofre] [maven-release-plugin] prepare for next development iteration

[jbonofre] [maven-release-plugin] prepare release org.apache.servicemix.bundles.spring-ldap-2.0.3.RELEASE_1

[jbonofre] [maven-release-plugin] prepare for next development iteration

[jbonofre] [maven-release-plugin] prepare release org.apache.servicemix.bundles.gae-1.9.21_1

[jbonofre] [maven-release-plugin] prepare for next development iteration

[jbonofre] [maven-release-plugin] prepare release org.apache.servicemix.bundles.jt400-8.5_1

[jbonofre] [maven-release-plugin] prepare for next development iteration

[jbonofre] [maven-release-plugin] prepare release org.apache.servicemix.bundles.docker-java-1.3.0_1

[jbonofre] [maven-release-plugin] prepare for next development iteration

------------------------------------------
Started by an SCM change
Building remotely on ubuntu-5 (docker Ubuntu ubuntu5 ubuntu) in workspace <https://builds.apache.org/job/ServiceMix-Bundles/ws/>
 > git rev-parse --is-inside-work-tree # timeout=10
Fetching changes from the remote Git repository
 > git config remote.origin.url https://git-wip-us.apache.org/repos/asf/servicemix-bundles.git # timeout=10
Fetching upstream changes from https://git-wip-us.apache.org/repos/asf/servicemix-bundles.git
 > git --version # timeout=10
 > git fetch --tags --progress https://git-wip-us.apache.org/repos/asf/servicemix-bundles.git +refs/heads/*:refs/remotes/origin/*
 > git rev-parse refs/remotes/origin/master^{commit} # timeout=10
 > git rev-parse refs/remotes/origin/origin/master^{commit} # timeout=10
Checking out Revision 40e54bbd91531969824046fa3d5f2769923d7997 (refs/remotes/origin/master)
 > git config core.sparsecheckout # timeout=10
 > git checkout -f 40e54bbd91531969824046fa3d5f2769923d7997
 > git rev-list 09ec37f7047db104b27a2ad24cd213d08cad2471 # timeout=10
Parsing POMs
Modules changed, recalculating dependency graph
maven3-agent.jar already up to date
maven3-interceptor.jar already up to date
maven3-interceptor-commons.jar already up to date
[ServiceMix-Bundles] $ /home/jenkins/tools/java/latest1.6/bin/java -da -dsa -XX:MaxPermSize=192m -Xmx512M -cp /home/jenkins/jenkins-slave/maven3-agent.jar:/home/jenkins/jenkins-slave/tools/hudson.tasks.Maven_MavenInstallation/Maven_3.0.3/boot/plexus-classworlds-2.4.jar org.jvnet.hudson.maven3.agent.Maven3Main /home/jenkins/jenkins-slave/tools/hudson.tasks.Maven_MavenInstallation/Maven_3.0.3 /home/jenkins/jenkins-slave/slave.jar /home/jenkins/jenkins-slave/maven3-interceptor.jar /home/jenkins/jenkins-slave/maven3-interceptor-commons.jar 55701
<===[JENKINS REMOTING CAPACITY]===>   channel started
Executing Maven:  -B -f <https://builds.apache.org/job/ServiceMix-Bundles/ws/pom.xml> -Dmaven.repo.local=<https://builds.apache.org/job/ServiceMix-Bundles/ws/.repository> -B -e clean install
[INFO] Error stacktraces are turned on.
[INFO] Scanning for projects...
[ERROR] The build could not read 1 project -> [Help 1]
org.apache.maven.project.ProjectBuildingException: Some problems were encountered while processing the POMs:
[ERROR] 'modules.module[52]' specifies duplicate child module poi-3.11 @ line 98, column 17
[ERROR] 'modules.module[53]' specifies duplicate child module swagger-core_2.11-1.3.12 @ line 99, column 17
[ERROR] 'modules.module[75]' specifies duplicate child module olingo-odata2-core-2.0.4 @ line 121, column 17

	at org.apache.maven.project.DefaultProjectBuilder.build(DefaultProjectBuilder.java:339)
	at org.apache.maven.DefaultMaven.collectProjects(DefaultMaven.java:632)
	at org.apache.maven.DefaultMaven.getProjectsForMavenReactor(DefaultMaven.java:581)
	at org.apache.maven.DefaultMaven.doExecute(DefaultMaven.java:233)
	at org.apache.maven.DefaultMaven.execute(DefaultMaven.java:156)
	at org.jvnet.hudson.maven3.launcher.Maven3Launcher.main(Maven3Launcher.java:117)
	at sun.reflect.NativeMethodAccessorImpl.invoke0(Native Method)
	at sun.reflect.NativeMethodAccessorImpl.invoke(NativeMethodAccessorImpl.java:39)
	at sun.reflect.DelegatingMethodAccessorImpl.invoke(DelegatingMethodAccessorImpl.java:25)
	at java.lang.reflect.Method.invoke(Method.java:597)
	at org.codehaus.plexus.classworlds.launcher.Launcher.launchStandard(Launcher.java:329)
	at org.codehaus.plexus.classworlds.launcher.Launcher.launch(Launcher.java:239)
	at org.jvnet.hudson.maven3.agent.Maven3Main.launch(Maven3Main.java:178)
	at sun.reflect.NativeMethodAccessorImpl.invoke0(Native Method)
	at sun.reflect.NativeMethodAccessorImpl.invoke(NativeMethodAccessorImpl.java:39)
	at sun.reflect.DelegatingMethodAccessorImpl.invoke(DelegatingMethodAccessorImpl.java:25)
	at java.lang.reflect.Method.invoke(Method.java:597)
	at hudson.maven.Maven3Builder.call(Maven3Builder.java:136)
	at hudson.maven.Maven3Builder.call(Maven3Builder.java:71)
	at hudson.remoting.UserRequest.perform(UserRequest.java:118)
	at hudson.remoting.UserRequest.perform(UserRequest.java:48)
	at hudson.remoting.Request$2.run(Request.java:328)
	at hudson.remoting.InterceptingExecutorService$1.call(InterceptingExecutorService.java:72)
	at java.util.concurrent.FutureTask$Sync.innerRun(FutureTask.java:303)
	at java.util.concurrent.FutureTask.run(FutureTask.java:138)
	at java.util.concurrent.ThreadPoolExecutor$Worker.runTask(ThreadPoolExecutor.java:895)
	at java.util.concurrent.ThreadPoolExecutor$Worker.run(ThreadPoolExecutor.java:918)
	at java.lang.Thread.run(Thread.java:662)
[ERROR]   
[ERROR]   The project org.apache.servicemix.bundles:org.apache.servicemix.bundles.pom:1-SNAPSHOT (<https://builds.apache.org/job/ServiceMix-Bundles/ws/pom.xml)> has 3 errors
[ERROR]     'modules.module[52]' specifies duplicate child module poi-3.11 @ line 98, column 17
[ERROR]     'modules.module[53]' specifies duplicate child module swagger-core_2.11-1.3.12 @ line 99, column 17
[ERROR]     'modules.module[75]' specifies duplicate child module olingo-odata2-core-2.0.4 @ line 121, column 17
[ERROR] 
[ERROR] Re-run Maven using the -X switch to enable full debug logging.
[ERROR] 
[ERROR] For more information about the errors and possible solutions, please read the following articles:
[ERROR] [Help 1] http://cwiki.apache.org/confluence/display/MAVEN/ProjectBuildingException
channel stopped

Build failed in Jenkins: ServiceMix-Bundles #837

Posted by Apache Jenkins Server <je...@builds.apache.org>.
See <https://builds.apache.org/job/ServiceMix-Bundles/837/changes>

Changes:

[jbonofre] Prepare bundles-2015.05 release

[jbonofre] [maven-release-plugin] prepare release org.apache.servicemix.bundles.spring-oxm-3.2.13.RELEASE_2

[jbonofre] [maven-release-plugin] prepare for next development iteration

[jbonofre] Prepare bundles-2015.05 release

[jbonofre] [maven-release-plugin] prepare release org.apache.servicemix.bundles.spring-struts-3.2.13.RELEASE_2

[jbonofre] [maven-release-plugin] prepare for next development iteration

[jbonofre] Prepare bundles-2015.05 release

[jbonofre] [maven-release-plugin] prepare release org.apache.servicemix.bundles.spring-test-3.2.13.RELEASE_2

[jbonofre] [maven-release-plugin] prepare for next development iteration

[jbonofre] Prepare bundles-2015.05 release

[jbonofre] [maven-release-plugin] prepare release org.apache.servicemix.bundles.spring-tx-3.2.13.RELEASE_2

[jbonofre] [maven-release-plugin] prepare for next development iteration

[jbonofre] Prepare bundles-2015.05 release

[jbonofre] [maven-release-plugin] prepare release org.apache.servicemix.bundles.spring-web-3.2.13.RELEASE_2

[jbonofre] [maven-release-plugin] prepare for next development iteration

[jbonofre] Prepare bundle-2015.05 release

[jbonofre] [maven-release-plugin] prepare release org.apache.servicemix.bundles.spring-webmvc-3.2.13.RELEASE_2

[jbonofre] [maven-release-plugin] prepare for next development iteration

[jbonofre] Prepare bundles-2015.05 release

[jbonofre] [maven-release-plugin] prepare release org.apache.servicemix.bundles.spring-webmvc-portlet-3.2.13.RELEASE_2

[jbonofre] [maven-release-plugin] prepare for next development iteration

[jbonofre] [maven-release-plugin] prepare release org.apache.servicemix.bundles.reflections-0.9.9_1

[jbonofre] [maven-release-plugin] prepare for next development iteration

[jbonofre] [maven-release-plugin] prepare release org.apache.servicemix.bundles.xmlgraphics-commons-2.0_1

[jbonofre] [maven-release-plugin] prepare for next development iteration

[jbonofre] [maven-release-plugin] prepare release org.apache.servicemix.bundles.jedis-2.7.2_1

[jbonofre] [maven-release-plugin] prepare for next development iteration

------------------------------------------
Started by an SCM change
Building remotely on ubuntu3 (Ubuntu ubuntu legacy-ubuntu) in workspace <https://builds.apache.org/job/ServiceMix-Bundles/ws/>
 > git rev-parse --is-inside-work-tree # timeout=10
Fetching changes from the remote Git repository
 > git config remote.origin.url https://git-wip-us.apache.org/repos/asf/servicemix-bundles.git # timeout=10
Fetching upstream changes from https://git-wip-us.apache.org/repos/asf/servicemix-bundles.git
 > git --version # timeout=10
 > git fetch --tags --progress https://git-wip-us.apache.org/repos/asf/servicemix-bundles.git +refs/heads/*:refs/remotes/origin/*
 > git rev-parse refs/remotes/origin/master^{commit} # timeout=10
 > git rev-parse refs/remotes/origin/origin/master^{commit} # timeout=10
Checking out Revision 09ec37f7047db104b27a2ad24cd213d08cad2471 (refs/remotes/origin/master)
 > git config core.sparsecheckout # timeout=10
 > git checkout -f 09ec37f7047db104b27a2ad24cd213d08cad2471
 > git rev-list fc465ab0205bb9678278f05f2de2ba943665943b # timeout=10
Parsing POMs
Modules changed, recalculating dependency graph
maven3-agent.jar already up to date
maven3-interceptor.jar already up to date
maven3-interceptor-commons.jar already up to date
[ServiceMix-Bundles] $ /home/jenkins/tools/java/latest1.6/bin/java -da -dsa -XX:MaxPermSize=192m -Xmx512M -cp /home/jenkins/jenkins-slave/maven3-agent.jar:/home/jenkins/jenkins-slave/tools/hudson.tasks.Maven_MavenInstallation/Maven_3.0.3/boot/plexus-classworlds-2.4.jar org.jvnet.hudson.maven3.agent.Maven3Main /home/jenkins/jenkins-slave/tools/hudson.tasks.Maven_MavenInstallation/Maven_3.0.3 /x1/jenkins/jenkins-slave/slave.jar /home/jenkins/jenkins-slave/maven3-interceptor.jar /home/jenkins/jenkins-slave/maven3-interceptor-commons.jar 48752
<===[JENKINS REMOTING CAPACITY]===>   channel started
Executing Maven:  -B -f <https://builds.apache.org/job/ServiceMix-Bundles/ws/pom.xml> -Dmaven.repo.local=<https://builds.apache.org/job/ServiceMix-Bundles/ws/.repository> -B -e clean install
[INFO] Error stacktraces are turned on.
[INFO] Scanning for projects...
[ERROR] The build could not read 1 project -> [Help 1]
org.apache.maven.project.ProjectBuildingException: Some problems were encountered while processing the POMs:
[ERROR] 'modules.module[52]' specifies duplicate child module poi-3.11 @ line 98, column 17
[ERROR] 'modules.module[53]' specifies duplicate child module swagger-core_2.11-1.3.12 @ line 99, column 17
[ERROR] 'modules.module[75]' specifies duplicate child module olingo-odata2-core-2.0.4 @ line 121, column 17

	at org.apache.maven.project.DefaultProjectBuilder.build(DefaultProjectBuilder.java:339)
	at org.apache.maven.DefaultMaven.collectProjects(DefaultMaven.java:632)
	at org.apache.maven.DefaultMaven.getProjectsForMavenReactor(DefaultMaven.java:581)
	at org.apache.maven.DefaultMaven.doExecute(DefaultMaven.java:233)
	at org.apache.maven.DefaultMaven.execute(DefaultMaven.java:156)
	at org.jvnet.hudson.maven3.launcher.Maven3Launcher.main(Maven3Launcher.java:117)
	at sun.reflect.NativeMethodAccessorImpl.invoke0(Native Method)
	at sun.reflect.NativeMethodAccessorImpl.invoke(NativeMethodAccessorImpl.java:39)
	at sun.reflect.DelegatingMethodAccessorImpl.invoke(DelegatingMethodAccessorImpl.java:25)
	at java.lang.reflect.Method.invoke(Method.java:597)
	at org.codehaus.plexus.classworlds.launcher.Launcher.launchStandard(Launcher.java:329)
	at org.codehaus.plexus.classworlds.launcher.Launcher.launch(Launcher.java:239)
	at org.jvnet.hudson.maven3.agent.Maven3Main.launch(Maven3Main.java:178)
	at sun.reflect.NativeMethodAccessorImpl.invoke0(Native Method)
	at sun.reflect.NativeMethodAccessorImpl.invoke(NativeMethodAccessorImpl.java:39)
	at sun.reflect.DelegatingMethodAccessorImpl.invoke(DelegatingMethodAccessorImpl.java:25)
	at java.lang.reflect.Method.invoke(Method.java:597)
	at hudson.maven.Maven3Builder.call(Maven3Builder.java:136)
	at hudson.maven.Maven3Builder.call(Maven3Builder.java:71)
	at hudson.remoting.UserRequest.perform(UserRequest.java:118)
	at hudson.remoting.UserRequest.perform(UserRequest.java:48)
	at hudson.remoting.Request$2.run(Request.java:328)
	at hudson.remoting.InterceptingExecutorService$1.call(InterceptingExecutorService.java:72)
	at java.util.concurrent.FutureTask$Sync.innerRun(FutureTask.java:303)
	at java.util.concurrent.FutureTask.run(FutureTask.java:138)
	at java.util.concurrent.ThreadPoolExecutor$Worker.runTask(ThreadPoolExecutor.java:895)
	at java.util.concurrent.ThreadPoolExecutor$Worker.run(ThreadPoolExecutor.java:918)
	at java.lang.Thread.run(Thread.java:662)
[ERROR]   
[ERROR]   The project org.apache.servicemix.bundles:org.apache.servicemix.bundles.pom:1-SNAPSHOT (<https://builds.apache.org/job/ServiceMix-Bundles/ws/pom.xml)> has 3 errors
[ERROR]     'modules.module[52]' specifies duplicate child module poi-3.11 @ line 98, column 17
[ERROR]     'modules.module[53]' specifies duplicate child module swagger-core_2.11-1.3.12 @ line 99, column 17
[ERROR]     'modules.module[75]' specifies duplicate child module olingo-odata2-core-2.0.4 @ line 121, column 17
[ERROR] 
[ERROR] Re-run Maven using the -X switch to enable full debug logging.
[ERROR] 
[ERROR] For more information about the errors and possible solutions, please read the following articles:
[ERROR] [Help 1] http://cwiki.apache.org/confluence/display/MAVEN/ProjectBuildingException
channel stopped

Build failed in Jenkins: ServiceMix-Bundles #836

Posted by Apache Jenkins Server <je...@builds.apache.org>.
See <https://builds.apache.org/job/ServiceMix-Bundles/836/changes>

Changes:

[jbonofre] [maven-release-plugin] prepare release org.apache.servicemix.bundles.spring-jms-3.2.13.RELEASE_2

[jbonofre] [maven-release-plugin] prepare for next development iteration

[jbonofre] Prepare bundles-2015.05 release

[jbonofre] [maven-release-plugin] prepare release org.apache.servicemix.bundles.spring-orm-3.2.13.RELEASE_2

[jbonofre] [maven-release-plugin] prepare for next development iteration

------------------------------------------
Started by an SCM change
Building remotely on ubuntu3 (Ubuntu ubuntu legacy-ubuntu) in workspace <https://builds.apache.org/job/ServiceMix-Bundles/ws/>
 > git rev-parse --is-inside-work-tree # timeout=10
Fetching changes from the remote Git repository
 > git config remote.origin.url https://git-wip-us.apache.org/repos/asf/servicemix-bundles.git # timeout=10
Fetching upstream changes from https://git-wip-us.apache.org/repos/asf/servicemix-bundles.git
 > git --version # timeout=10
 > git fetch --tags --progress https://git-wip-us.apache.org/repos/asf/servicemix-bundles.git +refs/heads/*:refs/remotes/origin/*
 > git rev-parse refs/remotes/origin/master^{commit} # timeout=10
 > git rev-parse refs/remotes/origin/origin/master^{commit} # timeout=10
Checking out Revision fc465ab0205bb9678278f05f2de2ba943665943b (refs/remotes/origin/master)
 > git config core.sparsecheckout # timeout=10
 > git checkout -f fc465ab0205bb9678278f05f2de2ba943665943b
 > git rev-list d07b9a33835a25e2a3d7d935dc3bb8c35b97efa0 # timeout=10
Parsing POMs
Modules changed, recalculating dependency graph
maven3-agent.jar already up to date
maven3-interceptor.jar already up to date
maven3-interceptor-commons.jar already up to date
[ServiceMix-Bundles] $ /home/jenkins/tools/java/latest1.6/bin/java -da -dsa -XX:MaxPermSize=192m -Xmx512M -cp /home/jenkins/jenkins-slave/maven3-agent.jar:/home/jenkins/jenkins-slave/tools/hudson.tasks.Maven_MavenInstallation/Maven_3.0.3/boot/plexus-classworlds-2.4.jar org.jvnet.hudson.maven3.agent.Maven3Main /home/jenkins/jenkins-slave/tools/hudson.tasks.Maven_MavenInstallation/Maven_3.0.3 /x1/jenkins/jenkins-slave/slave.jar /home/jenkins/jenkins-slave/maven3-interceptor.jar /home/jenkins/jenkins-slave/maven3-interceptor-commons.jar 56431
<===[JENKINS REMOTING CAPACITY]===>   channel started
Executing Maven:  -B -f <https://builds.apache.org/job/ServiceMix-Bundles/ws/pom.xml> -Dmaven.repo.local=<https://builds.apache.org/job/ServiceMix-Bundles/ws/.repository> -B -e clean install
[INFO] Error stacktraces are turned on.
[INFO] Scanning for projects...
[ERROR] The build could not read 1 project -> [Help 1]
org.apache.maven.project.ProjectBuildingException: Some problems were encountered while processing the POMs:
[ERROR] 'modules.module[52]' specifies duplicate child module poi-3.11 @ line 98, column 17
[ERROR] 'modules.module[53]' specifies duplicate child module swagger-core_2.11-1.3.12 @ line 99, column 17
[ERROR] 'modules.module[75]' specifies duplicate child module olingo-odata2-core-2.0.4 @ line 121, column 17

	at org.apache.maven.project.DefaultProjectBuilder.build(DefaultProjectBuilder.java:339)
	at org.apache.maven.DefaultMaven.collectProjects(DefaultMaven.java:632)
	at org.apache.maven.DefaultMaven.getProjectsForMavenReactor(DefaultMaven.java:581)
	at org.apache.maven.DefaultMaven.doExecute(DefaultMaven.java:233)
	at org.apache.maven.DefaultMaven.execute(DefaultMaven.java:156)
	at org.jvnet.hudson.maven3.launcher.Maven3Launcher.main(Maven3Launcher.java:117)
	at sun.reflect.NativeMethodAccessorImpl.invoke0(Native Method)
	at sun.reflect.NativeMethodAccessorImpl.invoke(NativeMethodAccessorImpl.java:39)
	at sun.reflect.DelegatingMethodAccessorImpl.invoke(DelegatingMethodAccessorImpl.java:25)
	at java.lang.reflect.Method.invoke(Method.java:597)
	at org.codehaus.plexus.classworlds.launcher.Launcher.launchStandard(Launcher.java:329)
	at org.codehaus.plexus.classworlds.launcher.Launcher.launch(Launcher.java:239)
	at org.jvnet.hudson.maven3.agent.Maven3Main.launch(Maven3Main.java:178)
	at sun.reflect.NativeMethodAccessorImpl.invoke0(Native Method)
	at sun.reflect.NativeMethodAccessorImpl.invoke(NativeMethodAccessorImpl.java:39)
	at sun.reflect.DelegatingMethodAccessorImpl.invoke(DelegatingMethodAccessorImpl.java:25)
	at java.lang.reflect.Method.invoke(Method.java:597)
	at hudson.maven.Maven3Builder.call(Maven3Builder.java:136)
	at hudson.maven.Maven3Builder.call(Maven3Builder.java:71)
	at hudson.remoting.UserRequest.perform(UserRequest.java:118)
	at hudson.remoting.UserRequest.perform(UserRequest.java:48)
	at hudson.remoting.Request$2.run(Request.java:328)
	at hudson.remoting.InterceptingExecutorService$1.call(InterceptingExecutorService.java:72)
	at java.util.concurrent.FutureTask$Sync.innerRun(FutureTask.java:303)
	at java.util.concurrent.FutureTask.run(FutureTask.java:138)
	at java.util.concurrent.ThreadPoolExecutor$Worker.runTask(ThreadPoolExecutor.java:895)
	at java.util.concurrent.ThreadPoolExecutor$Worker.run(ThreadPoolExecutor.java:918)
	at java.lang.Thread.run(Thread.java:662)
[ERROR]   
[ERROR]   The project org.apache.servicemix.bundles:org.apache.servicemix.bundles.pom:1-SNAPSHOT (<https://builds.apache.org/job/ServiceMix-Bundles/ws/pom.xml)> has 3 errors
[ERROR]     'modules.module[52]' specifies duplicate child module poi-3.11 @ line 98, column 17
[ERROR]     'modules.module[53]' specifies duplicate child module swagger-core_2.11-1.3.12 @ line 99, column 17
[ERROR]     'modules.module[75]' specifies duplicate child module olingo-odata2-core-2.0.4 @ line 121, column 17
[ERROR] 
[ERROR] Re-run Maven using the -X switch to enable full debug logging.
[ERROR] 
[ERROR] For more information about the errors and possible solutions, please read the following articles:
[ERROR] [Help 1] http://cwiki.apache.org/confluence/display/MAVEN/ProjectBuildingException
channel stopped

Build failed in Jenkins: ServiceMix-Bundles #835

Posted by Apache Jenkins Server <je...@builds.apache.org>.
See <https://builds.apache.org/job/ServiceMix-Bundles/835/changes>

Changes:

[jbonofre] [maven-release-plugin] prepare release org.apache.servicemix.bundles.swagger-core-1.3.11_2

[jbonofre] [maven-release-plugin] prepare for next development iteration

[jbonofre] [maven-release-plugin] prepare release org.apache.servicemix.bundles.swagger-core-1.3.12_2

[jbonofre] [maven-release-plugin] prepare for next development iteration

[jbonofre] [maven-release-plugin] prepare release org.apache.servicemix.bundles.swagger-core_2.11-1.3.12_2

[jbonofre] [maven-release-plugin] prepare for next development iteration

[jbonofre] [maven-release-plugin] prepare release org.apache.servicemix.bundles.aws-java-sdk-1.9.34_1

[jbonofre] [maven-release-plugin] prepare for next development iteration

[jbonofre] [maven-release-plugin] prepare release org.apache.servicemix.bundles.aws-java-sdk-1.9.35_1

[jbonofre] [maven-release-plugin] prepare for next development iteration

[jbonofre] [maven-release-plugin] prepare release org.apache.servicemix.bundles.aws-java-sdk-1.9.38_1

[jbonofre] [maven-release-plugin] prepare for next development iteration

[jbonofre] [maven-release-plugin] prepare release org.apache.servicemix.bundles.opensaml-2.6.2_3

[jbonofre] [maven-release-plugin] prepare for next development iteration

[jbonofre] [maven-release-plugin] prepare release org.apache.servicemix.bundles.opensaml-2.6.4_2

[jbonofre] [maven-release-plugin] prepare for next development iteration

[jbonofre] [maven-release-plugin] prepare release org.apache.servicemix.bundles.opensaml-2.6.5_2

[jbonofre] [maven-release-plugin] prepare for next development iteration

------------------------------------------
Started by an SCM change
Building remotely on ubuntu3 (Ubuntu ubuntu legacy-ubuntu) in workspace <https://builds.apache.org/job/ServiceMix-Bundles/ws/>
 > git rev-parse --is-inside-work-tree # timeout=10
Fetching changes from the remote Git repository
 > git config remote.origin.url https://git-wip-us.apache.org/repos/asf/servicemix-bundles.git # timeout=10
Fetching upstream changes from https://git-wip-us.apache.org/repos/asf/servicemix-bundles.git
 > git --version # timeout=10
 > git fetch --tags --progress https://git-wip-us.apache.org/repos/asf/servicemix-bundles.git +refs/heads/*:refs/remotes/origin/*
 > git rev-parse refs/remotes/origin/master^{commit} # timeout=10
 > git rev-parse refs/remotes/origin/origin/master^{commit} # timeout=10
Checking out Revision d07b9a33835a25e2a3d7d935dc3bb8c35b97efa0 (refs/remotes/origin/master)
 > git config core.sparsecheckout # timeout=10
 > git checkout -f d07b9a33835a25e2a3d7d935dc3bb8c35b97efa0
 > git rev-list e7f76c463bd9fae26f18886ec09c8148057500db # timeout=10
Parsing POMs
Modules changed, recalculating dependency graph
maven3-agent.jar already up to date
maven3-interceptor.jar already up to date
maven3-interceptor-commons.jar already up to date
[ServiceMix-Bundles] $ /home/jenkins/tools/java/latest1.6/bin/java -da -dsa -XX:MaxPermSize=192m -Xmx512M -cp /home/jenkins/jenkins-slave/maven3-agent.jar:/home/jenkins/jenkins-slave/tools/hudson.tasks.Maven_MavenInstallation/Maven_3.0.3/boot/plexus-classworlds-2.4.jar org.jvnet.hudson.maven3.agent.Maven3Main /home/jenkins/jenkins-slave/tools/hudson.tasks.Maven_MavenInstallation/Maven_3.0.3 /x1/jenkins/jenkins-slave/slave.jar /home/jenkins/jenkins-slave/maven3-interceptor.jar /home/jenkins/jenkins-slave/maven3-interceptor-commons.jar 53109
<===[JENKINS REMOTING CAPACITY]===>   channel started
Executing Maven:  -B -f <https://builds.apache.org/job/ServiceMix-Bundles/ws/pom.xml> -Dmaven.repo.local=<https://builds.apache.org/job/ServiceMix-Bundles/ws/.repository> -B -e clean install
[INFO] Error stacktraces are turned on.
[INFO] Scanning for projects...
[ERROR] The build could not read 1 project -> [Help 1]
org.apache.maven.project.ProjectBuildingException: Some problems were encountered while processing the POMs:
[ERROR] 'modules.module[52]' specifies duplicate child module poi-3.11 @ line 98, column 17
[ERROR] 'modules.module[53]' specifies duplicate child module swagger-core_2.11-1.3.12 @ line 99, column 17
[ERROR] 'modules.module[75]' specifies duplicate child module olingo-odata2-core-2.0.4 @ line 121, column 17

	at org.apache.maven.project.DefaultProjectBuilder.build(DefaultProjectBuilder.java:339)
	at org.apache.maven.DefaultMaven.collectProjects(DefaultMaven.java:632)
	at org.apache.maven.DefaultMaven.getProjectsForMavenReactor(DefaultMaven.java:581)
	at org.apache.maven.DefaultMaven.doExecute(DefaultMaven.java:233)
	at org.apache.maven.DefaultMaven.execute(DefaultMaven.java:156)
	at org.jvnet.hudson.maven3.launcher.Maven3Launcher.main(Maven3Launcher.java:117)
	at sun.reflect.NativeMethodAccessorImpl.invoke0(Native Method)
	at sun.reflect.NativeMethodAccessorImpl.invoke(NativeMethodAccessorImpl.java:39)
	at sun.reflect.DelegatingMethodAccessorImpl.invoke(DelegatingMethodAccessorImpl.java:25)
	at java.lang.reflect.Method.invoke(Method.java:597)
	at org.codehaus.plexus.classworlds.launcher.Launcher.launchStandard(Launcher.java:329)
	at org.codehaus.plexus.classworlds.launcher.Launcher.launch(Launcher.java:239)
	at org.jvnet.hudson.maven3.agent.Maven3Main.launch(Maven3Main.java:178)
	at sun.reflect.NativeMethodAccessorImpl.invoke0(Native Method)
	at sun.reflect.NativeMethodAccessorImpl.invoke(NativeMethodAccessorImpl.java:39)
	at sun.reflect.DelegatingMethodAccessorImpl.invoke(DelegatingMethodAccessorImpl.java:25)
	at java.lang.reflect.Method.invoke(Method.java:597)
	at hudson.maven.Maven3Builder.call(Maven3Builder.java:136)
	at hudson.maven.Maven3Builder.call(Maven3Builder.java:71)
	at hudson.remoting.UserRequest.perform(UserRequest.java:118)
	at hudson.remoting.UserRequest.perform(UserRequest.java:48)
	at hudson.remoting.Request$2.run(Request.java:328)
	at hudson.remoting.InterceptingExecutorService$1.call(InterceptingExecutorService.java:72)
	at java.util.concurrent.FutureTask$Sync.innerRun(FutureTask.java:303)
	at java.util.concurrent.FutureTask.run(FutureTask.java:138)
	at java.util.concurrent.ThreadPoolExecutor$Worker.runTask(ThreadPoolExecutor.java:895)
	at java.util.concurrent.ThreadPoolExecutor$Worker.run(ThreadPoolExecutor.java:918)
	at java.lang.Thread.run(Thread.java:662)
[ERROR]   
[ERROR]   The project org.apache.servicemix.bundles:org.apache.servicemix.bundles.pom:1-SNAPSHOT (<https://builds.apache.org/job/ServiceMix-Bundles/ws/pom.xml)> has 3 errors
[ERROR]     'modules.module[52]' specifies duplicate child module poi-3.11 @ line 98, column 17
[ERROR]     'modules.module[53]' specifies duplicate child module swagger-core_2.11-1.3.12 @ line 99, column 17
[ERROR]     'modules.module[75]' specifies duplicate child module olingo-odata2-core-2.0.4 @ line 121, column 17
[ERROR] 
[ERROR] Re-run Maven using the -X switch to enable full debug logging.
[ERROR] 
[ERROR] For more information about the errors and possible solutions, please read the following articles:
[ERROR] [Help 1] http://cwiki.apache.org/confluence/display/MAVEN/ProjectBuildingException
channel stopped

Build failed in Jenkins: ServiceMix-Bundles #834

Posted by Apache Jenkins Server <je...@builds.apache.org>.
See <https://builds.apache.org/job/ServiceMix-Bundles/834/changes>

Changes:

[jbonofre] [maven-release-plugin] prepare release org.apache.servicemix.bundles.swagger-core-1.3.2_2

[jbonofre] [maven-release-plugin] prepare for next development iteration

[jbonofre] [maven-release-plugin] prepare release org.apache.servicemix.bundles.swagger-core-1.3.4_2

[jbonofre] [maven-release-plugin] prepare for next development iteration

[jbonofre] [maven-release-plugin] prepare release org.apache.servicemix.bundles.swagger-core-1.3.5_2

[jbonofre] [maven-release-plugin] prepare for next development iteration

[jbonofre] [maven-release-plugin] prepare release org.apache.servicemix.bundles.swagger-core-1.3.7_2

[jbonofre] [maven-release-plugin] prepare for next development iteration

[jbonofre] [maven-release-plugin] prepare release org.apache.servicemix.bundles.swagger-core-1.3.8_2

[jbonofre] [maven-release-plugin] prepare for next development iteration

[jbonofre] [maven-release-plugin] prepare release org.apache.servicemix.bundles.swagger-core-1.3.10_2

[jbonofre] [maven-release-plugin] prepare for next development iteration

------------------------------------------
Started by an SCM change
Building remotely on ubuntu-5 (docker Ubuntu ubuntu5 ubuntu) in workspace <https://builds.apache.org/job/ServiceMix-Bundles/ws/>
 > git rev-parse --is-inside-work-tree # timeout=10
Fetching changes from the remote Git repository
 > git config remote.origin.url https://git-wip-us.apache.org/repos/asf/servicemix-bundles.git # timeout=10
Fetching upstream changes from https://git-wip-us.apache.org/repos/asf/servicemix-bundles.git
 > git --version # timeout=10
 > git fetch --tags --progress https://git-wip-us.apache.org/repos/asf/servicemix-bundles.git +refs/heads/*:refs/remotes/origin/*
 > git rev-parse refs/remotes/origin/master^{commit} # timeout=10
 > git rev-parse refs/remotes/origin/origin/master^{commit} # timeout=10
Checking out Revision e7f76c463bd9fae26f18886ec09c8148057500db (refs/remotes/origin/master)
 > git config core.sparsecheckout # timeout=10
 > git checkout -f e7f76c463bd9fae26f18886ec09c8148057500db
 > git rev-list ae84d5e73c484e296fd387059b75b8e1bb305b2b # timeout=10
Parsing POMs
Downloaded artifact http://repo.maven.apache.org/maven2/org/apache/servicemix/servicemix-pom/5/servicemix-pom-5.pom
Downloaded artifact http://repo.maven.apache.org/maven2/org/apache/apache/7/apache-7.pom
Downloaded artifact http://repo.maven.apache.org/maven2/org/apache/servicemix/bundles/bundles-pom/12/bundles-pom-12.pom
Downloaded artifact http://repo.maven.apache.org/maven2/org/apache/servicemix/bundles/bundles-pom/11/bundles-pom-11.pom
Modules changed, recalculating dependency graph
maven3-agent.jar already up to date
maven3-interceptor.jar already up to date
maven3-interceptor-commons.jar already up to date
[ServiceMix-Bundles] $ /home/jenkins/tools/java/latest1.6/bin/java -da -dsa -XX:MaxPermSize=192m -Xmx512M -cp /home/jenkins/jenkins-slave/maven3-agent.jar:/home/jenkins/jenkins-slave/tools/hudson.tasks.Maven_MavenInstallation/Maven_3.0.3/boot/plexus-classworlds-2.4.jar org.jvnet.hudson.maven3.agent.Maven3Main /home/jenkins/jenkins-slave/tools/hudson.tasks.Maven_MavenInstallation/Maven_3.0.3 /home/jenkins/jenkins-slave/slave.jar /home/jenkins/jenkins-slave/maven3-interceptor.jar /home/jenkins/jenkins-slave/maven3-interceptor-commons.jar 52263
<===[JENKINS REMOTING CAPACITY]===>   channel started
Executing Maven:  -B -f <https://builds.apache.org/job/ServiceMix-Bundles/ws/pom.xml> -Dmaven.repo.local=<https://builds.apache.org/job/ServiceMix-Bundles/ws/.repository> -B -e clean install
[INFO] Error stacktraces are turned on.
[INFO] Scanning for projects...
[ERROR] The build could not read 1 project -> [Help 1]
org.apache.maven.project.ProjectBuildingException: Some problems were encountered while processing the POMs:
[ERROR] 'modules.module[52]' specifies duplicate child module poi-3.11 @ line 98, column 17
[ERROR] 'modules.module[53]' specifies duplicate child module swagger-core_2.11-1.3.12 @ line 99, column 17
[ERROR] 'modules.module[75]' specifies duplicate child module olingo-odata2-core-2.0.4 @ line 121, column 17

	at org.apache.maven.project.DefaultProjectBuilder.build(DefaultProjectBuilder.java:339)
	at org.apache.maven.DefaultMaven.collectProjects(DefaultMaven.java:632)
	at org.apache.maven.DefaultMaven.getProjectsForMavenReactor(DefaultMaven.java:581)
	at org.apache.maven.DefaultMaven.doExecute(DefaultMaven.java:233)
	at org.apache.maven.DefaultMaven.execute(DefaultMaven.java:156)
	at org.jvnet.hudson.maven3.launcher.Maven3Launcher.main(Maven3Launcher.java:117)
	at sun.reflect.NativeMethodAccessorImpl.invoke0(Native Method)
	at sun.reflect.NativeMethodAccessorImpl.invoke(NativeMethodAccessorImpl.java:39)
	at sun.reflect.DelegatingMethodAccessorImpl.invoke(DelegatingMethodAccessorImpl.java:25)
	at java.lang.reflect.Method.invoke(Method.java:597)
	at org.codehaus.plexus.classworlds.launcher.Launcher.launchStandard(Launcher.java:329)
	at org.codehaus.plexus.classworlds.launcher.Launcher.launch(Launcher.java:239)
	at org.jvnet.hudson.maven3.agent.Maven3Main.launch(Maven3Main.java:178)
	at sun.reflect.NativeMethodAccessorImpl.invoke0(Native Method)
	at sun.reflect.NativeMethodAccessorImpl.invoke(NativeMethodAccessorImpl.java:39)
	at sun.reflect.DelegatingMethodAccessorImpl.invoke(DelegatingMethodAccessorImpl.java:25)
	at java.lang.reflect.Method.invoke(Method.java:597)
	at hudson.maven.Maven3Builder.call(Maven3Builder.java:136)
	at hudson.maven.Maven3Builder.call(Maven3Builder.java:71)
	at hudson.remoting.UserRequest.perform(UserRequest.java:118)
	at hudson.remoting.UserRequest.perform(UserRequest.java:48)
	at hudson.remoting.Request$2.run(Request.java:328)
	at hudson.remoting.InterceptingExecutorService$1.call(InterceptingExecutorService.java:72)
	at java.util.concurrent.FutureTask$Sync.innerRun(FutureTask.java:303)
	at java.util.concurrent.FutureTask.run(FutureTask.java:138)
	at java.util.concurrent.ThreadPoolExecutor$Worker.runTask(ThreadPoolExecutor.java:895)
	at java.util.concurrent.ThreadPoolExecutor$Worker.run(ThreadPoolExecutor.java:918)
	at java.lang.Thread.run(Thread.java:662)
[ERROR]   
[ERROR]   The project org.apache.servicemix.bundles:org.apache.servicemix.bundles.pom:1-SNAPSHOT (<https://builds.apache.org/job/ServiceMix-Bundles/ws/pom.xml)> has 3 errors
[ERROR]     'modules.module[52]' specifies duplicate child module poi-3.11 @ line 98, column 17
[ERROR]     'modules.module[53]' specifies duplicate child module swagger-core_2.11-1.3.12 @ line 99, column 17
[ERROR]     'modules.module[75]' specifies duplicate child module olingo-odata2-core-2.0.4 @ line 121, column 17
[ERROR] 
[ERROR] Re-run Maven using the -X switch to enable full debug logging.
[ERROR] 
[ERROR] For more information about the errors and possible solutions, please read the following articles:
[ERROR] [Help 1] http://cwiki.apache.org/confluence/display/MAVEN/ProjectBuildingException
channel stopped

Build failed in Jenkins: ServiceMix-Bundles #833

Posted by Apache Jenkins Server <je...@builds.apache.org>.
See <https://builds.apache.org/job/ServiceMix-Bundles/833/changes>

Changes:

[jbonofre] Rollback bundles-2015.05 release

[jbonofre] Rollback bundles-2015.05 release

[jbonofre] Rollback bundles-2015.05 release

[jbonofre] Rollback bundles-2015.05 release

[jbonofre] Rollback bundles-2015.05 release

[jbonofre] Rollback bundles-2015.05 release

[jbonofre] Rollback bundles-2015.05 release

[jbonofre] Rollback bundles-2015.05 release

[jbonofre] Rollback bundles-2015.05 release

[jbonofre] Rollback bundles-2015.05 release

------------------------------------------
Started by an SCM change
Building remotely on ubuntu3 (Ubuntu ubuntu legacy-ubuntu) in workspace <https://builds.apache.org/job/ServiceMix-Bundles/ws/>
 > git rev-parse --is-inside-work-tree # timeout=10
Fetching changes from the remote Git repository
 > git config remote.origin.url https://git-wip-us.apache.org/repos/asf/servicemix-bundles.git # timeout=10
Fetching upstream changes from https://git-wip-us.apache.org/repos/asf/servicemix-bundles.git
 > git --version # timeout=10
 > git fetch --tags --progress https://git-wip-us.apache.org/repos/asf/servicemix-bundles.git +refs/heads/*:refs/remotes/origin/*
 > git rev-parse refs/remotes/origin/master^{commit} # timeout=10
 > git rev-parse refs/remotes/origin/origin/master^{commit} # timeout=10
Checking out Revision ae84d5e73c484e296fd387059b75b8e1bb305b2b (refs/remotes/origin/master)
 > git config core.sparsecheckout # timeout=10
 > git checkout -f ae84d5e73c484e296fd387059b75b8e1bb305b2b
 > git rev-list e038862f9c7faacc776ba2bcd5ac073a44dd4dd6 # timeout=10
Parsing POMs
Downloaded artifact http://repo.maven.apache.org/maven2/org/apache/servicemix/servicemix-pom/5/servicemix-pom-5.pom
Downloaded artifact http://repo.maven.apache.org/maven2/org/apache/apache/7/apache-7.pom
Downloaded artifact http://repo.maven.apache.org/maven2/org/apache/servicemix/bundles/bundles-pom/12/bundles-pom-12.pom
Downloaded artifact http://repo.maven.apache.org/maven2/org/apache/servicemix/bundles/bundles-pom/11/bundles-pom-11.pom
Modules changed, recalculating dependency graph
maven3-agent.jar already up to date
maven3-interceptor.jar already up to date
maven3-interceptor-commons.jar already up to date
[ServiceMix-Bundles] $ /home/jenkins/tools/java/latest1.6/bin/java -da -dsa -XX:MaxPermSize=192m -Xmx512M -cp /home/jenkins/jenkins-slave/maven3-agent.jar:/home/jenkins/jenkins-slave/tools/hudson.tasks.Maven_MavenInstallation/Maven_3.0.3/boot/plexus-classworlds-2.4.jar org.jvnet.hudson.maven3.agent.Maven3Main /home/jenkins/jenkins-slave/tools/hudson.tasks.Maven_MavenInstallation/Maven_3.0.3 /x1/jenkins/jenkins-slave/slave.jar /home/jenkins/jenkins-slave/maven3-interceptor.jar /home/jenkins/jenkins-slave/maven3-interceptor-commons.jar 36213
<===[JENKINS REMOTING CAPACITY]===>   channel started
Executing Maven:  -B -f <https://builds.apache.org/job/ServiceMix-Bundles/ws/pom.xml> -Dmaven.repo.local=<https://builds.apache.org/job/ServiceMix-Bundles/ws/.repository> -B -e clean install
[INFO] Error stacktraces are turned on.
[INFO] Scanning for projects...
[ERROR] The build could not read 1 project -> [Help 1]
org.apache.maven.project.ProjectBuildingException: Some problems were encountered while processing the POMs:
[ERROR] 'modules.module[52]' specifies duplicate child module poi-3.11 @ line 98, column 17
[ERROR] 'modules.module[53]' specifies duplicate child module swagger-core_2.11-1.3.12 @ line 99, column 17
[ERROR] 'modules.module[75]' specifies duplicate child module olingo-odata2-core-2.0.4 @ line 121, column 17

	at org.apache.maven.project.DefaultProjectBuilder.build(DefaultProjectBuilder.java:339)
	at org.apache.maven.DefaultMaven.collectProjects(DefaultMaven.java:632)
	at org.apache.maven.DefaultMaven.getProjectsForMavenReactor(DefaultMaven.java:581)
	at org.apache.maven.DefaultMaven.doExecute(DefaultMaven.java:233)
	at org.apache.maven.DefaultMaven.execute(DefaultMaven.java:156)
	at org.jvnet.hudson.maven3.launcher.Maven3Launcher.main(Maven3Launcher.java:117)
	at sun.reflect.NativeMethodAccessorImpl.invoke0(Native Method)
	at sun.reflect.NativeMethodAccessorImpl.invoke(NativeMethodAccessorImpl.java:39)
	at sun.reflect.DelegatingMethodAccessorImpl.invoke(DelegatingMethodAccessorImpl.java:25)
	at java.lang.reflect.Method.invoke(Method.java:597)
	at org.codehaus.plexus.classworlds.launcher.Launcher.launchStandard(Launcher.java:329)
	at org.codehaus.plexus.classworlds.launcher.Launcher.launch(Launcher.java:239)
	at org.jvnet.hudson.maven3.agent.Maven3Main.launch(Maven3Main.java:178)
	at sun.reflect.NativeMethodAccessorImpl.invoke0(Native Method)
	at sun.reflect.NativeMethodAccessorImpl.invoke(NativeMethodAccessorImpl.java:39)
	at sun.reflect.DelegatingMethodAccessorImpl.invoke(DelegatingMethodAccessorImpl.java:25)
	at java.lang.reflect.Method.invoke(Method.java:597)
	at hudson.maven.Maven3Builder.call(Maven3Builder.java:136)
	at hudson.maven.Maven3Builder.call(Maven3Builder.java:71)
	at hudson.remoting.UserRequest.perform(UserRequest.java:118)
	at hudson.remoting.UserRequest.perform(UserRequest.java:48)
	at hudson.remoting.Request$2.run(Request.java:328)
	at hudson.remoting.InterceptingExecutorService$1.call(InterceptingExecutorService.java:72)
	at java.util.concurrent.FutureTask$Sync.innerRun(FutureTask.java:303)
	at java.util.concurrent.FutureTask.run(FutureTask.java:138)
	at java.util.concurrent.ThreadPoolExecutor$Worker.runTask(ThreadPoolExecutor.java:895)
	at java.util.concurrent.ThreadPoolExecutor$Worker.run(ThreadPoolExecutor.java:918)
	at java.lang.Thread.run(Thread.java:662)
[ERROR]   
[ERROR]   The project org.apache.servicemix.bundles:org.apache.servicemix.bundles.pom:1-SNAPSHOT (<https://builds.apache.org/job/ServiceMix-Bundles/ws/pom.xml)> has 3 errors
[ERROR]     'modules.module[52]' specifies duplicate child module poi-3.11 @ line 98, column 17
[ERROR]     'modules.module[53]' specifies duplicate child module swagger-core_2.11-1.3.12 @ line 99, column 17
[ERROR]     'modules.module[75]' specifies duplicate child module olingo-odata2-core-2.0.4 @ line 121, column 17
[ERROR] 
[ERROR] Re-run Maven using the -X switch to enable full debug logging.
[ERROR] 
[ERROR] For more information about the errors and possible solutions, please read the following articles:
[ERROR] [Help 1] http://cwiki.apache.org/confluence/display/MAVEN/ProjectBuildingException
channel stopped

Build failed in Jenkins: ServiceMix-Bundles #832

Posted by Apache Jenkins Server <je...@builds.apache.org>.
See <https://builds.apache.org/job/ServiceMix-Bundles/832/changes>

Changes:

[jbonofre] [maven-release-plugin] prepare release org.apache.servicemix.bundles.spring-jms-3.2.13.RELEASE_2

[jbonofre] [maven-release-plugin] prepare for next development iteration

[jbonofre] Rollback release

[jbonofre] Rollback bundles-2015.05 release

[jbonofre] Rollback bundles-2015.05 release

[jbonofre] Rollback bundles-2015.05 release

[jbonofre] Rollback bundles-2015.05 release

[jbonofre] Rollback bundles-2015.05 release

------------------------------------------
Started by an SCM change
Building remotely on ubuntu-4 (docker Ubuntu ubuntu4 ubuntu) in workspace <https://builds.apache.org/job/ServiceMix-Bundles/ws/>
 > git rev-parse --is-inside-work-tree # timeout=10
Fetching changes from the remote Git repository
 > git config remote.origin.url https://git-wip-us.apache.org/repos/asf/servicemix-bundles.git # timeout=10
Fetching upstream changes from https://git-wip-us.apache.org/repos/asf/servicemix-bundles.git
 > git --version # timeout=10
 > git fetch --tags --progress https://git-wip-us.apache.org/repos/asf/servicemix-bundles.git +refs/heads/*:refs/remotes/origin/*
 > git rev-parse refs/remotes/origin/master^{commit} # timeout=10
 > git rev-parse refs/remotes/origin/origin/master^{commit} # timeout=10
Checking out Revision e038862f9c7faacc776ba2bcd5ac073a44dd4dd6 (refs/remotes/origin/master)
 > git config core.sparsecheckout # timeout=10
 > git checkout -f e038862f9c7faacc776ba2bcd5ac073a44dd4dd6
 > git rev-list 0c7c54c94153b1eddfc74f43408eca7139631834 # timeout=10
Parsing POMs
Downloaded artifact http://repo.maven.apache.org/maven2/org/apache/servicemix/servicemix-pom/5/servicemix-pom-5.pom
Downloaded artifact http://repo.maven.apache.org/maven2/org/apache/apache/7/apache-7.pom
Downloaded artifact http://repo.maven.apache.org/maven2/org/apache/servicemix/bundles/bundles-pom/12/bundles-pom-12.pom
Downloaded artifact http://repo.maven.apache.org/maven2/org/apache/servicemix/bundles/bundles-pom/11/bundles-pom-11.pom
Modules changed, recalculating dependency graph
maven3-agent.jar already up to date
maven3-interceptor.jar already up to date
maven3-interceptor-commons.jar already up to date
[ServiceMix-Bundles] $ /home/jenkins/tools/java/latest1.6/bin/java -da -dsa -XX:MaxPermSize=192m -Xmx512M -cp /home/jenkins/jenkins-slave/maven3-agent.jar:/home/jenkins/jenkins-slave/tools/hudson.tasks.Maven_MavenInstallation/Maven_3.0.3/boot/plexus-classworlds-2.4.jar org.jvnet.hudson.maven3.agent.Maven3Main /home/jenkins/jenkins-slave/tools/hudson.tasks.Maven_MavenInstallation/Maven_3.0.3 /home/jenkins/jenkins-slave/slave.jar /home/jenkins/jenkins-slave/maven3-interceptor.jar /home/jenkins/jenkins-slave/maven3-interceptor-commons.jar 52359
<===[JENKINS REMOTING Cchannel started
APACITY]===>   Executing Maven:  -B -f <https://builds.apache.org/job/ServiceMix-Bundles/ws/pom.xml> -Dmaven.repo.local=<https://builds.apache.org/job/ServiceMix-Bundles/ws/.repository> -B -e clean install
[INFO] Error stacktraces are turned on.
[INFO] Scanning for projects...
[ERROR] The build could not read 1 project -> [Help 1]
org.apache.maven.project.ProjectBuildingException: Some problems were encountered while processing the POMs:
[ERROR] 'modules.module[52]' specifies duplicate child module poi-3.11 @ line 98, column 17
[ERROR] 'modules.module[53]' specifies duplicate child module swagger-core_2.11-1.3.12 @ line 99, column 17
[ERROR] 'modules.module[75]' specifies duplicate child module olingo-odata2-core-2.0.4 @ line 121, column 17

	at org.apache.maven.project.DefaultProjectBuilder.build(DefaultProjectBuilder.java:339)
	at org.apache.maven.DefaultMaven.collectProjects(DefaultMaven.java:632)
	at org.apache.maven.DefaultMaven.getProjectsForMavenReactor(DefaultMaven.java:581)
	at org.apache.maven.DefaultMaven.doExecute(DefaultMaven.java:233)
	at org.apache.maven.DefaultMaven.execute(DefaultMaven.java:156)
	at org.jvnet.hudson.maven3.launcher.Maven3Launcher.main(Maven3Launcher.java:117)
	at sun.reflect.NativeMethodAccessorImpl.invoke0(Native Method)
	at sun.reflect.NativeMethodAccessorImpl.invoke(NativeMethodAccessorImpl.java:39)
	at sun.reflect.DelegatingMethodAccessorImpl.invoke(DelegatingMethodAccessorImpl.java:25)
	at java.lang.reflect.Method.invoke(Method.java:597)
	at org.codehaus.plexus.classworlds.launcher.Launcher.launchStandard(Launcher.java:329)
	at org.codehaus.plexus.classworlds.launcher.Launcher.launch(Launcher.java:239)
	at org.jvnet.hudson.maven3.agent.Maven3Main.launch(Maven3Main.java:178)
	at sun.reflect.NativeMethodAccessorImpl.invoke0(Native Method)
	at sun.reflect.NativeMethodAccessorImpl.invoke(NativeMethodAccessorImpl.java:39)
	at sun.reflect.DelegatingMethodAccessorImpl.invoke(DelegatingMethodAccessorImpl.java:25)
	at java.lang.reflect.Method.invoke(Method.java:597)
	at hudson.maven.Maven3Builder.call(Maven3Builder.java:136)
	at hudson.maven.Maven3Builder.call(Maven3Builder.java:71)
	at hudson.remoting.UserRequest.perform(UserRequest.java:118)
	at hudson.remoting.UserRequest.perform(UserRequest.java:48)
	at hudson.remoting.Request$2.run(Request.java:328)
	at hudson.remoting.InterceptingExecutorService$1.call(InterceptingExecutorService.java:72)
	at java.util.concurrent.FutureTask$Sync.innerRun(FutureTask.java:303)
	at java.util.concurrent.FutureTask.run(FutureTask.java:138)
	at java.util.concurrent.ThreadPoolExecutor$Worker.runTask(ThreadPoolExecutor.java:895)
	at java.util.concurrent.ThreadPoolExecutor$Worker.run(ThreadPoolExecutor.java:918)
	at java.lang.Thread.run(Thread.java:662)
[ERROR]   
[ERROR]   The project org.apache.servicemix.bundles:org.apache.servicemix.bundles.pom:1-SNAPSHOT (<https://builds.apache.org/job/ServiceMix-Bundles/ws/pom.xml)> has 3 errors
[ERROR]     'modules.module[52]' specifies duplicate child module poi-3.11 @ line 98, column 17
[ERROR]     'modules.module[53]' specifies duplicate child module swagger-core_2.11-1.3.12 @ line 99, column 17
[ERROR]     'modules.module[75]' specifies duplicate child module olingo-odata2-core-2.0.4 @ line 121, column 17
[ERROR] 
[ERROR] Re-run Maven using the -X switch to enable full debug logging.
[ERROR] 
[ERROR] For more information about the errors and possible solutions, please read the following articles:
[ERROR] [Help 1] http://cwiki.apache.org/confluence/display/MAVEN/ProjectBuildingException
channel stopped

Build failed in Jenkins: ServiceMix-Bundles #831

Posted by Apache Jenkins Server <je...@builds.apache.org>.
See <https://builds.apache.org/job/ServiceMix-Bundles/831/changes>

Changes:

[freeman.fang] [SM-2585]Create OSGi bundle for jsch 0.1.53

------------------------------------------
Started by an SCM change
Building remotely on ubuntu3 (Ubuntu ubuntu legacy-ubuntu) in workspace <https://builds.apache.org/job/ServiceMix-Bundles/ws/>
 > git rev-parse --is-inside-work-tree # timeout=10
Fetching changes from the remote Git repository
 > git config remote.origin.url https://git-wip-us.apache.org/repos/asf/servicemix-bundles.git # timeout=10
Fetching upstream changes from https://git-wip-us.apache.org/repos/asf/servicemix-bundles.git
 > git --version # timeout=10
 > git fetch --tags --progress https://git-wip-us.apache.org/repos/asf/servicemix-bundles.git +refs/heads/*:refs/remotes/origin/*
 > git rev-parse refs/remotes/origin/master^{commit} # timeout=10
 > git rev-parse refs/remotes/origin/origin/master^{commit} # timeout=10
Checking out Revision 0c7c54c94153b1eddfc74f43408eca7139631834 (refs/remotes/origin/master)
 > git config core.sparsecheckout # timeout=10
 > git checkout -f 0c7c54c94153b1eddfc74f43408eca7139631834
 > git rev-list 0ce72cdef654c5663674dad35e68f171a69c6e9f # timeout=10
Parsing POMs
Modules changed, recalculating dependency graph
maven3-agent.jar already up to date
maven3-interceptor.jar already up to date
maven3-interceptor-commons.jar already up to date
[ServiceMix-Bundles] $ /home/jenkins/tools/java/latest1.6/bin/java -da -dsa -XX:MaxPermSize=192m -Xmx512M -cp /home/jenkins/jenkins-slave/maven3-agent.jar:/home/jenkins/jenkins-slave/tools/hudson.tasks.Maven_MavenInstallation/Maven_3.0.3/boot/plexus-classworlds-2.4.jar org.jvnet.hudson.maven3.agent.Maven3Main /home/jenkins/jenkins-slave/tools/hudson.tasks.Maven_MavenInstallation/Maven_3.0.3 /x1/jenkins/jenkins-slave/slave.jar /home/jenkins/jenkins-slave/maven3-interceptor.jar /home/jenkins/jenkins-slave/maven3-interceptor-commons.jar 33105
<===[JENKINS REMOTING CAPACITY]===>   channel started
Executing Maven:  -B -f <https://builds.apache.org/job/ServiceMix-Bundles/ws/pom.xml> -Dmaven.repo.local=<https://builds.apache.org/job/ServiceMix-Bundles/ws/.repository> -B -e clean install
[INFO] Error stacktraces are turned on.
[INFO] Scanning for projects...
[ERROR] The build could not read 1 project -> [Help 1]
org.apache.maven.project.ProjectBuildingException: Some problems were encountered while processing the POMs:
[ERROR] 'modules.module[52]' specifies duplicate child module poi-3.11 @ line 98, column 17
[ERROR] 'modules.module[53]' specifies duplicate child module swagger-core_2.11-1.3.12 @ line 99, column 17
[ERROR] 'modules.module[75]' specifies duplicate child module olingo-odata2-core-2.0.4 @ line 121, column 17

	at org.apache.maven.project.DefaultProjectBuilder.build(DefaultProjectBuilder.java:339)
	at org.apache.maven.DefaultMaven.collectProjects(DefaultMaven.java:632)
	at org.apache.maven.DefaultMaven.getProjectsForMavenReactor(DefaultMaven.java:581)
	at org.apache.maven.DefaultMaven.doExecute(DefaultMaven.java:233)
	at org.apache.maven.DefaultMaven.execute(DefaultMaven.java:156)
	at org.jvnet.hudson.maven3.launcher.Maven3Launcher.main(Maven3Launcher.java:117)
	at sun.reflect.NativeMethodAccessorImpl.invoke0(Native Method)
	at sun.reflect.NativeMethodAccessorImpl.invoke(NativeMethodAccessorImpl.java:39)
	at sun.reflect.DelegatingMethodAccessorImpl.invoke(DelegatingMethodAccessorImpl.java:25)
	at java.lang.reflect.Method.invoke(Method.java:597)
	at org.codehaus.plexus.classworlds.launcher.Launcher.launchStandard(Launcher.java:329)
	at org.codehaus.plexus.classworlds.launcher.Launcher.launch(Launcher.java:239)
	at org.jvnet.hudson.maven3.agent.Maven3Main.launch(Maven3Main.java:178)
	at sun.reflect.NativeMethodAccessorImpl.invoke0(Native Method)
	at sun.reflect.NativeMethodAccessorImpl.invoke(NativeMethodAccessorImpl.java:39)
	at sun.reflect.DelegatingMethodAccessorImpl.invoke(DelegatingMethodAccessorImpl.java:25)
	at java.lang.reflect.Method.invoke(Method.java:597)
	at hudson.maven.Maven3Builder.call(Maven3Builder.java:136)
	at hudson.maven.Maven3Builder.call(Maven3Builder.java:71)
	at hudson.remoting.UserRequest.perform(UserRequest.java:118)
	at hudson.remoting.UserRequest.perform(UserRequest.java:48)
	at hudson.remoting.Request$2.run(Request.java:328)
	at hudson.remoting.InterceptingExecutorService$1.call(InterceptingExecutorService.java:72)
	at java.util.concurrent.FutureTask$Sync.innerRun(FutureTask.java:303)
	at java.util.concurrent.FutureTask.run(FutureTask.java:138)
	at java.util.concurrent.ThreadPoolExecutor$Worker.runTask(ThreadPoolExecutor.java:895)
	at java.util.concurrent.ThreadPoolExecutor$Worker.run(ThreadPoolExecutor.java:918)
	at java.lang.Thread.run(Thread.java:662)
[ERROR]   
[ERROR]   The project org.apache.servicemix.bundles:org.apache.servicemix.bundles.pom:1-SNAPSHOT (<https://builds.apache.org/job/ServiceMix-Bundles/ws/pom.xml)> has 3 errors
[ERROR]     'modules.module[52]' specifies duplicate child module poi-3.11 @ line 98, column 17
[ERROR]     'modules.module[53]' specifies duplicate child module swagger-core_2.11-1.3.12 @ line 99, column 17
[ERROR]     'modules.module[75]' specifies duplicate child module olingo-odata2-core-2.0.4 @ line 121, column 17
[ERROR] 
[ERROR] Re-run Maven using the -X switch to enable full debug logging.
[ERROR] 
[ERROR] For more information about the errors and possible solutions, please read the following articles:
[ERROR] [Help 1] http://cwiki.apache.org/confluence/display/MAVEN/ProjectBuildingException
channel stopped

Build failed in Jenkins: ServiceMix-Bundles #830

Posted by Apache Jenkins Server <je...@builds.apache.org>.
See <https://builds.apache.org/job/ServiceMix-Bundles/830/changes>

Changes:

[freeman.fang] [SM-2582]Aws-sdk-java: Bundle for version 1.9.40

[freeman.fang] [SM-2583]Servicemix bundle for Olingo2 must include resource bundle from olingo-odata2-core-xxx.jar

------------------------------------------
Started by an SCM change
Building remotely on H11 (Ubuntu ubuntu) in workspace <https://builds.apache.org/job/ServiceMix-Bundles/ws/>
 > git rev-parse --is-inside-work-tree # timeout=10
Fetching changes from the remote Git repository
 > git config remote.origin.url https://git-wip-us.apache.org/repos/asf/servicemix-bundles.git # timeout=10
Fetching upstream changes from https://git-wip-us.apache.org/repos/asf/servicemix-bundles.git
 > git --version # timeout=10
 > git fetch --tags --progress https://git-wip-us.apache.org/repos/asf/servicemix-bundles.git +refs/heads/*:refs/remotes/origin/*
 > git rev-parse refs/remotes/origin/master^{commit} # timeout=10
 > git rev-parse refs/remotes/origin/origin/master^{commit} # timeout=10
Checking out Revision 0ce72cdef654c5663674dad35e68f171a69c6e9f (refs/remotes/origin/master)
 > git config core.sparsecheckout # timeout=10
 > git checkout -f 0ce72cdef654c5663674dad35e68f171a69c6e9f
 > git rev-list 989400d20f06d62c3dda895112b4199cf1f65867 # timeout=10
Parsing POMs
Modules changed, recalculating dependency graph
maven3-agent.jar already up to date
maven3-interceptor.jar already up to date
maven3-interceptor-commons.jar already up to date
[ServiceMix-Bundles] $ /home/jenkins/tools/java/latest1.6/bin/java -da -dsa -XX:MaxPermSize=192m -Xmx512M -cp /home/jenkins/jenkins-slave/maven3-agent.jar:/home/jenkins/jenkins-slave/tools/hudson.tasks.Maven_MavenInstallation/Maven_3.0.3/boot/plexus-classworlds-2.4.jar org.jvnet.hudson.maven3.agent.Maven3Main /home/jenkins/jenkins-slave/tools/hudson.tasks.Maven_MavenInstallation/Maven_3.0.3 /home/jenkins/jenkins-slave/slave.jar /home/jenkins/jenkins-slave/maven3-interceptor.jar /home/jenkins/jenkins-slave/maven3-interceptor-commons.jar 37536
<===[JENKINS REMOTING CAPACITY]===>   channel started
Executing Maven:  -B -f <https://builds.apache.org/job/ServiceMix-Bundles/ws/pom.xml> -Dmaven.repo.local=<https://builds.apache.org/job/ServiceMix-Bundles/ws/.repository> -B -e clean install
[INFO] Error stacktraces are turned on.
[INFO] Scanning for projects...
[ERROR] The build could not read 1 project -> [Help 1]
org.apache.maven.project.ProjectBuildingException: Some problems were encountered while processing the POMs:
[ERROR] 'modules.module[52]' specifies duplicate child module poi-3.11 @ line 98, column 17
[ERROR] 'modules.module[53]' specifies duplicate child module swagger-core_2.11-1.3.12 @ line 99, column 17
[ERROR] 'modules.module[75]' specifies duplicate child module olingo-odata2-core-2.0.4 @ line 121, column 17

	at org.apache.maven.project.DefaultProjectBuilder.build(DefaultProjectBuilder.java:339)
	at org.apache.maven.DefaultMaven.collectProjects(DefaultMaven.java:632)
	at org.apache.maven.DefaultMaven.getProjectsForMavenReactor(DefaultMaven.java:581)
	at org.apache.maven.DefaultMaven.doExecute(DefaultMaven.java:233)
	at org.apache.maven.DefaultMaven.execute(DefaultMaven.java:156)
	at org.jvnet.hudson.maven3.launcher.Maven3Launcher.main(Maven3Launcher.java:117)
	at sun.reflect.NativeMethodAccessorImpl.invoke0(Native Method)
	at sun.reflect.NativeMethodAccessorImpl.invoke(NativeMethodAccessorImpl.java:39)
	at sun.reflect.DelegatingMethodAccessorImpl.invoke(DelegatingMethodAccessorImpl.java:25)
	at java.lang.reflect.Method.invoke(Method.java:597)
	at org.codehaus.plexus.classworlds.launcher.Launcher.launchStandard(Launcher.java:329)
	at org.codehaus.plexus.classworlds.launcher.Launcher.launch(Launcher.java:239)
	at org.jvnet.hudson.maven3.agent.Maven3Main.launch(Maven3Main.java:178)
	at sun.reflect.NativeMethodAccessorImpl.invoke0(Native Method)
	at sun.reflect.NativeMethodAccessorImpl.invoke(NativeMethodAccessorImpl.java:39)
	at sun.reflect.DelegatingMethodAccessorImpl.invoke(DelegatingMethodAccessorImpl.java:25)
	at java.lang.reflect.Method.invoke(Method.java:597)
	at hudson.maven.Maven3Builder.call(Maven3Builder.java:136)
	at hudson.maven.Maven3Builder.call(Maven3Builder.java:71)
	at hudson.remoting.UserRequest.perform(UserRequest.java:118)
	at hudson.remoting.UserRequest.perform(UserRequest.java:48)
	at hudson.remoting.Request$2.run(Request.java:328)
	at hudson.remoting.InterceptingExecutorService$1.call(InterceptingExecutorService.java:72)
	at java.util.concurrent.FutureTask$Sync.innerRun(FutureTask.java:303)
	at java.util.concurrent.FutureTask.run(FutureTask.java:138)
	at java.util.concurrent.ThreadPoolExecutor$Worker.runTask(ThreadPoolExecutor.java:895)
	at java.util.concurrent.ThreadPoolExecutor$Worker.run(ThreadPoolExecutor.java:918)
	at java.lang.Thread.run(Thread.java:662)
[ERROR]   
[ERROR]   The project org.apache.servicemix.bundles:org.apache.servicemix.bundles.pom:1-SNAPSHOT (<https://builds.apache.org/job/ServiceMix-Bundles/ws/pom.xml)> has 3 errors
[ERROR]     'modules.module[52]' specifies duplicate child module poi-3.11 @ line 98, column 17
[ERROR]     'modules.module[53]' specifies duplicate child module swagger-core_2.11-1.3.12 @ line 99, column 17
[ERROR]     'modules.module[75]' specifies duplicate child module olingo-odata2-core-2.0.4 @ line 121, column 17
[ERROR] 
[ERROR] Re-run Maven using the -X switch to enable full debug logging.
[ERROR] 
[ERROR] For more information about the errors and possible solutions, please read the following articles:
[ERROR] [Help 1] http://cwiki.apache.org/confluence/display/MAVEN/ProjectBuildingException
channel stopped

Build failed in Jenkins: ServiceMix-Bundles #829

Posted by Apache Jenkins Server <je...@builds.apache.org>.
See <https://builds.apache.org/job/ServiceMix-Bundles/829/changes>

Changes:

[jbonofre] Prepare bundles release

[jbonofre] [maven-release-plugin] prepare release org.apache.servicemix.bundles.spring-jdbc-3.2.13.RELEASE_2

[jbonofre] [maven-release-plugin] prepare for next development iteration

[jbonofre] Prepare bundles release

------------------------------------------
Started by an SCM change
Building remotely on ubuntu3 (Ubuntu ubuntu legacy-ubuntu) in workspace <https://builds.apache.org/job/ServiceMix-Bundles/ws/>
 > git rev-parse --is-inside-work-tree # timeout=10
Fetching changes from the remote Git repository
 > git config remote.origin.url https://git-wip-us.apache.org/repos/asf/servicemix-bundles.git # timeout=10
Fetching upstream changes from https://git-wip-us.apache.org/repos/asf/servicemix-bundles.git
 > git --version # timeout=10
 > git fetch --tags --progress https://git-wip-us.apache.org/repos/asf/servicemix-bundles.git +refs/heads/*:refs/remotes/origin/*
 > git rev-parse refs/remotes/origin/master^{commit} # timeout=10
 > git rev-parse refs/remotes/origin/origin/master^{commit} # timeout=10
Checking out Revision 989400d20f06d62c3dda895112b4199cf1f65867 (refs/remotes/origin/master)
 > git config core.sparsecheckout # timeout=10
 > git checkout -f 989400d20f06d62c3dda895112b4199cf1f65867
 > git rev-list 0a0edd5fb4362342d3c69bc622e45b47d784f4da # timeout=10
Parsing POMs
Modules changed, recalculating dependency graph
maven3-agent.jar already up to date
maven3-interceptor.jar already up to date
maven3-interceptor-commons.jar already up to date
[ServiceMix-Bundles] $ /home/jenkins/tools/java/latest1.6/bin/java -da -dsa -XX:MaxPermSize=192m -Xmx512M -cp /home/jenkins/jenkins-slave/maven3-agent.jar:/home/jenkins/jenkins-slave/tools/hudson.tasks.Maven_MavenInstallation/Maven_3.0.3/boot/plexus-classworlds-2.4.jar org.jvnet.hudson.maven3.agent.Maven3Main /home/jenkins/jenkins-slave/tools/hudson.tasks.Maven_MavenInstallation/Maven_3.0.3 /x1/jenkins/jenkins-slave/slave.jar /home/jenkins/jenkins-slave/maven3-interceptor.jar /home/jenkins/jenkins-slave/maven3-interceptor-commons.jar 58000
<===[JENKINS REMOTING CAPACITY]===>   channel started
Executing Maven:  -B -f <https://builds.apache.org/job/ServiceMix-Bundles/ws/pom.xml> -Dmaven.repo.local=<https://builds.apache.org/job/ServiceMix-Bundles/ws/.repository> -B -e clean install
[INFO] Error stacktraces are turned on.
[INFO] Scanning for projects...
[ERROR] The build could not read 1 project -> [Help 1]
org.apache.maven.project.ProjectBuildingException: Some problems were encountered while processing the POMs:
[ERROR] 'modules.module[52]' specifies duplicate child module poi-3.11 @ line 98, column 17
[ERROR] 'modules.module[53]' specifies duplicate child module swagger-core_2.11-1.3.12 @ line 99, column 17

	at org.apache.maven.project.DefaultProjectBuilder.build(DefaultProjectBuilder.java:339)
	at org.apache.maven.DefaultMaven.collectProjects(DefaultMaven.java:632)
	at org.apache.maven.DefaultMaven.getProjectsForMavenReactor(DefaultMaven.java:581)
	at org.apache.maven.DefaultMaven.doExecute(DefaultMaven.java:233)
	at org.apache.maven.DefaultMaven.execute(DefaultMaven.java:156)
	at org.jvnet.hudson.maven3.launcher.Maven3Launcher.main(Maven3Launcher.java:117)
	at sun.reflect.NativeMethodAccessorImpl.invoke0(Native Method)
	at sun.reflect.NativeMethodAccessorImpl.invoke(NativeMethodAccessorImpl.java:39)
	at sun.reflect.DelegatingMethodAccessorImpl.invoke(DelegatingMethodAccessorImpl.java:25)
	at java.lang.reflect.Method.invoke(Method.java:597)
	at org.codehaus.plexus.classworlds.launcher.Launcher.launchStandard(Launcher.java:329)
	at org.codehaus.plexus.classworlds.launcher.Launcher.launch(Launcher.java:239)
	at org.jvnet.hudson.maven3.agent.Maven3Main.launch(Maven3Main.java:178)
	at sun.reflect.NativeMethodAccessorImpl.invoke0(Native Method)
	at sun.reflect.NativeMethodAccessorImpl.invoke(NativeMethodAccessorImpl.java:39)
	at sun.reflect.DelegatingMethodAccessorImpl.invoke(DelegatingMethodAccessorImpl.java:25)
	at java.lang.reflect.Method.invoke(Method.java:597)
	at hudson.maven.Maven3Builder.call(Maven3Builder.java:136)
	at hudson.maven.Maven3Builder.call(Maven3Builder.java:71)
	at hudson.remoting.UserRequest.perform(UserRequest.java:118)
	at hudson.remoting.UserRequest.perform(UserRequest.java:48)
	at hudson.remoting.Request$2.run(Request.java:328)
	at hudson.remoting.InterceptingExecutorService$1.call(InterceptingExecutorService.java:72)
	at java.util.concurrent.FutureTask$Sync.innerRun(FutureTask.java:303)
	at java.util.concurrent.FutureTask.run(FutureTask.java:138)
	at java.util.concurrent.ThreadPoolExecutor$Worker.runTask(ThreadPoolExecutor.java:895)
	at java.util.concurrent.ThreadPoolExecutor$Worker.run(ThreadPoolExecutor.java:918)
	at java.lang.Thread.run(Thread.java:662)
[ERROR]   
[ERROR]   The project org.apache.servicemix.bundles:org.apache.servicemix.bundles.pom:1-SNAPSHOT (<https://builds.apache.org/job/ServiceMix-Bundles/ws/pom.xml)> has 2 errors
[ERROR]     'modules.module[52]' specifies duplicate child module poi-3.11 @ line 98, column 17
[ERROR]     'modules.module[53]' specifies duplicate child module swagger-core_2.11-1.3.12 @ line 99, column 17
[ERROR] 
[ERROR] Re-run Maven using the -X switch to enable full debug logging.
[ERROR] 
[ERROR] For more information about the errors and possible solutions, please read the following articles:
[ERROR] [Help 1] http://cwiki.apache.org/confluence/display/MAVEN/ProjectBuildingException
channel stopped

Build failed in Jenkins: ServiceMix-Bundles #828

Posted by Apache Jenkins Server <je...@builds.apache.org>.
See <https://builds.apache.org/job/ServiceMix-Bundles/828/changes>

Changes:

[jbonofre] Prepare bundles release

[jbonofre] [maven-release-plugin] prepare release org.apache.servicemix.bundles.spring-core-3.2.13.RELEASE_2

[jbonofre] [maven-release-plugin] prepare for next development iteration

[jbonofre] Prepare bundles release

[jbonofre] [maven-release-plugin] prepare release org.apache.servicemix.bundles.spring-expression-3.2.13.RELEASE_2

[jbonofre] [maven-release-plugin] prepare for next development iteration

[jbonofre] Prepare bundles release

[jbonofre] [maven-release-plugin] prepare release org.apache.servicemix.bundles.spring-instrument-3.2.13.RELEASE_2

[jbonofre] [maven-release-plugin] prepare for next development iteration

------------------------------------------
Started by an SCM change
Building remotely on ubuntu3 (Ubuntu ubuntu legacy-ubuntu) in workspace <https://builds.apache.org/job/ServiceMix-Bundles/ws/>
 > git rev-parse --is-inside-work-tree # timeout=10
Fetching changes from the remote Git repository
 > git config remote.origin.url https://git-wip-us.apache.org/repos/asf/servicemix-bundles.git # timeout=10
Fetching upstream changes from https://git-wip-us.apache.org/repos/asf/servicemix-bundles.git
 > git --version # timeout=10
 > git fetch --tags --progress https://git-wip-us.apache.org/repos/asf/servicemix-bundles.git +refs/heads/*:refs/remotes/origin/*
 > git rev-parse refs/remotes/origin/master^{commit} # timeout=10
 > git rev-parse refs/remotes/origin/origin/master^{commit} # timeout=10
Checking out Revision 0a0edd5fb4362342d3c69bc622e45b47d784f4da (refs/remotes/origin/master)
 > git config core.sparsecheckout # timeout=10
 > git checkout -f 0a0edd5fb4362342d3c69bc622e45b47d784f4da
 > git rev-list 22853107d4f8a099d289160d94840d82cbc563a9 # timeout=10
Parsing POMs
Modules changed, recalculating dependency graph
maven3-agent.jar already up to date
maven3-interceptor.jar already up to date
maven3-interceptor-commons.jar already up to date
[ServiceMix-Bundles] $ /home/jenkins/tools/java/latest1.6/bin/java -da -dsa -XX:MaxPermSize=192m -Xmx512M -cp /home/jenkins/jenkins-slave/maven3-agent.jar:/home/jenkins/jenkins-slave/tools/hudson.tasks.Maven_MavenInstallation/Maven_3.0.3/boot/plexus-classworlds-2.4.jar org.jvnet.hudson.maven3.agent.Maven3Main /home/jenkins/jenkins-slave/tools/hudson.tasks.Maven_MavenInstallation/Maven_3.0.3 /x1/jenkins/jenkins-slave/slave.jar /home/jenkins/jenkins-slave/maven3-interceptor.jar /home/jenkins/jenkins-slave/maven3-interceptor-commons.jar 44726
<===[JENKINS REMOTING CAPACITY]===>   channel started
Executing Maven:  -B -f <https://builds.apache.org/job/ServiceMix-Bundles/ws/pom.xml> -Dmaven.repo.local=<https://builds.apache.org/job/ServiceMix-Bundles/ws/.repository> -B -e clean install
[INFO] Error stacktraces are turned on.
[INFO] Scanning for projects...
[ERROR] The build could not read 1 project -> [Help 1]
org.apache.maven.project.ProjectBuildingException: Some problems were encountered while processing the POMs:
[ERROR] 'modules.module[52]' specifies duplicate child module poi-3.11 @ line 98, column 17
[ERROR] 'modules.module[53]' specifies duplicate child module swagger-core_2.11-1.3.12 @ line 99, column 17

	at org.apache.maven.project.DefaultProjectBuilder.build(DefaultProjectBuilder.java:339)
	at org.apache.maven.DefaultMaven.collectProjects(DefaultMaven.java:632)
	at org.apache.maven.DefaultMaven.getProjectsForMavenReactor(DefaultMaven.java:581)
	at org.apache.maven.DefaultMaven.doExecute(DefaultMaven.java:233)
	at org.apache.maven.DefaultMaven.execute(DefaultMaven.java:156)
	at org.jvnet.hudson.maven3.launcher.Maven3Launcher.main(Maven3Launcher.java:117)
	at sun.reflect.NativeMethodAccessorImpl.invoke0(Native Method)
	at sun.reflect.NativeMethodAccessorImpl.invoke(NativeMethodAccessorImpl.java:39)
	at sun.reflect.DelegatingMethodAccessorImpl.invoke(DelegatingMethodAccessorImpl.java:25)
	at java.lang.reflect.Method.invoke(Method.java:597)
	at org.codehaus.plexus.classworlds.launcher.Launcher.launchStandard(Launcher.java:329)
	at org.codehaus.plexus.classworlds.launcher.Launcher.launch(Launcher.java:239)
	at org.jvnet.hudson.maven3.agent.Maven3Main.launch(Maven3Main.java:178)
	at sun.reflect.NativeMethodAccessorImpl.invoke0(Native Method)
	at sun.reflect.NativeMethodAccessorImpl.invoke(NativeMethodAccessorImpl.java:39)
	at sun.reflect.DelegatingMethodAccessorImpl.invoke(DelegatingMethodAccessorImpl.java:25)
	at java.lang.reflect.Method.invoke(Method.java:597)
	at hudson.maven.Maven3Builder.call(Maven3Builder.java:136)
	at hudson.maven.Maven3Builder.call(Maven3Builder.java:71)
	at hudson.remoting.UserRequest.perform(UserRequest.java:118)
	at hudson.remoting.UserRequest.perform(UserRequest.java:48)
	at hudson.remoting.Request$2.run(Request.java:328)
	at hudson.remoting.InterceptingExecutorService$1.call(InterceptingExecutorService.java:72)
	at java.util.concurrent.FutureTask$Sync.innerRun(FutureTask.java:303)
	at java.util.concurrent.FutureTask.run(FutureTask.java:138)
	at java.util.concurrent.ThreadPoolExecutor$Worker.runTask(ThreadPoolExecutor.java:895)
	at java.util.concurrent.ThreadPoolExecutor$Worker.run(ThreadPoolExecutor.java:918)
	at java.lang.Thread.run(Thread.java:662)
[ERROR]   
[ERROR]   The project org.apache.servicemix.bundles:org.apache.servicemix.bundles.pom:1-SNAPSHOT (<https://builds.apache.org/job/ServiceMix-Bundles/ws/pom.xml)> has 2 errors
[ERROR]     'modules.module[52]' specifies duplicate child module poi-3.11 @ line 98, column 17
[ERROR]     'modules.module[53]' specifies duplicate child module swagger-core_2.11-1.3.12 @ line 99, column 17
[ERROR] 
[ERROR] Re-run Maven using the -X switch to enable full debug logging.
[ERROR] 
[ERROR] For more information about the errors and possible solutions, please read the following articles:
[ERROR] [Help 1] http://cwiki.apache.org/confluence/display/MAVEN/ProjectBuildingException
channel stopped