You are viewing a plain text version of this content. The canonical link for it is here.
Posted to dev@openmeetings.apache.org by Apache Jenkins Server <je...@builds.apache.org> on 2012/07/22 01:05:37 UTC

Build failed in Jenkins: OpenMeetings 2.0 #30

See <https://builds.apache.org/job/OpenMeetings%202.0/30/>

------------------------------------------
[...truncated 326 lines...]
[ivy:resolve] ................................................................ (856kB)
[ivy:resolve] .. (0kB)
[ivy:resolve] 	[SUCCESSFUL ] org.mozilla.javascript#com.springsource.org.mozilla.javascript;1.7.0.R2!com.springsource.org.mozilla.javascript.jar (1178ms)
[ivy:resolve] downloading http://repository.springsource.com/maven/bundles/external/org/aopalliance/com.springsource.org.aopalliance/1.0.0/com.springsource.org.aopalliance-1.0.0.jar ...
[ivy:resolve] .. (4kB)
[ivy:resolve] .. (0kB)
[ivy:resolve] 	[SUCCESSFUL ] org.aopalliance#com.springsource.org.aopalliance;1.0.0!com.springsource.org.aopalliance.jar (408ms)
[ivy:resolve] downloading http://red5.googlecode.com/svn/repository/bcprov-jdk16-145.jar ...
[ivy:resolve] .............................................................................................. (1679kB)
[ivy:resolve] :: resolution report :: resolve 33935ms :: artifacts dl 12895ms
	---------------------------------------------------------------------
	|                  |            modules            ||   artifacts   |
	|       conf       | number| search|dwnlded|evicted|| number|dwnlded|
	---------------------------------------------------------------------
	|       java6      |   43  |   21  |   12  |   0   ||   39  |   14  |
	---------------------------------------------------------------------
[ivy:resolve] 
[ivy:resolve] :: problems summary ::
[ivy:resolve] :::: WARNINGS
[ivy:resolve] 	problem while downloading module descriptor: http://repo1.maven.org/maven2/ch/qos/logback/logback-core/1.0.3/logback-core-1.0.3.pom: Downloaded file size doesn't match expected Content Length for http://repo1.maven.org/maven2/ch/qos/logback/logback-core/1.0.3/logback-core-1.0.3.pom. Please retry. (12ms)
[ivy:resolve] 		module not found: ch.qos.logback#logback-core;1.0.3
[ivy:resolve] 	==== central: tried
[ivy:resolve] 	  http://repo1.maven.org/maven2/ch/qos/logback/logback-core/1.0.3/logback-core-1.0.3.pom
[ivy:resolve] 	==== springsource-external: tried
[ivy:resolve] 	  http://repository.springsource.com/maven/bundles/external/ch/qos/logback/logback-core/1.0.3/logback-core-1.0.3.pom
[ivy:resolve] 	  -- artifact ch.qos.logback#logback-core;1.0.3!logback-core.jar:
[ivy:resolve] 	  http://repository.springsource.com/maven/bundles/external/ch/qos/logback/logback-core/1.0.3/logback-core-1.0.3.jar
[ivy:resolve] 	==== springsource-release: tried
[ivy:resolve] 	  http://repository.springsource.com/maven/bundles/release/ch/qos/logback/logback-core/1.0.3/logback-core-1.0.3.pom
[ivy:resolve] 	  -- artifact ch.qos.logback#logback-core;1.0.3!logback-core.jar:
[ivy:resolve] 	  http://repository.springsource.com/maven/bundles/release/ch/qos/logback/logback-core/1.0.3/logback-core-1.0.3.jar
[ivy:resolve] 	==== mavencentral: tried
[ivy:resolve] 	  -- artifact ch.qos.logback#logback-core;1.0.3!logback-core.jar:
[ivy:resolve] 	  http://repo1.maven.org/maven2/ch.qos.logback/logback-core-1.0.3.jar
[ivy:resolve] 	==== apache: tried
[ivy:resolve] 	  -- artifact ch.qos.logback#logback-core;1.0.3!logback-core.jar:
[ivy:resolve] 	  https://repository.apache.org/content/repositories/releases/logback-core/logback-core/1.0.3/logback-core-1.0.3.jar
[ivy:resolve] 	  https://repository.apache.org/content/repositories/releases/ch.qos.logback/logback-core/1.0.3/logback-core-1.0.3.jar
[ivy:resolve] 	==== sonatype: tried
[ivy:resolve] 	  -- artifact ch.qos.logback#logback-core;1.0.3!logback-core.jar:
[ivy:resolve] 	  http://oss.sonatype.org/content/repositories/sourceforge-releases/ch.qos.logback/logback-core-1.0.3.jar
[ivy:resolve] 	  http://oss.sonatype.org/content/repositories/central/logback-core/logback-core/1.0.3/logback-core-1.0.3.jar
[ivy:resolve] 	==== googlecode: tried
[ivy:resolve] 	  -- artifact ch.qos.logback#logback-core;1.0.3!logback-core.jar:
[ivy:resolve] 	  http://red5.googlecode.com/svn/repository/logback-core-1.0.3.jar
[ivy:resolve] 	  http://red5.googlecode.com/svn/repository/ch.qos.logback/logback-core-1.0.3.jar
[ivy:resolve] 	problem while downloading module descriptor: http://repo1.maven.org/maven2/net/sf/ehcache/ehcache-core/2.5.0/ehcache-core-2.5.0.pom: impossible to move part file to definitive one: /home/jenkins/.ivy2/cache/net.sf.ehcache/ehcache-core/ivy-2.5.0.xml.original.part -> /home/jenkins/.ivy2/cache/net.sf.ehcache/ehcache-core/ivy-2.5.0.xml.original (83ms)
[ivy:resolve] 		module not found: net.sf.ehcache#ehcache-core;2.5.0
[ivy:resolve] 	==== central: tried
[ivy:resolve] 	  http://repo1.maven.org/maven2/net/sf/ehcache/ehcache-core/2.5.0/ehcache-core-2.5.0.pom
[ivy:resolve] 	==== springsource-external: tried
[ivy:resolve] 	  http://repository.springsource.com/maven/bundles/external/net/sf/ehcache/ehcache-core/2.5.0/ehcache-core-2.5.0.pom
[ivy:resolve] 	  -- artifact net.sf.ehcache#ehcache-core;2.5.0!ehcache-core.jar:
[ivy:resolve] 	  http://repository.springsource.com/maven/bundles/external/net/sf/ehcache/ehcache-core/2.5.0/ehcache-core-2.5.0.jar
[ivy:resolve] 	==== springsource-release: tried
[ivy:resolve] 	  http://repository.springsource.com/maven/bundles/release/net/sf/ehcache/ehcache-core/2.5.0/ehcache-core-2.5.0.pom
[ivy:resolve] 	  -- artifact net.sf.ehcache#ehcache-core;2.5.0!ehcache-core.jar:
[ivy:resolve] 	  http://repository.springsource.com/maven/bundles/release/net/sf/ehcache/ehcache-core/2.5.0/ehcache-core-2.5.0.jar
[ivy:resolve] 	==== mavencentral: tried
[ivy:resolve] 	  -- artifact net.sf.ehcache#ehcache-core;2.5.0!ehcache-core.jar:
[ivy:resolve] 	  http://repo1.maven.org/maven2/net.sf.ehcache/ehcache-core-2.5.0.jar
[ivy:resolve] 	==== apache: tried
[ivy:resolve] 	  -- artifact net.sf.ehcache#ehcache-core;2.5.0!ehcache-core.jar:
[ivy:resolve] 	  https://repository.apache.org/content/repositories/releases/ehcache-core/ehcache-core/2.5.0/ehcache-core-2.5.0.jar
[ivy:resolve] 	  https://repository.apache.org/content/repositories/releases/net.sf.ehcache/ehcache-core/2.5.0/ehcache-core-2.5.0.jar
[ivy:resolve] 	==== sonatype: tried
[ivy:resolve] 	  -- artifact net.sf.ehcache#ehcache-core;2.5.0!ehcache-core.jar:
[ivy:resolve] 	  http://oss.sonatype.org/content/repositories/sourceforge-releases/net.sf.ehcache/ehcache-core-2.5.0.jar
[ivy:resolve] 	  http://oss.sonatype.org/content/repositories/central/ehcache-core/ehcache-core/2.5.0/ehcache-core-2.5.0.jar
[ivy:resolve] 	==== googlecode: tried
[ivy:resolve] 	  -- artifact net.sf.ehcache#ehcache-core;2.5.0!ehcache-core.jar:
[ivy:resolve] 	  http://red5.googlecode.com/svn/repository/ehcache-core-2.5.0.jar
[ivy:resolve] 	  http://red5.googlecode.com/svn/repository/net.sf.ehcache/ehcache-core-2.5.0.jar
[ivy:resolve] 	problem while downloading module descriptor: http://repository.springsource.com/maven/bundles/external/org/objectweb/asm/com.springsource.org.objectweb.asm.commons/3.2.0/com.springsource.org.objectweb.asm.commons-3.2.0.pom: /home/jenkins/.ivy2/cache/org.objectweb.asm/com.springsource.org.objectweb.asm.commons/ivy-3.2.0.xml.original.part (No such file or directory) (346ms)
[ivy:resolve] 		module not found: org.objectweb.asm#com.springsource.org.objectweb.asm.commons;3.2.0
[ivy:resolve] 	==== central: tried
[ivy:resolve] 	  http://repo1.maven.org/maven2/org/objectweb/asm/com.springsource.org.objectweb.asm.commons/3.2.0/com.springsource.org.objectweb.asm.commons-3.2.0.pom
[ivy:resolve] 	  -- artifact org.objectweb.asm#com.springsource.org.objectweb.asm.commons;3.2.0!com.springsource.org.objectweb.asm.commons.jar:
[ivy:resolve] 	  http://repo1.maven.org/maven2/org/objectweb/asm/com.springsource.org.objectweb.asm.commons/3.2.0/com.springsource.org.objectweb.asm.commons-3.2.0.jar
[ivy:resolve] 	==== springsource-external: tried
[ivy:resolve] 	  http://repository.springsource.com/maven/bundles/external/org/objectweb/asm/com.springsource.org.objectweb.asm.commons/3.2.0/com.springsource.org.objectweb.asm.commons-3.2.0.pom
[ivy:resolve] 	==== springsource-release: tried
[ivy:resolve] 	  http://repository.springsource.com/maven/bundles/release/org/objectweb/asm/com.springsource.org.objectweb.asm.commons/3.2.0/com.springsource.org.objectweb.asm.commons-3.2.0.pom
[ivy:resolve] 	  -- artifact org.objectweb.asm#com.springsource.org.objectweb.asm.commons;3.2.0!com.springsource.org.objectweb.asm.commons.jar:
[ivy:resolve] 	  http://repository.springsource.com/maven/bundles/release/org/objectweb/asm/com.springsource.org.objectweb.asm.commons/3.2.0/com.springsource.org.objectweb.asm.commons-3.2.0.jar
[ivy:resolve] 	==== mavencentral: tried
[ivy:resolve] 	  -- artifact org.objectweb.asm#com.springsource.org.objectweb.asm.commons;3.2.0!com.springsource.org.objectweb.asm.commons.jar:
[ivy:resolve] 	  http://repo1.maven.org/maven2/org.objectweb.asm/com.springsource.org.objectweb.asm.commons-3.2.0.jar
[ivy:resolve] 	==== apache: tried
[ivy:resolve] 	  -- artifact org.objectweb.asm#com.springsource.org.objectweb.asm.commons;3.2.0!com.springsource.org.objectweb.asm.commons.jar:
[ivy:resolve] 	  https://repository.apache.org/content/repositories/releases/com.springsource.org.objectweb.asm.commons/com.springsource.org.objectweb.asm.commons/3.2.0/com.springsource.org.objectweb.asm.commons-3.2.0.jar
[ivy:resolve] 	  https://repository.apache.org/content/repositories/releases/org.objectweb.asm/com.springsource.org.objectweb.asm.commons/3.2.0/com.springsource.org.objectweb.asm.commons-3.2.0.jar
[ivy:resolve] 	==== sonatype: tried
[ivy:resolve] 	  -- artifact org.objectweb.asm#com.springsource.org.objectweb.asm.commons;3.2.0!com.springsource.org.objectweb.asm.commons.jar:
[ivy:resolve] 	  http://oss.sonatype.org/content/repositories/sourceforge-releases/org.objectweb.asm/com.springsource.org.objectweb.asm.commons-3.2.0.jar
[ivy:resolve] 	  http://oss.sonatype.org/content/repositories/central/com.springsource.org.objectweb.asm.commons/com.springsource.org.objectweb.asm.commons/3.2.0/com.springsource.org.objectweb.asm.commons-3.2.0.jar
[ivy:resolve] 	==== googlecode: tried
[ivy:resolve] 	  -- artifact org.objectweb.asm#com.springsource.org.objectweb.asm.commons;3.2.0!com.springsource.org.objectweb.asm.commons.jar:
[ivy:resolve] 	  http://red5.googlecode.com/svn/repository/com.springsource.org.objectweb.asm.commons-3.2.0.jar
[ivy:resolve] 	  http://red5.googlecode.com/svn/repository/org.objectweb.asm/com.springsource.org.objectweb.asm.commons-3.2.0.jar
[ivy:resolve] 	problem while downloading module descriptor: http://repository.springsource.com/maven/bundles/external/net/sourceforge/cglib/com.springsource.net.sf.cglib/2.2.0/com.springsource.net.sf.cglib-2.2.0.pom: /home/jenkins/.ivy2/cache/net.sourceforge.cglib/com.springsource.net.sf.cglib/ivy-2.2.0.xml.original.part (No such file or directory) (337ms)
[ivy:resolve] 		module not found: net.sourceforge.cglib#com.springsource.net.sf.cglib;2.2.0
[ivy:resolve] 	==== central: tried
[ivy:resolve] 	  http://repo1.maven.org/maven2/net/sourceforge/cglib/com.springsource.net.sf.cglib/2.2.0/com.springsource.net.sf.cglib-2.2.0.pom
[ivy:resolve] 	  -- artifact net.sourceforge.cglib#com.springsource.net.sf.cglib;2.2.0!com.springsource.net.sf.cglib.jar:
[ivy:resolve] 	  http://repo1.maven.org/maven2/net/sourceforge/cglib/com.springsource.net.sf.cglib/2.2.0/com.springsource.net.sf.cglib-2.2.0.jar
[ivy:resolve] 	==== springsource-external: tried
[ivy:resolve] 	  http://repository.springsource.com/maven/bundles/external/net/sourceforge/cglib/com.springsource.net.sf.cglib/2.2.0/com.springsource.net.sf.cglib-2.2.0.pom
[ivy:resolve] 	==== springsource-release: tried
[ivy:resolve] 	  http://repository.springsource.com/maven/bundles/release/net/sourceforge/cglib/com.springsource.net.sf.cglib/2.2.0/com.springsource.net.sf.cglib-2.2.0.pom
[ivy:resolve] 	  -- artifact net.sourceforge.cglib#com.springsource.net.sf.cglib;2.2.0!com.springsource.net.sf.cglib.jar:
[ivy:resolve] 	  http://repository.springsource.com/maven/bundles/release/net/sourceforge/cglib/com.springsource.net.sf.cglib/2.2.0/com.springsource.net.sf.cglib-2.2.0.jar
[ivy:resolve] 	==== mavencentral: tried
[ivy:resolve] 	  -- artifact net.sourceforge.cglib#com.springsource.net.sf.cglib;2.2.0!com.springsource.net.sf.cglib.jar:
[ivy:resolve] 	  http://repo1.maven.org/maven2/net.sourceforge.cglib/com.springsource.net.sf.cglib-2.2.0.jar
[ivy:resolve] 	==== apache: tried
[ivy:resolve] 	  -- artifact net.sourceforge.cglib#com.springsource.net.sf.cglib;2.2.0!com.springsource.net.sf.cglib.jar:
[ivy:resolve] 	  https://repository.apache.org/content/repositories/releases/com.springsource.net.sf.cglib/com.springsource.net.sf.cglib/2.2.0/com.springsource.net.sf.cglib-2.2.0.jar
[ivy:resolve] 	  https://repository.apache.org/content/repositories/releases/net.sourceforge.cglib/com.springsource.net.sf.cglib/2.2.0/com.springsource.net.sf.cglib-2.2.0.jar
[ivy:resolve] 	==== sonatype: tried
[ivy:resolve] 	  -- artifact net.sourceforge.cglib#com.springsource.net.sf.cglib;2.2.0!com.springsource.net.sf.cglib.jar:
[ivy:resolve] 	  http://oss.sonatype.org/content/repositories/sourceforge-releases/net.sourceforge.cglib/com.springsource.net.sf.cglib-2.2.0.jar
[ivy:resolve] 	  http://oss.sonatype.org/content/repositories/central/com.springsource.net.sf.cglib/com.springsource.net.sf.cglib/2.2.0/com.springsource.net.sf.cglib-2.2.0.jar
[ivy:resolve] 	==== googlecode: tried
[ivy:resolve] 	  -- artifact net.sourceforge.cglib#com.springsource.net.sf.cglib;2.2.0!com.springsource.net.sf.cglib.jar:
[ivy:resolve] 	  http://red5.googlecode.com/svn/repository/com.springsource.net.sf.cglib-2.2.0.jar
[ivy:resolve] 	  http://red5.googlecode.com/svn/repository/net.sourceforge.cglib/com.springsource.net.sf.cglib-2.2.0.jar
[ivy:resolve] 		[FAILED     ] javax#javaee-api;5.1.2!javaee-api.jar: impossible to move part file to definitive one: /home/jenkins/.ivy2/cache/javax/javaee-api/jars/javaee-api-5.1.2.jar.part -> /home/jenkins/.ivy2/cache/javax/javaee-api/jars/javaee-api-5.1.2.jar (558ms)
[ivy:resolve] 		[FAILED     ] javax#javaee-api;5.1.2!javaee-api.jar: impossible to move part file to definitive one: /home/jenkins/.ivy2/cache/javax/javaee-api/jars/javaee-api-5.1.2.jar.part -> /home/jenkins/.ivy2/cache/javax/javaee-api/jars/javaee-api-5.1.2.jar (558ms)
[ivy:resolve] 	==== googlecode: tried
[ivy:resolve] 	  http://red5.googlecode.com/svn/repository/javaee-api-5.1.2.jar
[ivy:resolve] 	  http://red5.googlecode.com/svn/repository/javax/javaee-api-5.1.2.jar
[ivy:resolve] 		[FAILED     ] org.springframework#spring-aop;3.1.1.RELEASE!spring-aop.jar: impossible to move part file to definitive one: /home/jenkins/.ivy2/cache/org.springframework/spring-aop/jars/spring-aop-3.1.1.RELEASE.jar.part -> /home/jenkins/.ivy2/cache/org.springframework/spring-aop/jars/spring-aop-3.1.1.RELEASE.jar (67ms)
[ivy:resolve] 		[FAILED     ] org.springframework#spring-aop;3.1.1.RELEASE!spring-aop.jar: impossible to move part file to definitive one: /home/jenkins/.ivy2/cache/org.springframework/spring-aop/jars/spring-aop-3.1.1.RELEASE.jar.part -> /home/jenkins/.ivy2/cache/org.springframework/spring-aop/jars/spring-aop-3.1.1.RELEASE.jar (67ms)
[ivy:resolve] 	==== central: tried
[ivy:resolve] 	  http://repo1.maven.org/maven2/org/springframework/spring-aop/3.1.1.RELEASE/spring-aop-3.1.1.RELEASE.jar
[ivy:resolve] 		[FAILED     ] org.springframework#spring-beans;3.1.1.RELEASE!spring-beans.jar: impossible to move part file to definitive one: /home/jenkins/.ivy2/cache/org.springframework/spring-beans/jars/spring-beans-3.1.1.RELEASE.jar.part -> /home/jenkins/.ivy2/cache/org.springframework/spring-beans/jars/spring-beans-3.1.1.RELEASE.jar (67ms)
[ivy:resolve] 		[FAILED     ] org.springframework#spring-beans;3.1.1.RELEASE!spring-beans.jar: impossible to move part file to definitive one: /home/jenkins/.ivy2/cache/org.springframework/spring-beans/jars/spring-beans-3.1.1.RELEASE.jar.part -> /home/jenkins/.ivy2/cache/org.springframework/spring-beans/jars/spring-beans-3.1.1.RELEASE.jar (67ms)
[ivy:resolve] 	==== central: tried
[ivy:resolve] 	  http://repo1.maven.org/maven2/org/springframework/spring-beans/3.1.1.RELEASE/spring-beans-3.1.1.RELEASE.jar
[ivy:resolve] 		[FAILED     ] org.springframework#spring-context;3.1.1.RELEASE!spring-context.jar: impossible to move part file to definitive one: /home/jenkins/.ivy2/cache/org.springframework/spring-context/jars/spring-context-3.1.1.RELEASE.jar.part -> /home/jenkins/.ivy2/cache/org.springframework/spring-context/jars/spring-context-3.1.1.RELEASE.jar (84ms)
[ivy:resolve] 		[FAILED     ] org.springframework#spring-context;3.1.1.RELEASE!spring-context.jar: impossible to move part file to definitive one: /home/jenkins/.ivy2/cache/org.springframework/spring-context/jars/spring-context-3.1.1.RELEASE.jar.part -> /home/jenkins/.ivy2/cache/org.springframework/spring-context/jars/spring-context-3.1.1.RELEASE.jar (84ms)
[ivy:resolve] 	==== central: tried
[ivy:resolve] 	  http://repo1.maven.org/maven2/org/springframework/spring-context/3.1.1.RELEASE/spring-context-3.1.1.RELEASE.jar
[ivy:resolve] 		[FAILED     ] org.springframework#spring-core;3.1.1.RELEASE!spring-core.jar: impossible to move part file to definitive one: /home/jenkins/.ivy2/cache/org.springframework/spring-core/jars/spring-core-3.1.1.RELEASE.jar.part -> /home/jenkins/.ivy2/cache/org.springframework/spring-core/jars/spring-core-3.1.1.RELEASE.jar (74ms)
[ivy:resolve] 		[FAILED     ] org.springframework#spring-core;3.1.1.RELEASE!spring-core.jar: impossible to move part file to definitive one: /home/jenkins/.ivy2/cache/org.springframework/spring-core/jars/spring-core-3.1.1.RELEASE.jar.part -> /home/jenkins/.ivy2/cache/org.springframework/spring-core/jars/spring-core-3.1.1.RELEASE.jar (74ms)
[ivy:resolve] 	==== central: tried
[ivy:resolve] 	  http://repo1.maven.org/maven2/org/springframework/spring-core/3.1.1.RELEASE/spring-core-3.1.1.RELEASE.jar
[ivy:resolve] 		[FAILED     ] org.springframework#spring-expression;3.1.1.RELEASE!spring-expression.jar: impossible to move part file to definitive one: /home/jenkins/.ivy2/cache/org.springframework/spring-expression/jars/spring-expression-3.1.1.RELEASE.jar.part -> /home/jenkins/.ivy2/cache/org.springframework/spring-expression/jars/spring-expression-3.1.1.RELEASE.jar (95ms)
[ivy:resolve] 		[FAILED     ] org.springframework#spring-expression;3.1.1.RELEASE!spring-expression.jar: impossible to move part file to definitive one: /home/jenkins/.ivy2/cache/org.springframework/spring-expression/jars/spring-expression-3.1.1.RELEASE.jar.part -> /home/jenkins/.ivy2/cache/org.springframework/spring-expression/jars/spring-expression-3.1.1.RELEASE.jar (95ms)
[ivy:resolve] 	==== central: tried
[ivy:resolve] 	  http://repo1.maven.org/maven2/org/springframework/spring-expression/3.1.1.RELEASE/spring-expression-3.1.1.RELEASE.jar
[ivy:resolve] 		[FAILED     ] org.springframework#spring-web;3.1.1.RELEASE!spring-web.jar: /home/jenkins/.ivy2/cache/org.springframework/spring-web/jars/spring-web-3.1.1.RELEASE.jar.part (No such file or directory) (148ms)
[ivy:resolve] 		[FAILED     ] org.springframework#spring-web;3.1.1.RELEASE!spring-web.jar: /home/jenkins/.ivy2/cache/org.springframework/spring-web/jars/spring-web-3.1.1.RELEASE.jar.part (No such file or directory) (148ms)
[ivy:resolve] 	==== central: tried
[ivy:resolve] 	  http://repo1.maven.org/maven2/org/springframework/spring-web/3.1.1.RELEASE/spring-web-3.1.1.RELEASE.jar
[ivy:resolve] 		[FAILED     ] org.slf4j#jul-to-slf4j;1.6.4!jul-to-slf4j.jar: /home/jenkins/.ivy2/cache/org.slf4j/jul-to-slf4j/jars/jul-to-slf4j-1.6.4.jar.part (No such file or directory) (21ms)
[ivy:resolve] 		[FAILED     ] org.slf4j#jul-to-slf4j;1.6.4!jul-to-slf4j.jar: /home/jenkins/.ivy2/cache/org.slf4j/jul-to-slf4j/jars/jul-to-slf4j-1.6.4.jar.part (No such file or directory) (21ms)
[ivy:resolve] 	==== central: tried
[ivy:resolve] 	  http://repo1.maven.org/maven2/org/slf4j/jul-to-slf4j/1.6.4/jul-to-slf4j-1.6.4.jar
[ivy:resolve] 		[FAILED     ] org.slf4j#log4j-over-slf4j;1.6.4!log4j-over-slf4j.jar: /home/jenkins/.ivy2/cache/org.slf4j/log4j-over-slf4j/jars/log4j-over-slf4j-1.6.4.jar.part (No such file or directory) (208ms)
[ivy:resolve] 		[FAILED     ] org.slf4j#log4j-over-slf4j;1.6.4!log4j-over-slf4j.jar: /home/jenkins/.ivy2/cache/org.slf4j/log4j-over-slf4j/jars/log4j-over-slf4j-1.6.4.jar.part (No such file or directory) (208ms)
[ivy:resolve] 	==== central: tried
[ivy:resolve] 	  http://repo1.maven.org/maven2/org/slf4j/log4j-over-slf4j/1.6.4/log4j-over-slf4j-1.6.4.jar
[ivy:resolve] 		[FAILED     ] ch.qos.logback#logback-classic;1.0.3!logback-classic.jar: impossible to move part file to definitive one: /home/jenkins/.ivy2/cache/ch.qos.logback/logback-classic/jars/logback-classic-1.0.3.jar.part -> /home/jenkins/.ivy2/cache/ch.qos.logback/logback-classic/jars/logback-classic-1.0.3.jar (153ms)
[ivy:resolve] 		[FAILED     ] ch.qos.logback#logback-classic;1.0.3!logback-classic.jar: impossible to move part file to definitive one: /home/jenkins/.ivy2/cache/ch.qos.logback/logback-classic/jars/logback-classic-1.0.3.jar.part -> /home/jenkins/.ivy2/cache/ch.qos.logback/logback-classic/jars/logback-classic-1.0.3.jar (153ms)
[ivy:resolve] 	==== central: tried
[ivy:resolve] 	  http://repo1.maven.org/maven2/ch/qos/logback/logback-classic/1.0.3/logback-classic-1.0.3.jar
[ivy:resolve] 		[FAILED     ] org.apache.commons#commons-beanutils;1.8.3!commons-beanutils.jar: /home/jenkins/.ivy2/cache/org.apache.commons/commons-beanutils/jars/commons-beanutils-1.8.3.jar.part (No such file or directory) (709ms)
[ivy:resolve] 		[FAILED     ] org.apache.commons#commons-beanutils;1.8.3!commons-beanutils.jar: /home/jenkins/.ivy2/cache/org.apache.commons/commons-beanutils/jars/commons-beanutils-1.8.3.jar.part (No such file or directory) (709ms)
[ivy:resolve] 	==== sonatype: tried
[ivy:resolve] 	  http://oss.sonatype.org/content/repositories/sourceforge-releases/org.apache.commons/commons-beanutils-1.8.3.jar
[ivy:resolve] 	  http://oss.sonatype.org/content/repositories/central/commons-beanutils/commons-beanutils/1.8.3/commons-beanutils-1.8.3.jar
[ivy:resolve] 		[FAILED     ] org.apache.commons#commons-lang3;3.1!commons-lang3.jar: impossible to move part file to definitive one: /home/jenkins/.ivy2/cache/org.apache.commons/commons-lang3/jars/commons-lang3-3.1.jar.part -> /home/jenkins/.ivy2/cache/org.apache.commons/commons-lang3/jars/commons-lang3-3.1.jar (68ms)
[ivy:resolve] 		[FAILED     ] org.apache.commons#commons-lang3;3.1!commons-lang3.jar: impossible to move part file to definitive one: /home/jenkins/.ivy2/cache/org.apache.commons/commons-lang3/jars/commons-lang3-3.1.jar.part -> /home/jenkins/.ivy2/cache/org.apache.commons/commons-lang3/jars/commons-lang3-3.1.jar (68ms)
[ivy:resolve] 	==== central: tried
[ivy:resolve] 	  http://repo1.maven.org/maven2/org/apache/commons/commons-lang3/3.1/commons-lang3-3.1.jar
[ivy:resolve] 		[FAILED     ] org.apache.commons#commons-modeler;2.0.1!commons-modeler.jar: /home/jenkins/.ivy2/cache/org.apache.commons/commons-modeler/jars/commons-modeler-2.0.1.jar.part (No such file or directory) (541ms)
[ivy:resolve] 		[FAILED     ] org.apache.commons#commons-modeler;2.0.1!commons-modeler.jar: /home/jenkins/.ivy2/cache/org.apache.commons/commons-modeler/jars/commons-modeler-2.0.1.jar.part (No such file or directory) (541ms)
[ivy:resolve] 	==== sonatype: tried
[ivy:resolve] 	  http://oss.sonatype.org/content/repositories/sourceforge-releases/org.apache.commons/commons-modeler-2.0.1.jar
[ivy:resolve] 	  http://oss.sonatype.org/content/repositories/central/commons-modeler/commons-modeler/2.0.1/commons-modeler-2.0.1.jar
[ivy:resolve] 		[FAILED     ] org.apache.commons#commons-pool;1.5.6!commons-pool.jar: Downloaded file size doesn't match expected Content Length for https://repository.apache.org/content/repositories/releases/commons-pool/commons-pool/1.5.6/commons-pool-1.5.6.jar. Please retry. (259ms)
[ivy:resolve] 		[FAILED     ] org.apache.commons#commons-pool;1.5.6!commons-pool.jar: Downloaded file size doesn't match expected Content Length for https://repository.apache.org/content/repositories/releases/commons-pool/commons-pool/1.5.6/commons-pool-1.5.6.jar. Please retry. (259ms)
[ivy:resolve] 	==== apache: tried
[ivy:resolve] 	  https://repository.apache.org/content/repositories/releases/commons-pool/commons-pool/1.5.6/commons-pool-1.5.6.jar
[ivy:resolve] 		[FAILED     ] org.apache.xerces#com.springsource.org.apache.xerces;2.9.1!com.springsource.org.apache.xerces.jar: invalid sha1: expected=1a7aa73569273cb296269530d350c8aacef37b51 computed=5b3bacb26f80dd3a2ae2cf9c9699f23ea3dd0050 (1298ms)
[ivy:resolve] 		[FAILED     ] org.apache.xerces#com.springsource.org.apache.xerces;2.9.1!com.springsource.org.apache.xerces.jar: invalid sha1: expected=1a7aa73569273cb296269530d350c8aacef37b51 computed=5b3bacb26f80dd3a2ae2cf9c9699f23ea3dd0050 (1298ms)
[ivy:resolve] 	==== springsource-external: tried
[ivy:resolve] 	  http://repository.springsource.com/maven/bundles/external/org/apache/xerces/com.springsource.org.apache.xerces/2.9.1/com.springsource.org.apache.xerces-2.9.1.jar
[ivy:resolve] 		[FAILED     ] org.objectweb.asm#com.springsource.org.objectweb.asm;3.2.0!com.springsource.org.objectweb.asm.jar: Downloaded file size doesn't match expected Content Length for http://repository.springsource.com/maven/bundles/external/org/objectweb/asm/com.springsource.org.objectweb.asm/3.2.0/com.springsource.org.objectweb.asm-3.2.0.jar. Please retry. (607ms)
[ivy:resolve] 		[FAILED     ] org.objectweb.asm#com.springsource.org.objectweb.asm;3.2.0!com.springsource.org.objectweb.asm.jar: Downloaded file size doesn't match expected Content Length for http://repository.springsource.com/maven/bundles/external/org/objectweb/asm/com.springsource.org.objectweb.asm/3.2.0/com.springsource.org.objectweb.asm-3.2.0.jar. Please retry. (607ms)
[ivy:resolve] 	==== springsource-external: tried
[ivy:resolve] 	  http://repository.springsource.com/maven/bundles/external/org/objectweb/asm/com.springsource.org.objectweb.asm/3.2.0/com.springsource.org.objectweb.asm-3.2.0.jar
[ivy:resolve] 		[FAILED     ] org.codehaus.groovy#com.springsource.org.codehaus.groovy;1.7.0!com.springsource.org.codehaus.groovy.jar: Downloaded file size doesn't match expected Content Length for http://repository.springsource.com/maven/bundles/external/org/codehaus/groovy/com.springsource.org.codehaus.groovy/1.7.0/com.springsource.org.codehaus.groovy-1.7.0.jar. Please retry. (1958ms)
[ivy:resolve] 		[FAILED     ] org.codehaus.groovy#com.springsource.org.codehaus.groovy;1.7.0!com.springsource.org.codehaus.groovy.jar: Downloaded file size doesn't match expected Content Length for http://repository.springsource.com/maven/bundles/external/org/codehaus/groovy/com.springsource.org.codehaus.groovy/1.7.0/com.springsource.org.codehaus.groovy-1.7.0.jar. Please retry. (1958ms)
[ivy:resolve] 	==== springsource-external: tried
[ivy:resolve] 	  http://repository.springsource.com/maven/bundles/external/org/codehaus/groovy/com.springsource.org.codehaus.groovy/1.7.0/com.springsource.org.codehaus.groovy-1.7.0.jar
[ivy:resolve] 		[FAILED     ] red5#bcprov-jdk16;145!bcprov-jdk16.jar: Downloaded file size doesn't match expected Content Length for http://red5.googlecode.com/svn/repository/bcprov-jdk16-145.jar. Please retry. (504ms)
[ivy:resolve] 		[FAILED     ] red5#bcprov-jdk16;145!bcprov-jdk16.jar: Downloaded file size doesn't match expected Content Length for http://red5.googlecode.com/svn/repository/bcprov-jdk16-145.jar. Please retry. (504ms)
[ivy:resolve] 	==== googlecode: tried
[ivy:resolve] 	  http://red5.googlecode.com/svn/repository/bcprov-jdk16-145.jar
[ivy:resolve] 		::::::::::::::::::::::::::::::::::::::::::::::
[ivy:resolve] 		::          UNRESOLVED DEPENDENCIES         ::
[ivy:resolve] 		::::::::::::::::::::::::::::::::::::::::::::::
[ivy:resolve] 		:: ch.qos.logback#logback-core;1.0.3: not found
[ivy:resolve] 		:: net.sf.ehcache#ehcache-core;2.5.0: not found
[ivy:resolve] 		:: org.objectweb.asm#com.springsource.org.objectweb.asm.commons;3.2.0: not found
[ivy:resolve] 		:: net.sourceforge.cglib#com.springsource.net.sf.cglib;2.2.0: not found
[ivy:resolve] 		::::::::::::::::::::::::::::::::::::::::::::::
[ivy:resolve] 		::::::::::::::::::::::::::::::::::::::::::::::
[ivy:resolve] 		::              FAILED DOWNLOADS            ::
[ivy:resolve] 		:: ^ see resolution messages for details  ^ ::
[ivy:resolve] 		::::::::::::::::::::::::::::::::::::::::::::::
[ivy:resolve] 		:: javax#javaee-api;5.1.2!javaee-api.jar
[ivy:resolve] 		:: org.springframework#spring-aop;3.1.1.RELEASE!spring-aop.jar
[ivy:resolve] 		:: org.springframework#spring-beans;3.1.1.RELEASE!spring-beans.jar
[ivy:resolve] 		:: org.springframework#spring-context;3.1.1.RELEASE!spring-context.jar
[ivy:resolve] 		:: org.springframework#spring-core;3.1.1.RELEASE!spring-core.jar
[ivy:resolve] 		:: org.springframework#spring-expression;3.1.1.RELEASE!spring-expression.jar
[ivy:resolve] 		:: org.springframework#spring-web;3.1.1.RELEASE!spring-web.jar
[ivy:resolve] 		:: org.slf4j#jul-to-slf4j;1.6.4!jul-to-slf4j.jar
[ivy:resolve] 		:: org.slf4j#log4j-over-slf4j;1.6.4!log4j-over-slf4j.jar
[ivy:resolve] 		:: ch.qos.logback#logback-classic;1.0.3!logback-classic.jar
[ivy:resolve] 		:: org.apache.commons#commons-beanutils;1.8.3!commons-beanutils.jar
[ivy:resolve] 		:: org.apache.commons#commons-lang3;3.1!commons-lang3.jar
[ivy:resolve] 		:: org.apache.commons#commons-modeler;2.0.1!commons-modeler.jar
[ivy:resolve] 		:: org.apache.commons#commons-pool;1.5.6!commons-pool.jar
[ivy:resolve] 		:: org.apache.xerces#com.springsource.org.apache.xerces;2.9.1!com.springsource.org.apache.xerces.jar
[ivy:resolve] 		:: org.objectweb.asm#com.springsource.org.objectweb.asm;3.2.0!com.springsource.org.objectweb.asm.jar
[ivy:resolve] 		:: org.codehaus.groovy#com.springsource.org.codehaus.groovy;1.7.0!com.springsource.org.codehaus.groovy.jar
[ivy:resolve] 		:: red5#bcprov-jdk16;145!bcprov-jdk16.jar
[ivy:resolve] 		::::::::::::::::::::::::::::::::::::::::::::::
[ivy:resolve] :::: ERRORS
[ivy:resolve] 	unknown resolver m2repo
[ivy:resolve] 	unknown resolver m2repo
[ivy:resolve] 
[ivy:resolve] :: USE VERBOSE OR DEBUG MESSAGE LEVEL FOR MORE DETAILS

BUILD FAILED
<https://builds.apache.org/job/OpenMeetings%202.0/ws/2.0/build.xml>:748: The following error occurred while executing this line:
<https://builds.apache.org/job/OpenMeetings%202.0/ws/2.0/build/red5/server/build.xml>:202: The following error occurred while executing this line:
<https://builds.apache.org/job/OpenMeetings%202.0/ws/2.0/build/red5/server/build.xml>:216: The following error occurred while executing this line:
<https://builds.apache.org/job/OpenMeetings%202.0/ws/2.0/build/red5/server/build.xml>:167: impossible to resolve dependencies:
	resolve failed - see output for details

Total time: 1 minute 54 seconds
Build step 'Invoke Ant' marked build as failure
Archiving artifacts

Jenkins build is back to normal : OpenMeetings 2.0 #32

Posted by Apache Jenkins Server <je...@builds.apache.org>.
See <https://builds.apache.org/job/OpenMeetings%202.0/32/>


Build failed in Jenkins: OpenMeetings 2.0 #31

Posted by Apache Jenkins Server <je...@builds.apache.org>.
See <https://builds.apache.org/job/OpenMeetings%202.0/31/>

------------------------------------------
Started by timer
Building remotely on ubuntu4 in workspace <https://builds.apache.org/job/OpenMeetings%202.0/ws/>
Updating http://svn.apache.org/repos/asf/incubator/openmeetings/branches/2.0
At revision 1364454
no change for http://svn.apache.org/repos/asf/incubator/openmeetings/branches/2.0 since the previous build
[2.0] $ /home/jenkins/jenkins-slave/tools/Ant/ant-1.8.2/bin/ant dist-bin
Buildfile: <https://builds.apache.org/job/OpenMeetings%202.0/ws/2.0/build.xml>

clean.dist:
   [delete] Deleting directory <https://builds.apache.org/job/OpenMeetings%202.0/ws/2.0/dist>

clean.all:
   [delete] Deleting directory <https://builds.apache.org/job/OpenMeetings%202.0/ws/2.0/build>

clean.classes:

clean:

-java6.check:
     [echo] Using Java 1.6.0_27 specification: 1.6

prepare.mkdir:
    [mkdir] Created dir: <https://builds.apache.org/job/OpenMeetings%202.0/ws/2.0/build/red5/server/dist/lib>
    [mkdir] Created dir: <https://builds.apache.org/job/OpenMeetings%202.0/ws/2.0/build/red5/client/dist>
    [mkdir] Created dir: <https://builds.apache.org/job/OpenMeetings%202.0/ws/2.0/dist>
    [mkdir] Created dir: <https://builds.apache.org/job/OpenMeetings%202.0/ws/2.0/build/classes/openmeetings>
    [mkdir] Created dir: <https://builds.apache.org/job/OpenMeetings%202.0/ws/2.0/build/lib/mainlibs>
    [mkdir] Created dir: <https://builds.apache.org/job/OpenMeetings%202.0/ws/2.0/build/lib/om>
    [mkdir] Created dir: <https://builds.apache.org/job/OpenMeetings%202.0/ws/2.0/build/lib/anakia>
    [mkdir] Created dir: <https://builds.apache.org/job/OpenMeetings%202.0/ws/2.0/build/lib/junit>
    [mkdir] Created dir: <https://builds.apache.org/job/OpenMeetings%202.0/ws/2.0/build/junit/report>
    [mkdir] Created dir: <https://builds.apache.org/job/OpenMeetings%202.0/ws/2.0/build/lib/rat>
    [mkdir] Created dir: <https://builds.apache.org/job/OpenMeetings%202.0/ws/2.0/build/lib/dtd-generator>
    [mkdir] Created dir: <https://builds.apache.org/job/OpenMeetings%202.0/ws/2.0/build/lib/svntask>
    [mkdir] Created dir: <https://builds.apache.org/job/OpenMeetings%202.0/ws/2.0/build/openlaszlo>

-availability-check:

-retrieve-svntask:

-retrieve:
     [echo] Ivy conf name: svntask, destination: <https://builds.apache.org/job/OpenMeetings%202.0/ws/2.0/build/lib/svntask>
[ivy:resolve] :: Ivy 2.2.0 - 20100923230623 :: http://ant.apache.org/ivy/ ::
[ivy:resolve] :: loading settings :: file = <https://builds.apache.org/job/OpenMeetings%202.0/ws/2.0/ivysettings.xml>
[ivy:resolve] :: resolving dependencies :: apache#openmeetings;working@janus
[ivy:resolve] 	confs: [svntask]
[ivy:resolve] 	found org.tmatesoft.svnkit#svnkit;1.7.4 in tmatesoft-release
[ivy:resolve] 	found net.java.dev.jna#jna;3.4.0 in central
[ivy:resolve] 	found de.regnis.q.sequence#sequence-library;1.0.1 in tmatesoft-release
[ivy:resolve] 	found org.tmatesoft.sqljet#sqljet;1.1.0 in tmatesoft-release
[ivy:resolve] 	found org.antlr#antlr-runtime;3.4 in central
[ivy:resolve] 	found com.trilead#trilead-ssh2;1.0.0-build214 in tmatesoft-release
[ivy:resolve] 	found svnant#svnant;1.3.1 in googlecode
[ivy:resolve] 	found svnClientAdapter#svnClientAdapter;1.3.1 in googlecode
[ivy:resolve] :: resolution report :: resolve 322ms :: artifacts dl 10ms
	---------------------------------------------------------------------
	|                  |            modules            ||   artifacts   |
	|       conf       | number| search|dwnlded|evicted|| number|dwnlded|
	---------------------------------------------------------------------
	|      svntask     |   8   |   0   |   0   |   0   ||   8   |   0   |
	---------------------------------------------------------------------
[ivy:retrieve] :: retrieving :: apache#openmeetings
[ivy:retrieve] 	confs: [svntask]
[ivy:retrieve] 	8 artifacts copied, 0 already retrieved (5723kB/99ms)

-ant-task:

-retrieve-red5-server:
Trying to override old definition of datatype antlib:org.apache.ivy.ant:settings
Trying to override old definition of task antlib:org.apache.ivy.ant:configure
Trying to override old definition of task antlib:org.apache.ivy.ant:resolve
Trying to override old definition of task antlib:org.apache.ivy.ant:retrieve
Trying to override old definition of task antlib:org.apache.ivy.ant:deliver
Trying to override old definition of task antlib:org.apache.ivy.ant:publish
Trying to override old definition of task antlib:org.apache.ivy.ant:extract
Trying to override old definition of task antlib:org.apache.ivy.ant:cachepath
Trying to override old definition of task antlib:org.apache.ivy.ant:cachefileset
Trying to override old definition of task antlib:org.apache.ivy.ant:report
Trying to override old definition of task antlib:org.apache.ivy.ant:repreport
Trying to override old definition of task antlib:org.apache.ivy.ant:var
Trying to override old definition of task antlib:org.apache.ivy.ant:check
Trying to override old definition of task antlib:org.apache.ivy.ant:artifactproperty
Trying to override old definition of task antlib:org.apache.ivy.ant:buildlist
Trying to override old definition of task antlib:org.apache.ivy.ant:install
Trying to override old definition of task antlib:org.apache.ivy.ant:convertpom
Trying to override old definition of task antlib:org.apache.ivy.ant:makepom
Trying to override old definition of task antlib:org.apache.ivy.ant:artifactreport
Trying to override old definition of task antlib:org.apache.ivy.ant:info
Trying to override old definition of task antlib:org.apache.ivy.ant:addpath
Trying to override old definition of task antlib:org.apache.ivy.ant:listmodules
Trying to override old definition of task antlib:org.apache.ivy.ant:findrevision
Trying to override old definition of task antlib:org.apache.ivy.ant:buildnumber
Trying to override old definition of task antlib:org.apache.ivy.ant:cleancache

-library.check:
     [echo] Java: java.home is /home/jenkins/tools/java/jdk1.6.0_27-32/jre and the target version is 1.6
     [echo] Ant: ant.home is /home/jenkins/jenkins-slave/tools/Ant/ant-1.8.2 and the target version is Apache Ant(TM) version 1.8.2 compiled on December 20 2010

-java6.check:
     [echo] Using Java 1.6 specification: 1.6

prepare:
    [mkdir] Created dir: <https://builds.apache.org/job/OpenMeetings%202.0/ws/2.0/build/red5/server/bin>
    [mkdir] Created dir: <https://builds.apache.org/job/OpenMeetings%202.0/ws/2.0/build/red5/server/log>
    [mkdir] Created dir: <https://builds.apache.org/job/OpenMeetings%202.0/ws/2.0/build/red5/server/dist/log>
    [mkdir] Created dir: <https://builds.apache.org/job/OpenMeetings%202.0/ws/2.0/build/red5/server/bin/testcases/classes>
    [mkdir] Created dir: <https://builds.apache.org/job/OpenMeetings%202.0/ws/2.0/build/red5/server/bin/testcases/testreports>

compile:
     [echo] javac version: 1.6
     [echo] Not using the Eclipse IDE
     [echo] Compiler adapter name: modern

compile-core:

retrieve:
     [echo] Ivy conf name: java6
[ivy:resolve] :: Apache Ivy 2.3.0-rc1 - 20120416000235 :: http://ant.apache.org/ivy/ ::
[ivy:resolve] :: loading settings :: file = <https://builds.apache.org/job/OpenMeetings%202.0/ws/2.0/build/red5/server/ivysettings.xml>
[ivy:resolve] :: resolving dependencies :: red5#server;working@janus [not transitive]
[ivy:resolve] 	confs: [java6]
[ivy:resolve] 	found javax#javaee-api;5.1.2 in googlecode
[ivy:resolve] 	found org.springframework#spring-aop;3.1.1.RELEASE in central
[ivy:resolve] 	found org.springframework#spring-asm;3.1.1.RELEASE in central
[ivy:resolve] 	found org.springframework#spring-beans;3.1.1.RELEASE in central
[ivy:resolve] 	found org.springframework#spring-context;3.1.1.RELEASE in central
[ivy:resolve] 	found org.springframework#spring-context-support;3.1.1.RELEASE in central
[ivy:resolve] 	found org.springframework#spring-core;3.1.1.RELEASE in central
[ivy:resolve] 	found org.springframework#spring-expression;3.1.1.RELEASE in central
[ivy:resolve] 	found org.springframework#spring-web;3.1.1.RELEASE in central
[ivy:resolve] 	found org.slf4j#slf4j-api;1.6.4 in chain
[ivy:resolve] 	found org.slf4j#jul-to-slf4j;1.6.4 in central
[ivy:resolve] 	found org.slf4j#log4j-over-slf4j;1.6.4 in central
[ivy:resolve] 	found org.slf4j#jcl-over-slf4j;1.6.4 in central
[ivy:resolve] 	found ch.qos.logback#logback-classic;1.0.3 in central
[ivy:resolve] 	found red5#sysout-over-slf4j;1.0.2 in googlecode
[ivy:resolve] 	found org.apache.commons#commons-beanutils;1.8.3 in sonatype
[ivy:resolve] 	found org.apache.commons#commons-codec;1.6 in apache
[ivy:resolve] 	found org.apache.commons#commons-collections;3.2.1 in sonatype
[ivy:resolve] 	found org.apache.httpcomponents#httpcore;4.2.1 in central
[ivy:resolve] 	found org.apache.httpcomponents#httpclient;4.2 in central
[ivy:resolve] 	found org.apache.commons#commons-lang3;3.1 in central
[ivy:resolve] 	found org.apache.commons#commons-modeler;2.0.1 in sonatype
[ivy:resolve] 	found org.apache.commons#commons-pool;1.5.6 in apache
[ivy:resolve] 	found org.quartz-scheduler#quartz;1.8.5 in central
[ivy:resolve] 	found net.sf.ehcache#ehcache-core;2.5.0 in central
[ivy:resolve] 	found org.apache.xerces#com.springsource.org.apache.xerces;2.9.1 in springsource-external
[ivy:resolve] 	found red5#xmlrpc;2.0.1 in sonatype
[ivy:resolve] 	found mina#mina-integration-beans;2.0.4 in googlecode
[ivy:resolve] 	found mina#mina-integration-jmx;2.0.4 in googlecode
[ivy:resolve] 	found mina#mina-core;2.0.4 in googlecode
[ivy:resolve] 	found org.objectweb.asm#com.springsource.org.objectweb.asm;3.2.0 in springsource-external
[ivy:resolve] 	found org.objectweb.asm#com.springsource.org.objectweb.asm.commons;3.2.0 in springsource-external
[ivy:resolve] 	found org.antlr#com.springsource.org.antlr;3.1.3 in springsource-external
[ivy:resolve] 	found org.codehaus.groovy#com.springsource.org.codehaus.groovy;1.7.0 in springsource-external
[ivy:resolve] 	found org.jruby#jruby;1.6.7.2 in central
[ivy:resolve] 	found org.python#jython-standalone;2.5.2 in chain
[ivy:resolve] 	found org.mozilla.javascript#com.springsource.org.mozilla.javascript;1.7.0.R2 in springsource-external
[ivy:resolve] 	found javax.xml.stream#com.springsource.javax.xml.stream;1.0.1 in springsource-external
[ivy:resolve] 	found red5#jaudiotagger;2.0.4-SNAPSHOT in googlecode
[ivy:resolve] 	found net.sourceforge.cglib#com.springsource.net.sf.cglib;2.2.0 in springsource-external
[ivy:resolve] 	found org.aopalliance#com.springsource.org.aopalliance;1.0.0 in springsource-external
[ivy:resolve] 	found red5#bcprov-jdk16;145 in googlecode
[ivy:resolve] downloading https://repository.apache.org/content/repositories/releases/commons-pool/commons-pool/1.5.6/commons-pool-1.5.6.jar ...
[ivy:resolve] ............... (98kB)
[ivy:resolve] ... (0kB)
[ivy:resolve] 	[SUCCESSFUL ] org.apache.commons#commons-pool;1.5.6!commons-pool.jar (500ms)
[ivy:resolve] downloading http://repository.springsource.com/maven/bundles/external/org/apache/xerces/com.springsource.org.apache.xerces/2.9.1/com.springsource.org.apache.xerces-2.9.1.jar ...
[ivy:resolve] ...................................... (1215kB)
[ivy:resolve] .. (0kB)
[ivy:resolve] downloading http://repository.springsource.com/maven/bundles/external/org/objectweb/asm/com.springsource.org.objectweb.asm/3.2.0/com.springsource.org.objectweb.asm-3.2.0.jar ...
[ivy:resolve] ..... (42kB)
[ivy:resolve] .. (0kB)
[ivy:resolve] 	[SUCCESSFUL ] org.objectweb.asm#com.springsource.org.objectweb.asm;3.2.0!com.springsource.org.objectweb.asm.jar (619ms)
[ivy:resolve] downloading http://repository.springsource.com/maven/bundles/external/org/codehaus/groovy/com.springsource.org.codehaus.groovy/1.7.0/com.springsource.org.codehaus.groovy-1.7.0.jar ...
[ivy:resolve] ...........................................................................................................................................................................
[ivy:resolve] ...................................................................................................................................................................................... (4367kB)
[ivy:resolve] .. (0kB)
[ivy:resolve] :: resolution report :: resolve 7439ms :: artifacts dl 5593ms
	---------------------------------------------------------------------
	|                  |            modules            ||   artifacts   |
	|       conf       | number| search|dwnlded|evicted|| number|dwnlded|
	---------------------------------------------------------------------
	|       java6      |   43  |   0   |   0   |   0   ||   42  |   2   |
	---------------------------------------------------------------------
[ivy:resolve] 
[ivy:resolve] :: problems summary ::
[ivy:resolve] :::: WARNINGS
[ivy:resolve] 	problem while downloading module descriptor: http://repo1.maven.org/maven2/ch/qos/logback/logback-core/1.0.3/logback-core-1.0.3.pom: impossible to move part file to definitive one: /home/jenkins/.ivy2/cache/ch.qos.logback/logback-core/ivy-1.0.3.xml.original.part -> /home/jenkins/.ivy2/cache/ch.qos.logback/logback-core/ivy-1.0.3.xml.original (68ms)
[ivy:resolve] 		module not found: ch.qos.logback#logback-core;1.0.3
[ivy:resolve] 	==== central: tried
[ivy:resolve] 	  http://repo1.maven.org/maven2/ch/qos/logback/logback-core/1.0.3/logback-core-1.0.3.pom
[ivy:resolve] 	==== springsource-external: tried
[ivy:resolve] 	  http://repository.springsource.com/maven/bundles/external/ch/qos/logback/logback-core/1.0.3/logback-core-1.0.3.pom
[ivy:resolve] 	  -- artifact ch.qos.logback#logback-core;1.0.3!logback-core.jar:
[ivy:resolve] 	  http://repository.springsource.com/maven/bundles/external/ch/qos/logback/logback-core/1.0.3/logback-core-1.0.3.jar
[ivy:resolve] 	==== springsource-release: tried
[ivy:resolve] 	  http://repository.springsource.com/maven/bundles/release/ch/qos/logback/logback-core/1.0.3/logback-core-1.0.3.pom
[ivy:resolve] 	  -- artifact ch.qos.logback#logback-core;1.0.3!logback-core.jar:
[ivy:resolve] 	  http://repository.springsource.com/maven/bundles/release/ch/qos/logback/logback-core/1.0.3/logback-core-1.0.3.jar
[ivy:resolve] 	==== mavencentral: tried
[ivy:resolve] 	  -- artifact ch.qos.logback#logback-core;1.0.3!logback-core.jar:
[ivy:resolve] 	  http://repo1.maven.org/maven2/ch.qos.logback/logback-core-1.0.3.jar
[ivy:resolve] 	==== apache: tried
[ivy:resolve] 	  -- artifact ch.qos.logback#logback-core;1.0.3!logback-core.jar:
[ivy:resolve] 	  https://repository.apache.org/content/repositories/releases/logback-core/logback-core/1.0.3/logback-core-1.0.3.jar
[ivy:resolve] 	  https://repository.apache.org/content/repositories/releases/ch.qos.logback/logback-core/1.0.3/logback-core-1.0.3.jar
[ivy:resolve] 	==== sonatype: tried
[ivy:resolve] 	  -- artifact ch.qos.logback#logback-core;1.0.3!logback-core.jar:
[ivy:resolve] 	  http://oss.sonatype.org/content/repositories/sourceforge-releases/ch.qos.logback/logback-core-1.0.3.jar
[ivy:resolve] 	  http://oss.sonatype.org/content/repositories/central/logback-core/logback-core/1.0.3/logback-core-1.0.3.jar
[ivy:resolve] 	==== googlecode: tried
[ivy:resolve] 	  -- artifact ch.qos.logback#logback-core;1.0.3!logback-core.jar:
[ivy:resolve] 	  http://red5.googlecode.com/svn/repository/logback-core-1.0.3.jar
[ivy:resolve] 	  http://red5.googlecode.com/svn/repository/ch.qos.logback/logback-core-1.0.3.jar
[ivy:resolve] 		[FAILED     ] org.apache.xerces#com.springsource.org.apache.xerces;2.9.1!com.springsource.org.apache.xerces.jar: invalid sha1: expected=1a7aa73569273cb296269530d350c8aacef37b51 computed=4e1316485ca818224c7444b4df85371eeb654124 (1428ms)
[ivy:resolve] 		[FAILED     ] org.apache.xerces#com.springsource.org.apache.xerces;2.9.1!com.springsource.org.apache.xerces.jar: invalid sha1: expected=1a7aa73569273cb296269530d350c8aacef37b51 computed=4e1316485ca818224c7444b4df85371eeb654124 (1428ms)
[ivy:resolve] 	==== springsource-external: tried
[ivy:resolve] 	  http://repository.springsource.com/maven/bundles/external/org/apache/xerces/com.springsource.org.apache.xerces/2.9.1/com.springsource.org.apache.xerces-2.9.1.jar
[ivy:resolve] 		[FAILED     ] org.codehaus.groovy#com.springsource.org.codehaus.groovy;1.7.0!com.springsource.org.codehaus.groovy.jar: /home/jenkins/.ivy2/cache/org.codehaus.groovy/com.springsource.org.codehaus.groovy/jars/com.springsource.org.codehaus.groovy-1.7.0.jar.part (No such file or directory) (2920ms)
[ivy:resolve] 		[FAILED     ] org.codehaus.groovy#com.springsource.org.codehaus.groovy;1.7.0!com.springsource.org.codehaus.groovy.jar: /home/jenkins/.ivy2/cache/org.codehaus.groovy/com.springsource.org.codehaus.groovy/jars/com.springsource.org.codehaus.groovy-1.7.0.jar.part (No such file or directory) (2920ms)
[ivy:resolve] 	==== springsource-external: tried
[ivy:resolve] 	  http://repository.springsource.com/maven/bundles/external/org/codehaus/groovy/com.springsource.org.codehaus.groovy/1.7.0/com.springsource.org.codehaus.groovy-1.7.0.jar
[ivy:resolve] 		::::::::::::::::::::::::::::::::::::::::::::::
[ivy:resolve] 		::          UNRESOLVED DEPENDENCIES         ::
[ivy:resolve] 		::::::::::::::::::::::::::::::::::::::::::::::
[ivy:resolve] 		:: ch.qos.logback#logback-core;1.0.3: not found
[ivy:resolve] 		::::::::::::::::::::::::::::::::::::::::::::::
[ivy:resolve] 		::::::::::::::::::::::::::::::::::::::::::::::
[ivy:resolve] 		::              FAILED DOWNLOADS            ::
[ivy:resolve] 		:: ^ see resolution messages for details  ^ ::
[ivy:resolve] 		::::::::::::::::::::::::::::::::::::::::::::::
[ivy:resolve] 		:: org.apache.xerces#com.springsource.org.apache.xerces;2.9.1!com.springsource.org.apache.xerces.jar
[ivy:resolve] 		:: org.codehaus.groovy#com.springsource.org.codehaus.groovy;1.7.0!com.springsource.org.codehaus.groovy.jar
[ivy:resolve] 		::::::::::::::::::::::::::::::::::::::::::::::
[ivy:resolve] 
[ivy:resolve] :: USE VERBOSE OR DEBUG MESSAGE LEVEL FOR MORE DETAILS

BUILD FAILED
<https://builds.apache.org/job/OpenMeetings%202.0/ws/2.0/build.xml>:748: The following error occurred while executing this line:
<https://builds.apache.org/job/OpenMeetings%202.0/ws/2.0/build/red5/server/build.xml>:202: The following error occurred while executing this line:
<https://builds.apache.org/job/OpenMeetings%202.0/ws/2.0/build/red5/server/build.xml>:216: The following error occurred while executing this line:
<https://builds.apache.org/job/OpenMeetings%202.0/ws/2.0/build/red5/server/build.xml>:167: impossible to resolve dependencies:
	resolve failed - see output for details

Total time: 35 seconds
Build step 'Invoke Ant' marked build as failure
Archiving artifacts