You are viewing a plain text version of this content. The canonical link for it is here.
Posted to builds@beam.apache.org by Apache Jenkins Server <je...@builds.apache.org> on 2021/02/09 12:00:14 UTC
Build failed in Jenkins:
beam_LoadTests_Python_SideInput_Dataflow_Batch #131
See <https://ci-beam.apache.org/job/beam_LoadTests_Python_SideInput_Dataflow_Batch/131/display/redirect?page=changes>
Changes:
[samuelw] [BEAM-11729] Remove calls to Class.getSimpleName() for WindowTracing
[Robert Bradshaw] [BEAM-11723] Use packed name for PairWithVoid consolidation.
[Robert Bradshaw] Only do pair-with-none packing when combiner packing is desired.
[Robert Bradshaw] Make eliminate_common_key_with_none private.
[randomstep] [BEAM-11595] bump jackson to 2.12.1
[randomstep] [BEAM-11503] bump rockdbjni to 6.15.2
[noreply] [BEAM-11773] Add bhulette as an owner for pandas, pyarrow, numpy
[Boyuan Zhang] Using LoadingCache instead of Map to cache BundleProcessor
[noreply] [BEAM-9547] Produce better errors for some groupby() and set_index()
[yifanmai] Remove translations.eliminate_common_key_with_none from DataflowRunner
[noreply] [BEAM-11762] Upgrades Tensorflow, numpy, and grpcio dependencies
[tysonjh] [BEAM-11377] Add retries to mvn command.
[noreply] [BEAM-9918] Support Tagged external PTransforms (#13872)
[zyichi] Explicitly set dataflow runner v2 test shuffle mode to appliance
[noreply] [BEAM-11265] make sure sample text file gets copied into archetype
[noreply] [BEAM-11324] Impose consistent ordering on partitionings used in
[noreply] [BEAM-11659] Extract common payload serialization behavior for Row
------------------------------------------
[...truncated 120.27 KB...]
Requirement already satisfied: pyhamcrest!=1.10.0,<2.0.0,>=1.9 in <https://ci-beam.apache.org/job/beam_LoadTests_Python_SideInput_Dataflow_Batch/ws/src/build/gradleenv/1329484227/lib/python3.7/site-packages> (from apache-beam==2.29.0.dev0) (1.10.1)
Requirement already satisfied: pyyaml<6.0.0,>=3.12 in <https://ci-beam.apache.org/job/beam_LoadTests_Python_SideInput_Dataflow_Batch/ws/src/build/gradleenv/1329484227/lib/python3.7/site-packages> (from apache-beam==2.29.0.dev0) (5.4.1)
Requirement already satisfied: requests_mock<2.0,>=1.7 in <https://ci-beam.apache.org/job/beam_LoadTests_Python_SideInput_Dataflow_Batch/ws/src/build/gradleenv/1329484227/lib/python3.7/site-packages> (from apache-beam==2.29.0.dev0) (1.8.0)
Requirement already satisfied: tenacity<6.0,>=5.0.2 in <https://ci-beam.apache.org/job/beam_LoadTests_Python_SideInput_Dataflow_Batch/ws/src/build/gradleenv/1329484227/lib/python3.7/site-packages> (from apache-beam==2.29.0.dev0) (5.1.5)
Requirement already satisfied: pytest<5.0,>=4.4.0 in <https://ci-beam.apache.org/job/beam_LoadTests_Python_SideInput_Dataflow_Batch/ws/src/build/gradleenv/1329484227/lib/python3.7/site-packages> (from apache-beam==2.29.0.dev0) (4.6.11)
Requirement already satisfied: pytest-xdist<2,>=1.29.0 in <https://ci-beam.apache.org/job/beam_LoadTests_Python_SideInput_Dataflow_Batch/ws/src/build/gradleenv/1329484227/lib/python3.7/site-packages> (from apache-beam==2.29.0.dev0) (1.34.0)
Requirement already satisfied: pytest-timeout<2,>=1.3.3 in <https://ci-beam.apache.org/job/beam_LoadTests_Python_SideInput_Dataflow_Batch/ws/src/build/gradleenv/1329484227/lib/python3.7/site-packages> (from apache-beam==2.29.0.dev0) (1.4.2)
Requirement already satisfied: sqlalchemy<2.0,>=1.3 in <https://ci-beam.apache.org/job/beam_LoadTests_Python_SideInput_Dataflow_Batch/ws/src/build/gradleenv/1329484227/lib/python3.7/site-packages> (from apache-beam==2.29.0.dev0) (1.3.23)
Requirement already satisfied: psycopg2-binary<3.0.0,>=2.8.5 in <https://ci-beam.apache.org/job/beam_LoadTests_Python_SideInput_Dataflow_Batch/ws/src/build/gradleenv/1329484227/lib/python3.7/site-packages> (from apache-beam==2.29.0.dev0) (2.8.6)
Requirement already satisfied: testcontainers<4.0.0,>=3.0.3 in <https://ci-beam.apache.org/job/beam_LoadTests_Python_SideInput_Dataflow_Batch/ws/src/build/gradleenv/1329484227/lib/python3.7/site-packages> (from apache-beam==2.29.0.dev0) (3.2.0)
Requirement already satisfied: cachetools<5,>=3.1.0 in <https://ci-beam.apache.org/job/beam_LoadTests_Python_SideInput_Dataflow_Batch/ws/src/build/gradleenv/1329484227/lib/python3.7/site-packages> (from apache-beam==2.29.0.dev0) (4.2.1)
Requirement already satisfied: google-apitools<0.5.32,>=0.5.31 in <https://ci-beam.apache.org/job/beam_LoadTests_Python_SideInput_Dataflow_Batch/ws/src/build/gradleenv/1329484227/lib/python3.7/site-packages> (from apache-beam==2.29.0.dev0) (0.5.31)
Requirement already satisfied: google-auth<2,>=1.18.0 in <https://ci-beam.apache.org/job/beam_LoadTests_Python_SideInput_Dataflow_Batch/ws/src/build/gradleenv/1329484227/lib/python3.7/site-packages> (from apache-beam==2.29.0.dev0) (1.25.0)
Requirement already satisfied: google-cloud-datastore<2,>=1.7.1 in <https://ci-beam.apache.org/job/beam_LoadTests_Python_SideInput_Dataflow_Batch/ws/src/build/gradleenv/1329484227/lib/python3.7/site-packages> (from apache-beam==2.29.0.dev0) (1.15.3)
Requirement already satisfied: google-cloud-pubsub<2,>=0.39.0 in <https://ci-beam.apache.org/job/beam_LoadTests_Python_SideInput_Dataflow_Batch/ws/src/build/gradleenv/1329484227/lib/python3.7/site-packages> (from apache-beam==2.29.0.dev0) (1.7.0)
Requirement already satisfied: google-cloud-bigquery<2,>=1.6.0 in <https://ci-beam.apache.org/job/beam_LoadTests_Python_SideInput_Dataflow_Batch/ws/src/build/gradleenv/1329484227/lib/python3.7/site-packages> (from apache-beam==2.29.0.dev0) (1.28.0)
Requirement already satisfied: google-cloud-core<2,>=0.28.1 in <https://ci-beam.apache.org/job/beam_LoadTests_Python_SideInput_Dataflow_Batch/ws/src/build/gradleenv/1329484227/lib/python3.7/site-packages> (from apache-beam==2.29.0.dev0) (1.6.0)
Requirement already satisfied: google-cloud-bigtable<2,>=0.31.1 in <https://ci-beam.apache.org/job/beam_LoadTests_Python_SideInput_Dataflow_Batch/ws/src/build/gradleenv/1329484227/lib/python3.7/site-packages> (from apache-beam==2.29.0.dev0) (1.6.1)
Requirement already satisfied: google-cloud-spanner<2,>=1.13.0 in <https://ci-beam.apache.org/job/beam_LoadTests_Python_SideInput_Dataflow_Batch/ws/src/build/gradleenv/1329484227/lib/python3.7/site-packages> (from apache-beam==2.29.0.dev0) (1.19.1)
Requirement already satisfied: grpcio-gcp<1,>=0.2.2 in <https://ci-beam.apache.org/job/beam_LoadTests_Python_SideInput_Dataflow_Batch/ws/src/build/gradleenv/1329484227/lib/python3.7/site-packages> (from apache-beam==2.29.0.dev0) (0.2.2)
Requirement already satisfied: google-cloud-dlp<2,>=0.12.0 in <https://ci-beam.apache.org/job/beam_LoadTests_Python_SideInput_Dataflow_Batch/ws/src/build/gradleenv/1329484227/lib/python3.7/site-packages> (from apache-beam==2.29.0.dev0) (1.0.0)
Requirement already satisfied: google-cloud-language<2,>=1.3.0 in <https://ci-beam.apache.org/job/beam_LoadTests_Python_SideInput_Dataflow_Batch/ws/src/build/gradleenv/1329484227/lib/python3.7/site-packages> (from apache-beam==2.29.0.dev0) (1.3.0)
Requirement already satisfied: google-cloud-videointelligence<2,>=1.8.0 in <https://ci-beam.apache.org/job/beam_LoadTests_Python_SideInput_Dataflow_Batch/ws/src/build/gradleenv/1329484227/lib/python3.7/site-packages> (from apache-beam==2.29.0.dev0) (1.16.1)
Requirement already satisfied: google-cloud-vision<2,>=0.38.0 in <https://ci-beam.apache.org/job/beam_LoadTests_Python_SideInput_Dataflow_Batch/ws/src/build/gradleenv/1329484227/lib/python3.7/site-packages> (from apache-beam==2.29.0.dev0) (1.0.0)
Requirement already satisfied: google-cloud-build<3,>=2.0.0 in <https://ci-beam.apache.org/job/beam_LoadTests_Python_SideInput_Dataflow_Batch/ws/src/build/gradleenv/1329484227/lib/python3.7/site-packages> (from apache-beam==2.29.0.dev0) (2.0.0)
Requirement already satisfied: azure-storage-blob>=12.3.2 in <https://ci-beam.apache.org/job/beam_LoadTests_Python_SideInput_Dataflow_Batch/ws/src/build/gradleenv/1329484227/lib/python3.7/site-packages> (from apache-beam==2.29.0.dev0) (12.7.1)
Requirement already satisfied: azure-core>=1.7.0 in <https://ci-beam.apache.org/job/beam_LoadTests_Python_SideInput_Dataflow_Batch/ws/src/build/gradleenv/1329484227/lib/python3.7/site-packages> (from apache-beam==2.29.0.dev0) (1.11.0)
Requirement already satisfied: boto3>=1.9 in <https://ci-beam.apache.org/job/beam_LoadTests_Python_SideInput_Dataflow_Batch/ws/src/build/gradleenv/1329484227/lib/python3.7/site-packages> (from apache-beam==2.29.0.dev0) (1.17.4)
Requirement already satisfied: six>=1.11.0 in <https://ci-beam.apache.org/job/beam_LoadTests_Python_SideInput_Dataflow_Batch/ws/src/build/gradleenv/1329484227/lib/python3.7/site-packages> (from azure-core>=1.7.0->apache-beam==2.29.0.dev0) (1.15.0)
Requirement already satisfied: msrest>=0.6.18 in <https://ci-beam.apache.org/job/beam_LoadTests_Python_SideInput_Dataflow_Batch/ws/src/build/gradleenv/1329484227/lib/python3.7/site-packages> (from azure-storage-blob>=12.3.2->apache-beam==2.29.0.dev0) (0.6.21)
Requirement already satisfied: cryptography>=2.1.4 in <https://ci-beam.apache.org/job/beam_LoadTests_Python_SideInput_Dataflow_Batch/ws/src/build/gradleenv/1329484227/lib/python3.7/site-packages> (from azure-storage-blob>=12.3.2->apache-beam==2.29.0.dev0) (3.4.3)
Requirement already satisfied: jmespath<1.0.0,>=0.7.1 in <https://ci-beam.apache.org/job/beam_LoadTests_Python_SideInput_Dataflow_Batch/ws/src/build/gradleenv/1329484227/lib/python3.7/site-packages> (from boto3>=1.9->apache-beam==2.29.0.dev0) (0.10.0)
Requirement already satisfied: s3transfer<0.4.0,>=0.3.0 in <https://ci-beam.apache.org/job/beam_LoadTests_Python_SideInput_Dataflow_Batch/ws/src/build/gradleenv/1329484227/lib/python3.7/site-packages> (from boto3>=1.9->apache-beam==2.29.0.dev0) (0.3.4)
Requirement already satisfied: botocore<1.21.0,>=1.20.4 in <https://ci-beam.apache.org/job/beam_LoadTests_Python_SideInput_Dataflow_Batch/ws/src/build/gradleenv/1329484227/lib/python3.7/site-packages> (from boto3>=1.9->apache-beam==2.29.0.dev0) (1.20.4)
Requirement already satisfied: urllib3<1.27,>=1.25.4 in <https://ci-beam.apache.org/job/beam_LoadTests_Python_SideInput_Dataflow_Batch/ws/src/build/gradleenv/1329484227/lib/python3.7/site-packages> (from botocore<1.21.0,>=1.20.4->boto3>=1.9->apache-beam==2.29.0.dev0) (1.26.3)
Requirement already satisfied: cffi>=1.12 in <https://ci-beam.apache.org/job/beam_LoadTests_Python_SideInput_Dataflow_Batch/ws/src/build/gradleenv/1329484227/lib/python3.7/site-packages> (from cryptography>=2.1.4->azure-storage-blob>=12.3.2->apache-beam==2.29.0.dev0) (1.14.4)
Requirement already satisfied: pycparser in <https://ci-beam.apache.org/job/beam_LoadTests_Python_SideInput_Dataflow_Batch/ws/src/build/gradleenv/1329484227/lib/python3.7/site-packages> (from cffi>=1.12->cryptography>=2.1.4->azure-storage-blob>=12.3.2->apache-beam==2.29.0.dev0) (2.20)
Requirement already satisfied: fasteners>=0.14 in <https://ci-beam.apache.org/job/beam_LoadTests_Python_SideInput_Dataflow_Batch/ws/src/build/gradleenv/1329484227/lib/python3.7/site-packages> (from google-apitools<0.5.32,>=0.5.31->apache-beam==2.29.0.dev0) (0.16)
Requirement already satisfied: pyasn1-modules>=0.2.1 in <https://ci-beam.apache.org/job/beam_LoadTests_Python_SideInput_Dataflow_Batch/ws/src/build/gradleenv/1329484227/lib/python3.7/site-packages> (from google-auth<2,>=1.18.0->apache-beam==2.29.0.dev0) (0.2.8)
Requirement already satisfied: rsa<5,>=3.1.4 in <https://ci-beam.apache.org/job/beam_LoadTests_Python_SideInput_Dataflow_Batch/ws/src/build/gradleenv/1329484227/lib/python3.7/site-packages> (from google-auth<2,>=1.18.0->apache-beam==2.29.0.dev0) (4.7)
Requirement already satisfied: setuptools>=40.3.0 in <https://ci-beam.apache.org/job/beam_LoadTests_Python_SideInput_Dataflow_Batch/ws/src/build/gradleenv/1329484227/lib/python3.7/site-packages> (from google-auth<2,>=1.18.0->apache-beam==2.29.0.dev0) (53.0.0)
Requirement already satisfied: google-resumable-media<2.0dev,>=0.6.0 in <https://ci-beam.apache.org/job/beam_LoadTests_Python_SideInput_Dataflow_Batch/ws/src/build/gradleenv/1329484227/lib/python3.7/site-packages> (from google-cloud-bigquery<2,>=1.6.0->apache-beam==2.29.0.dev0) (1.2.0)
Requirement already satisfied: google-api-core<2.0dev,>=1.21.0 in <https://ci-beam.apache.org/job/beam_LoadTests_Python_SideInput_Dataflow_Batch/ws/src/build/gradleenv/1329484227/lib/python3.7/site-packages> (from google-cloud-bigquery<2,>=1.6.0->apache-beam==2.29.0.dev0) (1.26.0)
Requirement already satisfied: packaging>=14.3 in <https://ci-beam.apache.org/job/beam_LoadTests_Python_SideInput_Dataflow_Batch/ws/src/build/gradleenv/1329484227/lib/python3.7/site-packages> (from google-api-core<2.0dev,>=1.21.0->google-cloud-bigquery<2,>=1.6.0->apache-beam==2.29.0.dev0) (20.9)
Requirement already satisfied: googleapis-common-protos<2.0dev,>=1.6.0 in <https://ci-beam.apache.org/job/beam_LoadTests_Python_SideInput_Dataflow_Batch/ws/src/build/gradleenv/1329484227/lib/python3.7/site-packages> (from google-api-core<2.0dev,>=1.21.0->google-cloud-bigquery<2,>=1.6.0->apache-beam==2.29.0.dev0) (1.52.0)
Requirement already satisfied: grpc-google-iam-v1<0.13dev,>=0.12.3 in <https://ci-beam.apache.org/job/beam_LoadTests_Python_SideInput_Dataflow_Batch/ws/src/build/gradleenv/1329484227/lib/python3.7/site-packages> (from google-cloud-bigtable<2,>=0.31.1->apache-beam==2.29.0.dev0) (0.12.3)
Requirement already satisfied: proto-plus>=0.4.0 in <https://ci-beam.apache.org/job/beam_LoadTests_Python_SideInput_Dataflow_Batch/ws/src/build/gradleenv/1329484227/lib/python3.7/site-packages> (from google-cloud-build<3,>=2.0.0->apache-beam==2.29.0.dev0) (1.13.0)
Requirement already satisfied: libcst>=0.2.5 in <https://ci-beam.apache.org/job/beam_LoadTests_Python_SideInput_Dataflow_Batch/ws/src/build/gradleenv/1329484227/lib/python3.7/site-packages> (from google-cloud-build<3,>=2.0.0->apache-beam==2.29.0.dev0) (0.3.17)
Requirement already satisfied: google-crc32c<2.0dev,>=1.0 in <https://ci-beam.apache.org/job/beam_LoadTests_Python_SideInput_Dataflow_Batch/ws/src/build/gradleenv/1329484227/lib/python3.7/site-packages> (from google-resumable-media<2.0dev,>=0.6.0->google-cloud-bigquery<2,>=1.6.0->apache-beam==2.29.0.dev0) (1.1.2)
Requirement already satisfied: docopt in <https://ci-beam.apache.org/job/beam_LoadTests_Python_SideInput_Dataflow_Batch/ws/src/build/gradleenv/1329484227/lib/python3.7/site-packages> (from hdfs<3.0.0,>=2.1.0->apache-beam==2.29.0.dev0) (0.6.2)
Requirement already satisfied: typing-inspect>=0.4.0 in <https://ci-beam.apache.org/job/beam_LoadTests_Python_SideInput_Dataflow_Batch/ws/src/build/gradleenv/1329484227/lib/python3.7/site-packages> (from libcst>=0.2.5->google-cloud-build<3,>=2.0.0->apache-beam==2.29.0.dev0) (0.6.0)
Requirement already satisfied: pbr>=0.11 in <https://ci-beam.apache.org/job/beam_LoadTests_Python_SideInput_Dataflow_Batch/ws/src/build/gradleenv/1329484227/lib/python3.7/site-packages> (from mock<3.0.0,>=1.0.1->apache-beam==2.29.0.dev0) (5.5.1)
Requirement already satisfied: isodate>=0.6.0 in <https://ci-beam.apache.org/job/beam_LoadTests_Python_SideInput_Dataflow_Batch/ws/src/build/gradleenv/1329484227/lib/python3.7/site-packages> (from msrest>=0.6.18->azure-storage-blob>=12.3.2->apache-beam==2.29.0.dev0) (0.6.0)
Requirement already satisfied: requests-oauthlib>=0.5.0 in <https://ci-beam.apache.org/job/beam_LoadTests_Python_SideInput_Dataflow_Batch/ws/src/build/gradleenv/1329484227/lib/python3.7/site-packages> (from msrest>=0.6.18->azure-storage-blob>=12.3.2->apache-beam==2.29.0.dev0) (1.3.0)
Requirement already satisfied: certifi>=2017.4.17 in <https://ci-beam.apache.org/job/beam_LoadTests_Python_SideInput_Dataflow_Batch/ws/src/build/gradleenv/1329484227/lib/python3.7/site-packages> (from msrest>=0.6.18->azure-storage-blob>=12.3.2->apache-beam==2.29.0.dev0) (2020.12.5)
Requirement already satisfied: pyasn1>=0.1.7 in <https://ci-beam.apache.org/job/beam_LoadTests_Python_SideInput_Dataflow_Batch/ws/src/build/gradleenv/1329484227/lib/python3.7/site-packages> (from oauth2client<5,>=2.0.1->apache-beam==2.29.0.dev0) (0.4.8)
Requirement already satisfied: pyparsing>=2.0.2 in <https://ci-beam.apache.org/job/beam_LoadTests_Python_SideInput_Dataflow_Batch/ws/src/build/gradleenv/1329484227/lib/python3.7/site-packages> (from packaging>=14.3->google-api-core<2.0dev,>=1.21.0->google-cloud-bigquery<2,>=1.6.0->apache-beam==2.29.0.dev0) (2.4.7)
Requirement already satisfied: wcwidth in <https://ci-beam.apache.org/job/beam_LoadTests_Python_SideInput_Dataflow_Batch/ws/src/build/gradleenv/1329484227/lib/python3.7/site-packages> (from pytest<5.0,>=4.4.0->apache-beam==2.29.0.dev0) (0.2.5)
Requirement already satisfied: atomicwrites>=1.0 in <https://ci-beam.apache.org/job/beam_LoadTests_Python_SideInput_Dataflow_Batch/ws/src/build/gradleenv/1329484227/lib/python3.7/site-packages> (from pytest<5.0,>=4.4.0->apache-beam==2.29.0.dev0) (1.4.0)
Requirement already satisfied: importlib-metadata>=0.12 in <https://ci-beam.apache.org/job/beam_LoadTests_Python_SideInput_Dataflow_Batch/ws/src/build/gradleenv/1329484227/lib/python3.7/site-packages> (from pytest<5.0,>=4.4.0->apache-beam==2.29.0.dev0) (2.1.1)
Requirement already satisfied: attrs>=17.4.0 in <https://ci-beam.apache.org/job/beam_LoadTests_Python_SideInput_Dataflow_Batch/ws/src/build/gradleenv/1329484227/lib/python3.7/site-packages> (from pytest<5.0,>=4.4.0->apache-beam==2.29.0.dev0) (20.3.0)
Requirement already satisfied: more-itertools>=4.0.0 in <https://ci-beam.apache.org/job/beam_LoadTests_Python_SideInput_Dataflow_Batch/ws/src/build/gradleenv/1329484227/lib/python3.7/site-packages> (from pytest<5.0,>=4.4.0->apache-beam==2.29.0.dev0) (8.7.0)
Requirement already satisfied: py>=1.5.0 in <https://ci-beam.apache.org/job/beam_LoadTests_Python_SideInput_Dataflow_Batch/ws/src/build/gradleenv/1329484227/lib/python3.7/site-packages> (from pytest<5.0,>=4.4.0->apache-beam==2.29.0.dev0) (1.10.0)
Requirement already satisfied: pluggy<1.0,>=0.12 in <https://ci-beam.apache.org/job/beam_LoadTests_Python_SideInput_Dataflow_Batch/ws/src/build/gradleenv/1329484227/lib/python3.7/site-packages> (from pytest<5.0,>=4.4.0->apache-beam==2.29.0.dev0) (0.13.1)
Requirement already satisfied: zipp>=0.5 in <https://ci-beam.apache.org/job/beam_LoadTests_Python_SideInput_Dataflow_Batch/ws/src/build/gradleenv/1329484227/lib/python3.7/site-packages> (from importlib-metadata>=0.12->pytest<5.0,>=4.4.0->apache-beam==2.29.0.dev0) (3.4.0)
Requirement already satisfied: pytest-forked in <https://ci-beam.apache.org/job/beam_LoadTests_Python_SideInput_Dataflow_Batch/ws/src/build/gradleenv/1329484227/lib/python3.7/site-packages> (from pytest-xdist<2,>=1.29.0->apache-beam==2.29.0.dev0) (1.3.0)
Requirement already satisfied: execnet>=1.1 in <https://ci-beam.apache.org/job/beam_LoadTests_Python_SideInput_Dataflow_Batch/ws/src/build/gradleenv/1329484227/lib/python3.7/site-packages> (from pytest-xdist<2,>=1.29.0->apache-beam==2.29.0.dev0) (1.8.0)
Requirement already satisfied: apipkg>=1.4 in <https://ci-beam.apache.org/job/beam_LoadTests_Python_SideInput_Dataflow_Batch/ws/src/build/gradleenv/1329484227/lib/python3.7/site-packages> (from execnet>=1.1->pytest-xdist<2,>=1.29.0->apache-beam==2.29.0.dev0) (1.5)
Requirement already satisfied: idna<3,>=2.5 in <https://ci-beam.apache.org/job/beam_LoadTests_Python_SideInput_Dataflow_Batch/ws/src/build/gradleenv/1329484227/lib/python3.7/site-packages> (from requests<3.0.0,>=2.24.0->apache-beam==2.29.0.dev0) (2.10)
Requirement already satisfied: chardet<5,>=3.0.2 in <https://ci-beam.apache.org/job/beam_LoadTests_Python_SideInput_Dataflow_Batch/ws/src/build/gradleenv/1329484227/lib/python3.7/site-packages> (from requests<3.0.0,>=2.24.0->apache-beam==2.29.0.dev0) (4.0.0)
Requirement already satisfied: oauthlib>=3.0.0 in <https://ci-beam.apache.org/job/beam_LoadTests_Python_SideInput_Dataflow_Batch/ws/src/build/gradleenv/1329484227/lib/python3.7/site-packages> (from requests-oauthlib>=0.5.0->msrest>=0.6.18->azure-storage-blob>=12.3.2->apache-beam==2.29.0.dev0) (3.1.0)
Requirement already satisfied: deprecation in <https://ci-beam.apache.org/job/beam_LoadTests_Python_SideInput_Dataflow_Batch/ws/src/build/gradleenv/1329484227/lib/python3.7/site-packages> (from testcontainers<4.0.0,>=3.0.3->apache-beam==2.29.0.dev0) (2.1.0)
Requirement already satisfied: docker in <https://ci-beam.apache.org/job/beam_LoadTests_Python_SideInput_Dataflow_Batch/ws/src/build/gradleenv/1329484227/lib/python3.7/site-packages> (from testcontainers<4.0.0,>=3.0.3->apache-beam==2.29.0.dev0) (4.4.1)
Requirement already satisfied: wrapt in <https://ci-beam.apache.org/job/beam_LoadTests_Python_SideInput_Dataflow_Batch/ws/src/build/gradleenv/1329484227/lib/python3.7/site-packages> (from testcontainers<4.0.0,>=3.0.3->apache-beam==2.29.0.dev0) (1.12.1)
Requirement already satisfied: mypy-extensions>=0.3.0 in <https://ci-beam.apache.org/job/beam_LoadTests_Python_SideInput_Dataflow_Batch/ws/src/build/gradleenv/1329484227/lib/python3.7/site-packages> (from typing-inspect>=0.4.0->libcst>=0.2.5->google-cloud-build<3,>=2.0.0->apache-beam==2.29.0.dev0) (0.4.3)
Requirement already satisfied: websocket-client>=0.32.0 in <https://ci-beam.apache.org/job/beam_LoadTests_Python_SideInput_Dataflow_Batch/ws/src/build/gradleenv/1329484227/lib/python3.7/site-packages> (from docker->testcontainers<4.0.0,>=3.0.3->apache-beam==2.29.0.dev0) (0.57.0)
DEPRECATION: Source distribution is being reinstalled despite an installed package having the same name and version as the installed package. pip 21.1 will remove support for this functionality. A possible replacement is use --force-reinstall. You can find discussion regarding this at https://github.com/pypa/pip/issues/8711.
Building wheels for collected packages: apache-beam
Building wheel for apache-beam (setup.py): started
Building wheel for apache-beam (setup.py): finished with status 'done'
Created wheel for apache-beam: filename=apache_beam-2.29.0.dev0-py3-none-any.whl size=2390429 sha256=f67964174271e4d2ff2d9fe1f17eb289c2396bc9810237b3a412fc6388c9f86a
Stored in directory: /home/jenkins/.cache/pip/wheels/c1/f5/a3/8f5ec48b796c1b690bd340ec7688fb88886afa83d7f14ff737
Successfully built apache-beam
Installing collected packages: apache-beam
Attempting uninstall: apache-beam
Found existing installation: apache-beam 2.29.0.dev0
Uninstalling apache-beam-2.29.0.dev0:
Unknown event 0x800 for <https://ci-beam.apache.org/job/beam_LoadTests_Python_SideInput_Dataflow_Batch/ws/src/build/gradleenv/1329484227/lib/python3.7/site-packages/apache_beam-2.29.0.dev0.dist-info>
Unknown event 0x800 for <https://ci-beam.apache.org/job/beam_LoadTests_Python_SideInput_Dataflow_Batch/ws/src/build/gradleenv/1329484227/lib/python3.7/site-packages/apache_beam>
Dropped VFS state due to lost state
> Task :sdks:python:apache_beam:testing:load_tests:installGcpTest
Successfully uninstalled apache-beam-2.29.0.dev0
Successfully installed apache-beam-2.29.0.dev0
> Task :sdks:python:apache_beam:testing:load_tests:run
INFO:root:100000 out of 10000000 total elements in each window will be accessed.
INFO:apache_beam.runners.portability.stager:Copying Beam SDK "<https://ci-beam.apache.org/job/beam_LoadTests_Python_SideInput_Dataflow_Batch/ws/src/sdks/python/build/apache-beam.tar.gz"> to staging location.
WARNING:root:Make sure that locally built Python SDK docker image has Python 3.7 interpreter.
INFO:root:Default Python SDK image for environment is apache/beam_python3.7_sdk:2.29.0.dev
INFO:root:Using provided Python SDK container image: gcr.io/cloud-dataflow/v1beta3/python37-fnapi:beam-master-20201214
INFO:root:Python SDK container image set to "gcr.io/cloud-dataflow/v1beta3/python37-fnapi:beam-master-20201214" for Docker environment
INFO:apache_beam.runners.dataflow.internal.apiclient:Defaulting to the temp_location as staging_location: gs://temp-storage-for-perf-tests/loadtests
INFO:apache_beam.internal.gcp.auth:Setting socket default timeout to 60 seconds.
INFO:apache_beam.internal.gcp.auth:socket default timeout is 60.0 seconds.
INFO:apache_beam.runners.dataflow.internal.apiclient:Starting GCS upload to gs://temp-storage-for-perf-tests/loadtests/load-tests-python-dataflow-batch-sideinput-3-0209100335.1612871100.387865/pipeline.pb...
INFO:oauth2client.transport:Attempting refresh to obtain initial access_token
INFO:oauth2client.transport:Attempting refresh to obtain initial access_token
INFO:apache_beam.runners.dataflow.internal.apiclient:Completed GCS upload to gs://temp-storage-for-perf-tests/loadtests/load-tests-python-dataflow-batch-sideinput-3-0209100335.1612871100.387865/pipeline.pb in 0 seconds.
INFO:apache_beam.runners.dataflow.internal.apiclient:Starting GCS upload to gs://temp-storage-for-perf-tests/loadtests/load-tests-python-dataflow-batch-sideinput-3-0209100335.1612871100.387865/dataflow_python_sdk.tar...
INFO:apache_beam.runners.dataflow.internal.apiclient:Completed GCS upload to gs://temp-storage-for-perf-tests/loadtests/load-tests-python-dataflow-batch-sideinput-3-0209100335.1612871100.387865/dataflow_python_sdk.tar in 0 seconds.
WARNING:apache_beam.options.pipeline_options:Discarding unparseable args: ['--side_input_type=iter', '--access_percentage=1']
WARNING:apache_beam.options.pipeline_options:Discarding unparseable args: ['--side_input_type=iter', '--access_percentage=1']
INFO:apache_beam.runners.dataflow.internal.apiclient:Create job: <Job
createTime: '2021-02-09T11:45:02.217605Z'
currentStateTime: '1970-01-01T00:00:00Z'
id: '2021-02-09_03_45_00-12009095722562284333'
location: 'us-central1'
name: 'load-tests-python-dataflow-batch-sideinput-3-0209100335'
projectId: 'apache-beam-testing'
stageStates: []
startTime: '2021-02-09T11:45:02.217605Z'
steps: []
tempFiles: []
type: TypeValueValuesEnum(JOB_TYPE_BATCH, 1)>
INFO:apache_beam.runners.dataflow.internal.apiclient:Created job with id: [2021-02-09_03_45_00-12009095722562284333]
INFO:apache_beam.runners.dataflow.internal.apiclient:Submitted job: 2021-02-09_03_45_00-12009095722562284333
INFO:apache_beam.runners.dataflow.internal.apiclient:To access the Dataflow monitoring console, please navigate to https://console.cloud.google.com/dataflow/jobs/us-central1/2021-02-09_03_45_00-12009095722562284333?project=apache-beam-testing
INFO:apache_beam.runners.dataflow.dataflow_runner:Job 2021-02-09_03_45_00-12009095722562284333 is in state JOB_STATE_PENDING
INFO:apache_beam.runners.dataflow.dataflow_runner:2021-02-09T11:45:07.788Z: JOB_MESSAGE_BASIC: Worker configuration: n1-standard-1 in us-central1-a.
INFO:apache_beam.runners.dataflow.dataflow_runner:2021-02-09T11:45:09.055Z: JOB_MESSAGE_DETAILED: Expanding SplittableParDo operations into optimizable parts.
INFO:apache_beam.runners.dataflow.dataflow_runner:2021-02-09T11:45:09.091Z: JOB_MESSAGE_DETAILED: Expanding CollectionToSingleton operations into optimizable parts.
INFO:apache_beam.runners.dataflow.dataflow_runner:2021-02-09T11:45:09.149Z: JOB_MESSAGE_DETAILED: Expanding CoGroupByKey operations into optimizable parts.
INFO:apache_beam.runners.dataflow.dataflow_runner:2021-02-09T11:45:09.175Z: JOB_MESSAGE_DEBUG: Combiner lifting skipped for step Side input: create/MaybeReshuffle/Reshuffle/ReshufflePerKey/GroupByKey: GroupByKey not followed by a combiner.
INFO:apache_beam.runners.dataflow.dataflow_runner:2021-02-09T11:45:09.217Z: JOB_MESSAGE_DETAILED: Expanding GroupByKey operations into optimizable parts.
INFO:apache_beam.runners.dataflow.dataflow_runner:2021-02-09T11:45:09.240Z: JOB_MESSAGE_DEBUG: Annotating graph with Autotuner information.
INFO:apache_beam.runners.dataflow.dataflow_runner:2021-02-09T11:45:09.302Z: JOB_MESSAGE_DETAILED: Fusing adjacent ParDo, Read, Write, and Flatten operations
INFO:apache_beam.runners.dataflow.dataflow_runner:2021-02-09T11:45:09.354Z: JOB_MESSAGE_DETAILED: Fusing consumer Side input: create/FlatMap(<lambda at core.py:2957>) into Side input: create/Impulse
INFO:apache_beam.runners.dataflow.dataflow_runner:2021-02-09T11:45:09.390Z: JOB_MESSAGE_DETAILED: Fusing consumer Side input: create/MaybeReshuffle/Reshuffle/AddRandomKeys into Side input: create/FlatMap(<lambda at core.py:2957>)
INFO:apache_beam.runners.dataflow.dataflow_runner:2021-02-09T11:45:09.423Z: JOB_MESSAGE_DETAILED: Fusing consumer Side input: create/MaybeReshuffle/Reshuffle/ReshufflePerKey/Map(reify_timestamps) into Side input: create/MaybeReshuffle/Reshuffle/AddRandomKeys
INFO:apache_beam.runners.dataflow.dataflow_runner:2021-02-09T11:45:09.457Z: JOB_MESSAGE_DETAILED: Fusing consumer Side input: create/MaybeReshuffle/Reshuffle/ReshufflePerKey/GroupByKey/Reify into Side input: create/MaybeReshuffle/Reshuffle/ReshufflePerKey/Map(reify_timestamps)
INFO:apache_beam.runners.dataflow.dataflow_runner:2021-02-09T11:45:09.495Z: JOB_MESSAGE_DETAILED: Fusing consumer Side input: create/MaybeReshuffle/Reshuffle/ReshufflePerKey/GroupByKey/Write into Side input: create/MaybeReshuffle/Reshuffle/ReshufflePerKey/GroupByKey/Reify
INFO:apache_beam.runners.dataflow.dataflow_runner:2021-02-09T11:45:09.527Z: JOB_MESSAGE_DETAILED: Fusing consumer Side input: create/MaybeReshuffle/Reshuffle/ReshufflePerKey/GroupByKey/GroupByWindow into Side input: create/MaybeReshuffle/Reshuffle/ReshufflePerKey/GroupByKey/Read
INFO:apache_beam.runners.dataflow.dataflow_runner:2021-02-09T11:45:09.562Z: JOB_MESSAGE_DETAILED: Fusing consumer Side input: create/MaybeReshuffle/Reshuffle/ReshufflePerKey/FlatMap(restore_timestamps) into Side input: create/MaybeReshuffle/Reshuffle/ReshufflePerKey/GroupByKey/GroupByWindow
INFO:apache_beam.runners.dataflow.dataflow_runner:2021-02-09T11:45:09.593Z: JOB_MESSAGE_DETAILED: Fusing consumer Side input: create/MaybeReshuffle/Reshuffle/RemoveRandomKeys into Side input: create/MaybeReshuffle/Reshuffle/ReshufflePerKey/FlatMap(restore_timestamps)
INFO:apache_beam.runners.dataflow.dataflow_runner:2021-02-09T11:45:09.629Z: JOB_MESSAGE_DETAILED: Fusing consumer Side input: create/Map(decode) into Side input: create/MaybeReshuffle/Reshuffle/RemoveRandomKeys
INFO:apache_beam.runners.dataflow.dataflow_runner:2021-02-09T11:45:09.662Z: JOB_MESSAGE_DETAILED: Fusing consumer Get synthetic SDF options into Side input: create/Map(decode)
INFO:apache_beam.runners.dataflow.dataflow_runner:2021-02-09T11:45:09.716Z: JOB_MESSAGE_DETAILED: Fusing consumer ref_AppliedPTransform_Generate input_20/PairWithRestriction into Get synthetic SDF options
INFO:apache_beam.runners.dataflow.dataflow_runner:2021-02-09T11:45:09.749Z: JOB_MESSAGE_DETAILED: Fusing consumer ref_AppliedPTransform_Generate input_20/SplitWithSizing into ref_AppliedPTransform_Generate input_20/PairWithRestriction
INFO:apache_beam.runners.dataflow.dataflow_runner:2021-02-09T11:45:09.778Z: JOB_MESSAGE_DETAILED: Fusing consumer Create/FlatMap(<lambda at core.py:2957>) into Create/Impulse
INFO:apache_beam.runners.dataflow.dataflow_runner:2021-02-09T11:45:09.806Z: JOB_MESSAGE_DETAILED: Fusing consumer Create/Map(decode) into Create/FlatMap(<lambda at core.py:2957>)
INFO:apache_beam.runners.dataflow.dataflow_runner:2021-02-09T11:45:09.830Z: JOB_MESSAGE_DETAILED: Fusing consumer Collect start time metrics into Create/Map(decode)
INFO:apache_beam.runners.dataflow.dataflow_runner:2021-02-09T11:45:09.870Z: JOB_MESSAGE_DETAILED: Fusing consumer ParDo(SequenceSideInputTestDoFn) into Collect start time metrics
INFO:apache_beam.runners.dataflow.dataflow_runner:2021-02-09T11:45:09.903Z: JOB_MESSAGE_DETAILED: Fusing consumer Collect end time metrics into ParDo(SequenceSideInputTestDoFn)
INFO:apache_beam.runners.dataflow.dataflow_runner:2021-02-09T11:45:09.940Z: JOB_MESSAGE_DEBUG: Workflow config is missing a default resource spec.
INFO:apache_beam.runners.dataflow.dataflow_runner:2021-02-09T11:45:09.974Z: JOB_MESSAGE_DEBUG: Adding StepResource setup and teardown to workflow graph.
INFO:apache_beam.runners.dataflow.dataflow_runner:2021-02-09T11:45:10.006Z: JOB_MESSAGE_DEBUG: Adding workflow start and stop steps.
INFO:apache_beam.runners.dataflow.dataflow_runner:2021-02-09T11:45:10.047Z: JOB_MESSAGE_DEBUG: Assigning stage ids.
INFO:apache_beam.runners.dataflow.dataflow_runner:2021-02-09T11:45:10.234Z: JOB_MESSAGE_DEBUG: Executing wait step start21
INFO:apache_beam.runners.dataflow.dataflow_runner:2021-02-09T11:45:10.303Z: JOB_MESSAGE_BASIC: Executing operation Side input: create/MaybeReshuffle/Reshuffle/ReshufflePerKey/GroupByKey/Create
INFO:apache_beam.runners.dataflow.dataflow_runner:2021-02-09T11:45:10.389Z: JOB_MESSAGE_DEBUG: Starting **** pool setup.
INFO:apache_beam.runners.dataflow.dataflow_runner:2021-02-09T11:45:10.414Z: JOB_MESSAGE_BASIC: Starting 10 ****s in us-central1-a...
INFO:apache_beam.runners.dataflow.dataflow_runner:2021-02-09T11:45:10.858Z: JOB_MESSAGE_BASIC: Finished operation Side input: create/MaybeReshuffle/Reshuffle/ReshufflePerKey/GroupByKey/Create
INFO:apache_beam.runners.dataflow.dataflow_runner:2021-02-09T11:45:10.963Z: JOB_MESSAGE_DEBUG: Value "Side input: create/MaybeReshuffle/Reshuffle/ReshufflePerKey/GroupByKey/Session" materialized.
INFO:apache_beam.runners.dataflow.dataflow_runner:2021-02-09T11:45:11.022Z: JOB_MESSAGE_BASIC: Executing operation Side input: create/Impulse+Side input: create/FlatMap(<lambda at core.py:2957>)+Side input: create/MaybeReshuffle/Reshuffle/AddRandomKeys+Side input: create/MaybeReshuffle/Reshuffle/ReshufflePerKey/Map(reify_timestamps)+Side input: create/MaybeReshuffle/Reshuffle/ReshufflePerKey/GroupByKey/Reify+Side input: create/MaybeReshuffle/Reshuffle/ReshufflePerKey/GroupByKey/Write
INFO:apache_beam.runners.dataflow.dataflow_runner:Job 2021-02-09_03_45_00-12009095722562284333 is in state JOB_STATE_RUNNING
INFO:apache_beam.runners.dataflow.dataflow_runner:2021-02-09T11:45:43.148Z: JOB_MESSAGE_DETAILED: Autoscaling: Raised the number of ****s to 9 based on the rate of progress in the currently running stage(s).
INFO:apache_beam.runners.dataflow.dataflow_runner:2021-02-09T11:45:43.192Z: JOB_MESSAGE_DETAILED: Resized **** pool to 9, though goal was 10. This could be a quota issue.
INFO:apache_beam.runners.dataflow.dataflow_runner:2021-02-09T11:45:44.618Z: JOB_MESSAGE_BASIC: Your project already contains 100 Dataflow-created metric descriptors, so new user metrics of the form custom.googleapis.com/* will not be created. However, all user metrics are also available in the metric dataflow.googleapis.com/job/user_counter. If you rely on the custom metrics, you can delete old / unused metric descriptors. See https://developers.google.com/apis-explorer/#p/monitoring/v3/monitoring.projects.metricDescriptors.list and https://developers.google.com/apis-explorer/#p/monitoring/v3/monitoring.projects.metricDescriptors.delete
INFO:apache_beam.runners.dataflow.dataflow_runner:2021-02-09T11:45:53.573Z: JOB_MESSAGE_DETAILED: Autoscaling: Raised the number of ****s to 10 based on the rate of progress in the currently running stage(s).
INFO:apache_beam.runners.dataflow.dataflow_runner:2021-02-09T11:46:16.611Z: JOB_MESSAGE_DETAILED: Workers have started successfully.
INFO:apache_beam.runners.dataflow.dataflow_runner:2021-02-09T11:46:16.639Z: JOB_MESSAGE_DETAILED: Workers have started successfully.
INFO:apache_beam.runners.dataflow.dataflow_runner:2021-02-09T11:50:54.565Z: JOB_MESSAGE_BASIC: Finished operation Side input: create/Impulse+Side input: create/FlatMap(<lambda at core.py:2957>)+Side input: create/MaybeReshuffle/Reshuffle/AddRandomKeys+Side input: create/MaybeReshuffle/Reshuffle/ReshufflePerKey/Map(reify_timestamps)+Side input: create/MaybeReshuffle/Reshuffle/ReshufflePerKey/GroupByKey/Reify+Side input: create/MaybeReshuffle/Reshuffle/ReshufflePerKey/GroupByKey/Write
INFO:apache_beam.runners.dataflow.dataflow_runner:2021-02-09T11:50:54.640Z: JOB_MESSAGE_BASIC: Executing operation Side input: create/MaybeReshuffle/Reshuffle/ReshufflePerKey/GroupByKey/Close
INFO:apache_beam.runners.dataflow.dataflow_runner:2021-02-09T11:50:54.820Z: JOB_MESSAGE_BASIC: Finished operation Side input: create/MaybeReshuffle/Reshuffle/ReshufflePerKey/GroupByKey/Close
INFO:apache_beam.runners.dataflow.dataflow_runner:2021-02-09T11:50:54.897Z: JOB_MESSAGE_BASIC: Executing operation Side input: create/MaybeReshuffle/Reshuffle/ReshufflePerKey/GroupByKey/Read+Side input: create/MaybeReshuffle/Reshuffle/ReshufflePerKey/GroupByKey/GroupByWindow+Side input: create/MaybeReshuffle/Reshuffle/ReshufflePerKey/FlatMap(restore_timestamps)+Side input: create/MaybeReshuffle/Reshuffle/RemoveRandomKeys+Side input: create/Map(decode)+Get synthetic SDF options+ref_AppliedPTransform_Generate input_20/PairWithRestriction+ref_AppliedPTransform_Generate input_20/SplitWithSizing
INFO:apache_beam.runners.dataflow.dataflow_runner:2021-02-09T11:51:13.027Z: JOB_MESSAGE_BASIC: Finished operation Side input: create/MaybeReshuffle/Reshuffle/ReshufflePerKey/GroupByKey/Read+Side input: create/MaybeReshuffle/Reshuffle/ReshufflePerKey/GroupByKey/GroupByWindow+Side input: create/MaybeReshuffle/Reshuffle/ReshufflePerKey/FlatMap(restore_timestamps)+Side input: create/MaybeReshuffle/Reshuffle/RemoveRandomKeys+Side input: create/Map(decode)+Get synthetic SDF options+ref_AppliedPTransform_Generate input_20/PairWithRestriction+ref_AppliedPTransform_Generate input_20/SplitWithSizing
INFO:apache_beam.runners.dataflow.dataflow_runner:2021-02-09T11:51:13.122Z: JOB_MESSAGE_DEBUG: Value "ref_AppliedPTransform_Generate input_20-split-with-sizing-out3" materialized.
INFO:apache_beam.runners.dataflow.dataflow_runner:2021-02-09T11:51:13.204Z: JOB_MESSAGE_BASIC: Executing operation ref_AppliedPTransform_Generate input_20/ProcessElementAndRestrictionWithSizing
INFO:apache_beam.runners.dataflow.dataflow_runner:2021-02-09T11:53:02.326Z: JOB_MESSAGE_BASIC: Finished operation ref_AppliedPTransform_Generate input_20/ProcessElementAndRestrictionWithSizing
INFO:apache_beam.runners.dataflow.dataflow_runner:2021-02-09T11:53:02.413Z: JOB_MESSAGE_DEBUG: Value "Generate input.None" materialized.
INFO:apache_beam.runners.dataflow.dataflow_runner:2021-02-09T11:53:02.539Z: JOB_MESSAGE_BASIC: Executing operation ParDo(SequenceSideInputTestDoFn)/View-python_side_input0-ParDo(SequenceSideInputTestDoFn)
INFO:apache_beam.runners.dataflow.dataflow_runner:2021-02-09T11:53:02.617Z: JOB_MESSAGE_BASIC: Finished operation ParDo(SequenceSideInputTestDoFn)/View-python_side_input0-ParDo(SequenceSideInputTestDoFn)
INFO:apache_beam.runners.dataflow.dataflow_runner:2021-02-09T11:53:02.706Z: JOB_MESSAGE_DEBUG: Value "ParDo(SequenceSideInputTestDoFn)/View-python_side_input0-ParDo(SequenceSideInputTestDoFn).out" materialized.
INFO:apache_beam.runners.dataflow.dataflow_runner:2021-02-09T11:53:02.768Z: JOB_MESSAGE_BASIC: Executing operation Create/Impulse+Create/FlatMap(<lambda at core.py:2957>)+Create/Map(decode)+Collect start time metrics+ParDo(SequenceSideInputTestDoFn)+Collect end time metrics
INFO:apache_beam.runners.dataflow.dataflow_runner:2021-02-09T11:53:56.135Z: JOB_MESSAGE_ERROR: SDK harness sdk-0-0 disconnected.
INFO:apache_beam.runners.dataflow.dataflow_runner:2021-02-09T11:54:57.718Z: JOB_MESSAGE_ERROR: SDK harness sdk-0-0 disconnected.
INFO:apache_beam.runners.dataflow.dataflow_runner:2021-02-09T11:57:15.147Z: JOB_MESSAGE_ERROR: SDK harness sdk-0-0 disconnected.
INFO:apache_beam.runners.dataflow.dataflow_runner:2021-02-09T11:57:17.922Z: JOB_MESSAGE_BASIC: Finished operation Create/Impulse+Create/FlatMap(<lambda at core.py:2957>)+Create/Map(decode)+Collect start time metrics+ParDo(SequenceSideInputTestDoFn)+Collect end time metrics
INFO:apache_beam.runners.dataflow.dataflow_runner:2021-02-09T11:57:17.988Z: JOB_MESSAGE_DEBUG: Executing failure step failure20
INFO:apache_beam.runners.dataflow.dataflow_runner:2021-02-09T11:57:18.026Z: JOB_MESSAGE_ERROR: Workflow failed. Causes: S07:Create/Impulse+Create/FlatMap(<lambda at core.py:2957>)+Create/Map(decode)+Collect start time metrics+ParDo(SequenceSideInputTestDoFn)+Collect end time metrics failed., The job failed because a work item has failed 4 times. Look in previous log entries for the cause of each one of the 4 failures. For more information, see https://cloud.google.com/dataflow/docs/guides/common-errors. The work item was attempted on these ****s:
load-tests-python-dataflo-02090345-bhhj-harness-hfcz
Root cause: SDK harness sdk-0-0 disconnected.,
load-tests-python-dataflo-02090345-bhhj-harness-mtm7
Root cause: SDK harness sdk-0-0 disconnected.,
load-tests-python-dataflo-02090345-bhhj-harness-6ck3
Root cause: The **** lost contact with the service.,
load-tests-python-dataflo-02090345-bhhj-harness-46r4
Root cause: SDK harness sdk-0-0 disconnected.
INFO:apache_beam.runners.dataflow.dataflow_runner:2021-02-09T11:57:18.101Z: JOB_MESSAGE_DETAILED: Cleaning up.
INFO:apache_beam.runners.dataflow.dataflow_runner:2021-02-09T11:57:18.172Z: JOB_MESSAGE_DEBUG: Starting **** pool teardown.
INFO:apache_beam.runners.dataflow.dataflow_runner:2021-02-09T11:57:18.205Z: JOB_MESSAGE_BASIC: Stopping **** pool...
INFO:apache_beam.runners.dataflow.dataflow_runner:2021-02-09T12:00:03.296Z: JOB_MESSAGE_DETAILED: Autoscaling: Resized **** pool from 10 to 0.
INFO:apache_beam.runners.dataflow.dataflow_runner:2021-02-09T12:00:03.346Z: JOB_MESSAGE_BASIC: Worker pool stopped.
INFO:apache_beam.runners.dataflow.dataflow_runner:2021-02-09T12:00:03.382Z: JOB_MESSAGE_DEBUG: Tearing down pending resources...
INFO:apache_beam.runners.dataflow.dataflow_runner:Job 2021-02-09_03_45_00-12009095722562284333 is in state JOB_STATE_FAILED
Traceback (most recent call last):
File "/usr/lib/python3.7/runpy.py", line 193, in _run_module_as_main
"__main__", mod_spec)
File "/usr/lib/python3.7/runpy.py", line 85, in _run_code
exec(code, run_globals)
File "<https://ci-beam.apache.org/job/beam_LoadTests_Python_SideInput_Dataflow_Batch/ws/src/sdks/python/apache_beam/testing/load_tests/sideinput_test.py",> line 219, in <module>
SideInputTest().run()
File "<https://ci-beam.apache.org/job/beam_LoadTests_Python_SideInput_Dataflow_Batch/ws/src/sdks/python/apache_beam/testing/load_tests/load_test.py",> line 152, in run
self.result.wait_until_finish(duration=self.timeout_ms)
File "<https://ci-beam.apache.org/job/beam_LoadTests_Python_SideInput_Dataflow_Batch/ws/src/sdks/python/apache_beam/runners/dataflow/dataflow_runner.py",> line 1680, in wait_until_finish
self)
apache_beam.runners.dataflow.dataflow_runner.DataflowRuntimeException: Dataflow pipeline failed. State: FAILED, Error:
SDK harness sdk-0-0 disconnected.
> Task :sdks:python:apache_beam:testing:load_tests:run FAILED
FAILURE: Build failed with an exception.
* Where:
Build file '<https://ci-beam.apache.org/job/beam_LoadTests_Python_SideInput_Dataflow_Batch/ws/src/sdks/python/apache_beam/testing/load_tests/build.gradle'> line: 58
* What went wrong:
Execution failed for task ':sdks:python:apache_beam:testing:load_tests:run'.
> error occurred
* Try:
Run with --stacktrace option to get the stack trace. Run with --info or --debug option to get more log output. Run with --scan to get full insights.
* Get more help at https://help.gradle.org
Deprecated Gradle features were used in this build, making it incompatible with Gradle 7.0.
Use '--warning-mode all' to show the individual deprecation warnings.
See https://docs.gradle.org/6.8/userguide/command_line_interface.html#sec:command_line_warnings
BUILD FAILED in 15m 24s
5 actionable tasks: 2 executed, 3 up-to-date
Publishing build scan...
https://gradle.com/s/fllebzfefslgm
Build step 'Invoke Gradle script' changed build result to FAILURE
Build step 'Invoke Gradle script' marked build as failure
---------------------------------------------------------------------
To unsubscribe, e-mail: builds-unsubscribe@beam.apache.org
For additional commands, e-mail: builds-help@beam.apache.org
Jenkins build is back to normal :
beam_LoadTests_Python_SideInput_Dataflow_Batch #132
Posted by Apache Jenkins Server <je...@builds.apache.org>.
See <https://ci-beam.apache.org/job/beam_LoadTests_Python_SideInput_Dataflow_Batch/132/display/redirect?page=changes>
---------------------------------------------------------------------
To unsubscribe, e-mail: builds-unsubscribe@beam.apache.org
For additional commands, e-mail: builds-help@beam.apache.org