You are viewing a plain text version of this content. The canonical link for it is here.
Posted to dev@oozie.apache.org by Apache Jenkins Server <je...@builds.apache.org> on 2018/01/27 15:56:58 UTC

Failed: OOZIE-3171 PreCommit Build #353

Jira: https://issues.apache.org/jira/browse/OOZIE-3171
Build: https://builds.apache.org/job/PreCommit-OOZIE-Build/353/

###################################################################################
########################## LAST 100 LINES OF THE CONSOLE ###########################
[...truncated 701.20 KB...]
        ServerConnector secureServerConnector = new ServerConnector(server,
                new SslConnectionFactory(sslContextFactory, HttpVersion.HTTP_1_1.asString()),
                new HttpConnectionFactory(httpsConfiguration));

        secureServerConnector.setPort(oozieHttpsPort);

        LOG.info(String.format("Secure server connector created, listenning on port %d", oozieHttpsPort));
        return secureServerConnector;
    }

    private void setExludeCipherSuites() {
        String excludeCipherList = conf.get(OOZIE_HTTPS_EXCLUDE_CIPHER_SUITES);
        String[] excludeCipherSuites = excludeCipherList.split(",");
        sslContextFactory.setExcludeCipherSuites(excludeCipherSuites);

        LOG.info(String.format("SSL context - excluding cipher suites: %s", Arrays.toString(excludeCipherSuites)));
    }

    private void setIncludeCipherSuites() {
        String includeCipherList = conf.get(OOZIE_HTTPS_INCLUDE_CIPHER_SUITES);
        if (includeCipherList == null || includeCipherList.isEmpty()) {
            return;
        }

        String[] includeCipherSuites = includeCipherList.split(",");
        sslContextFactory.setIncludeCipherSuites(includeCipherSuites);

        LOG.info(String.format("SSL context - including cipher suites: %s", Arrays.toString(includeCipherSuites)));
    }

    private void setIncludeProtocols() {
        String enabledProtocolsList = conf.get(OOZIE_HTTPS_INCLUDE_PROTOCOLS);
        String[] enabledProtocols = enabledProtocolsList.split(",");
        sslContextFactory.setIncludeProtocols(enabledProtocols);

        LOG.info(String.format("SSL context - including protocols: %s", Arrays.toString(enabledProtocols)));
    }

    private void setExcludeProtocols() {
        String excludedProtocolsList = conf.get(OOZIE_HTTPS_EXCLUDE_PROTOCOLS);
        if (excludedProtocolsList == null || excludedProtocolsList.isEmpty()) {
            return;
        }
        String[] excludedProtocols = excludedProtocolsList.split(",");
        sslContextFactory.setExcludeProtocols(excludedProtocols);
        LOG.info(String.format("SSL context - excluding protocols: %s", Arrays.toString(excludedProtocols)));
    }

    private void setTrustStorePath() {
        String trustStorePath = conf.get(OOZIE_HTTPS_TRUSTSTORE_FILE);
        Preconditions.checkNotNull(trustStorePath, "trustStorePath is null");
        sslContextFactory.setTrustStorePath(trustStorePath);
    }

    private void setTrustStorePass() {
        String trustStorePass = ConfigurationService.getPassword(conf, OOZIE_HTTPS_TRUSTSTORE_PASS).trim();
        Preconditions.checkNotNull(trustStorePass, "setTrustStorePass is null");
        sslContextFactory.setTrustStorePassword(trustStorePass);
    }

    private void setKeystorePass() {
        String keystorePass = ConfigurationService.getPassword(conf, OOZIE_HTTPS_KEYSTORE_PASS).trim();
        Preconditions.checkNotNull(keystorePass, "keystorePass is null");
        sslContextFactory.setKeyManagerPassword(keystorePass);
    }

    private void setKeyStoreFile() {
        String keystoreFile = conf.get(OOZIE_HTTPS_KEYSTORE_FILE);
        Preconditions.checkNotNull(keystoreFile, "keystoreFile is null");
        sslContextFactory.setKeyStorePath(keystoreFile);
    }

    private HttpConfiguration getHttpsConfiguration() {
        HttpConfiguration https = new HttpConfigurationWrapper(conf).getDefaultHttpConfiguration();
        https.setSecureScheme("https");
        https.addCustomizer(new SecureRequestCustomizer());
        return https;
    }
}

error: patch failed: server/src/main/java/org/apache/oozie/server/SSLServerConnectorFactory.java:1
error: server/src/main/java/org/apache/oozie/server/SSLServerConnectorFactory.java: patch does not apply
Patch failed to apply to head of branch

Adding comment to JIRA
  % Total    % Received % Xferd  Average Speed   Time    Time     Time  Current
                                 Dload  Upload   Total   Spent    Left  Speed
  0     0    0     0    0     0      0      0 --:--:-- --:--:-- --:--:--     0  0     0    0     0    0     0      0      0 --:--:-- --:--:-- --:--:--     0100  1886    0  1687  100   199   1865    220 --:--:-- --:--:-- --:--:--  1864
{"self":"https://issues.apache.org/jira/rest/api/2/issue/13134223/comment/16342201","id":"16342201","author":{"self":"https://issues.apache.org/jira/rest/api/2/user?username=hadoopqa","name":"hadoopqa","key":"hadoopqa","emailAddress":"blackhole at hadoop dot apache dot org","avatarUrls":{"48x48":"https://issues.apache.org/jira/secure/useravatar?ownerId=hadoopqa&avatarId=10393","24x24":"https://issues.apache.org/jira/secure/useravatar?size=small&ownerId=hadoopqa&avatarId=10393","16x16":"https://issues.apache.org/jira/secure/useravatar?size=xsmall&ownerId=hadoopqa&avatarId=10393","32x32":"https://issues.apache.org/jira/secure/useravatar?size=medium&ownerId=hadoopqa&avatarId=10393"},"displayName":"Hadoop QA","active":true,"timeZone":"Etc/UTC"},"body":"\nTesting JIRA OOZIE-3171\n\nCleaning local git workspace\n\n----------------------------\n\n{color:red}-1{color} Patch failed to apply to head of branch\n\n----------------------------\n","updateAuthor":{"self":"https://issues.apache.org/jira/rest/api/2/user?username=hadoopqa","name":"hadoopqa","key":"hadoopqa","emailAddress":"blackhole at hadoop dot apache dot org","avatarUrls":{"48x48":"https://issues.apache.org/jira/secure/useravatar?ownerId=hadoopqa&avatarId=10393","24x24":"https://issues.apache.org/jira/secure/useravatar?size=small&ownerId=hadoopqa&avatarId=10393","16x16":"https://issues.apache.org/jira/secure/useravatar?size=xsmall&ownerId=hadoopqa&avatarId=10393","32x32":"https://issues.apache.org/jira/secure/useravatar?size=medium&ownerId=hadoopqa&avatarId=10393"},"displayName":"Hadoop QA","active":true,"timeZone":"Etc/UTC"},"created":"2018-01-27T15:56:54.411+0000","updated":"2018-01-27T15:56:54.411+0000"}
test-patch exit code: 1

Build step 'Execute shell' marked build as failure
[description-setter] Description set: OOZIE-3171
Archiving artifacts
[Fast Archiver] Compressed 1.08 MB of artifacts by 51.9% relative to #346
Recording test results
ERROR: Step ?Publish JUnit test result report? failed: No test report files were found. Configuration error?
Email was triggered for: Failure - Any
Sending email for trigger: Failure - Any



###################################################################################
############################## FAILED TESTS (if any) ##############################
No tests ran.

Failed: OOZIE-3172 PreCommit Build #354

Posted by Apache Jenkins Server <je...@builds.apache.org>.
Jira: https://issues.apache.org/jira/browse/OOZIE-3172
Build: https://builds.apache.org/job/PreCommit-OOZIE-Build/354/

###################################################################################
########################## LAST 100 LINES OF THE CONSOLE ###########################
[...truncated 1.59 MB...]
./sharelib/spark/target/surefire-reports/TEST-org.apache.oozie.action.hadoop.TestSparkActionExecutor.xml:92: parser error : Premature end of data in tag testcase line 88
./sharelib/spark/target/surefire-reports/TEST-org.apache.oozie.action.hadoop.TestSparkActionExecutor.xml:92: parser error : Premature end of data in tag testsuite line 2
./sharelib/spark/target/surefire-reports/TEST-org.apache.oozie.action.hadoop.TestSparkActionExecutor.xml:92: parser error : Unregistered error message
./sharelib/spark/target/surefire-reports/TEST-org.apache.oozie.action.hadoop.TestSparkActionExecutor.xml:92: parser error : Premature end of data in tag system-out line 92
./sharelib/spark/target/surefire-reports/TEST-org.apache.oozie.action.hadoop.TestSparkActionExecutor.xml:92: parser error : Premature end of data in tag testcase line 88
./sharelib/spark/target/surefire-reports/TEST-org.apache.oozie.action.hadoop.TestSparkActionExecutor.xml:92: parser error : Premature end of data in tag testsuite line 2
  Running test-patch task DISTRO


Testing JIRA OOZIE-3172

Cleaning local git workspace

----------------------------

+1 PATCH_APPLIES
+1 CLEAN
+1 RAW_PATCH_ANALYSIS
    +1 the patch does not introduce any @author tags
    +1 the patch does not introduce any tabs
    +1 the patch does not introduce any trailing spaces
    +1 the patch does not introduce any line longer than 132
    +1 the patch adds/modifies 2 testcase(s)
+1 RAT
    +1 the patch does not seem to introduce new RAT warnings
+1 JAVADOC
    +1 the patch does not seem to introduce new Javadoc warnings
    WARNING: the current HEAD has 100 Javadoc warning(s)
+1 COMPILE
    +1 HEAD compiles
    +1 patch compiles
    +1 the patch does not seem to introduce new javac warnings
+1 There are no new bugs found in total.
 +1 There are no new bugs found in [docs].
 +1 There are no new bugs found in [sharelib/distcp].
 +1 There are no new bugs found in [sharelib/hive].
 +1 There are no new bugs found in [sharelib/spark].
 +1 There are no new bugs found in [sharelib/hive2].
 +1 There are no new bugs found in [sharelib/hcatalog].
 +1 There are no new bugs found in [sharelib/streaming].
 +1 There are no new bugs found in [sharelib/pig].
 +1 There are no new bugs found in [sharelib/sqoop].
 +1 There are no new bugs found in [sharelib/oozie].
 +1 There are no new bugs found in [examples].
 +1 There are no new bugs found in [client].
 +1 There are no new bugs found in [core].
 +1 There are no new bugs found in [tools].
 +1 There are no new bugs found in [server].
+1 BACKWARDS_COMPATIBILITY
    +1 the patch does not change any JPA Entity/Colum/Basic/Lob/Transient annotations
    +1 the patch does not modify JPA files
-1 TESTS
    Tests run: 2088
    Tests failed: 6
    Tests errors: 2

    The patch failed the following testcases:

testSparkAction(org.apache.oozie.action.hadoop.TestSparkActionExecutor)
testSparkAction(org.apache.oozie.action.hadoop.TestSparkActionExecutor)
testPyspark(org.apache.oozie.action.hadoop.TestPyspark)
testPartitionDependency(org.apache.oozie.service.TestPartitionDependencyManagerService)
testCoordActionRecoveryServiceForWaitingRegisterPartition(org.apache.oozie.service.TestRecoveryService)
testConnectionDrop(org.apache.oozie.jms.TestJMSJobEventListener)
testPartitionDependency(org.apache.oozie.service.TestPartitionDependencyManagerEhcache)

    Tests failing with errors:
testMain(org.apache.oozie.action.hadoop.TestSparkMain)
testConnectionRetry(org.apache.oozie.service.TestJMSAccessorService)

    Tests failed at first run:
TestJavaActionExecutor#testCredentialsSkip
    For the complete list of flaky tests, see TEST-SUMMARY-FULL files.
+1 DISTRO
    +1 distro tarball builds with the patch 

----------------------------
-1 Overall result, please check the reported -1(s)

 There is at least one warning, please check

The full output of the test-patch run is available at

 https://builds.apache.org/job/PreCommit-OOZIE-Build/354/

Adding comment to JIRA
  % Total    % Received % Xferd  Average Speed   Time    Time     Time  Current
                                 Dload  Upload   Total   Spent    Left  Speed
  0     0    0     0    0     0      0      0 --:--:-- --:--:-- --:--:--     0{"self":"https://issues.apache.org/jira/rest/api/2/issue/13134446/comment/16343543","id":"16343543","author":{"self":"https://issues.apache.org/jira/rest/api/2/user?username=hadoopqa","name":"hadoopqa","key":"hadoopqa","emailAddress":"blackhole at hadoop dot apache dot org","avatarUrls":{"48x48":"https://issues.apache.org/jira/secure/useravatar?ownerId=hadoopqa&avatarId=10393","24x24":"https://issues.apache.org/jira/secure/useravatar?size=small&ownerId=hadoopqa&avatarId=10393","16x16":"https://issues.apache.org/jira/secure/useravatar?size=xsmall&ownerId=hadoopqa&avatarId=10393","32x32":"https://issues.apache.org/jira/secure/useravatar?size=medium&ownerId=hadoopqa&avatarId=10393"},"displayName":"Hadoop QA","active":true,"timeZone":"Etc/UTC"},"body":"\nTesting JIRA OOZIE-3172\n\nCleaning local git workspace\n\n----------------------------\n\n{color:green}+1 PATCH_APPLIES{color}\n{color:green}+1 CLEAN{color}\n{color:green}+1 RAW_PATCH_ANALYSIS{color}\n.    {color:green}+1{color} the patch does not introduce any @author tags\n.    {color:green}+1{color} the patch does not introduce any tabs\n.    {color:green}+1{color} the patch does not introduce any trailing spaces\n.    {color:green}+1{color} the patch does not introduce any line longer than 132\n.    {color:green}+1{color} the patch adds/modifies 2 testcase(s)\n{color:green}+1 RAT{color}\n.    {color:green}+1{color} the patch does not seem to introduce new RAT warnings\n{color:green}+1 JAVADOC{color}\n.    {color:green}+1{color} the patch does not seem to introduce new Javadoc warnings\n.    {color:red}WARNING{color}: the current HEAD has 100 Javadoc warning(s)\n{color:green}+1 COMPILE{color}\n.    {color:green}+1{color} HEAD compiles\n.    {color:green}+1{color} patch compiles\n.    {color:green}+1{color} the patch does not seem to introduce new javac warnings\n{color:green}+1{color} There are no new bugs found in total.\n. {color:green}+1{color} There are no new bugs found in [docs].\n. {color:green}+1{color} There are no new bugs found in [sharelib/distcp].\n. {color:green}+1{color} There are no new bugs found in [sharelib/hive].\n. {color:green}+1{color} There are no new bugs found in [sharelib/spark].\n. {color:green}+1{color} There are no new bugs found in [sharelib/hive2].\n. {color:green}+1{color} There are no new bugs found in [sharelib/hcatalog].\n. {color:green}+1{color} There are no new bugs found in [sharelib/streaming].\n. {color:green}+1{color} There are no new bugs found in [sharelib/pig].\n. {color:green}+1{color} There are no new bugs found in [sharelib/sqoop].\n. {color:green}+1{color} There are no new bugs found in [sharelib/oozie].\n. {color:green}+1{color} There are no new bugs found in [examples].\n. {color:green}+1{color} There are no new bugs found in [client].\n. {color:green}+1{color} There are no new bugs found in [core].\n. {color:green}+1{color} There are no new bugs found in [tools].\n. {color:green}+1{color} There are no new bugs found in [server].\n{color:green}+1 BACKWARDS_COMPATIBILITY{color}\n.    {color:green}+1{color} the patch does not change any JPA Entity/Colum/Basic/Lob/Transient annotations\n.    {color:green}+1{color} the patch does not modify JPA files\n{color:red}-1 TESTS{color}\n.    Tests run: 2088\n.    Tests failed: 6\n.    Tests errors: 2\n\n.    The patch failed the following testcases:\n\ntestSparkAction(org.apache.oozie.action.hadoop.TestSparkActionExecutor)\ntestSparkAction(org.apache.oozie.action.hadoop.TestSparkActionExecutor)\ntestPyspark(org.apache.oozie.action.hadoop.TestPyspark)\ntestPartitionDependency(org.apache.oozie.service.TestPartitionDependencyManagerService)\ntestCoordActionRecoveryServiceForWaitingRegisterPartition(org.apache.oozie.service.TestRecoveryService)\ntestConnectionDrop(org.apache.oozie.jms.TestJMSJobEventListener)\ntestPartitionDependency(org.apache.oozie.service.TestPartitionDependencyManagerEhcache)\n\n.    Tests failing with errors:\ntestMain(org.apache.oozie.action.hadoop.TestSparkMain)\ntestConnectionRetry(org.apache.oozie.service.TestJMSAccessorService)\n\n.    {color:orange}Tests fail100  9250    0  5369  100  3881   6313   4563 --:--:-- --:--:-- --:--:--  6316
ed at first run:{color}\nTestJavaActionExecutor#testCredentialsSkip\n.    For the complete list of flaky tests, see TEST-SUMMARY-FULL files.\n{color:green}+1 DISTRO{color}\n.    {color:green}+1{color} distro tarball builds with the patch \n\n----------------------------\n{color:red}*-1 Overall result, please check the reported -1(s)*{color}\n\n{color:red}. There is at least one warning, please check{color}\n\nThe full output of the test-patch run is available at\n\n. https://builds.apache.org/job/PreCommit-OOZIE-Build/354/\n\n","updateAuthor":{"self":"https://issues.apache.org/jira/rest/api/2/user?username=hadoopqa","name":"hadoopqa","key":"hadoopqa","emailAddress":"blackhole at hadoop dot apache dot org","avatarUrls":{"48x48":"https://issues.apache.org/jira/secure/useravatar?ownerId=hadoopqa&avatarId=10393","24x24":"https://issues.apache.org/jira/secure/useravatar?size=small&ownerId=hadoopqa&avatarId=10393","16x16":"https://issues.apache.org/jira/secure/useravatar?size=xsmall&ownerId=hadoopqa&avatarId=10393","32x32":"https://issues.apache.org/jira/secure/useravatar?size=medium&ownerId=hadoopqa&avatarId=10393"},"displayName":"Hadoop QA","active":true,"timeZone":"Etc/UTC"},"created":"2018-01-29T16:03:04.836+0000","updated":"2018-01-29T16:03:04.836+0000"}
test-patch exit code: 1

Build step 'Execute shell' marked build as failure
[description-setter] Description set: OOZIE-3172
Archiving artifacts
[Fast Archiver] Compressed 2.29 MB of artifacts by 47.8% relative to #346
Recording test results
Email was triggered for: Failure - Any
Sending email for trigger: Failure - Any



###################################################################################
############################## FAILED TESTS (if any) ##############################
9 tests failed.
FAILED:  org.apache.oozie.jms.TestJMSJobEventListener.testConnectionDrop

Error Message:
org.apache.activemq:type=Broker,brokerName=localhost

Stack Trace:
junit.framework.AssertionFailedError: org.apache.activemq:type=Broker,brokerName=localhost
	at org.apache.oozie.jms.TestJMSJobEventListener.testConnectionDrop(TestJMSJobEventListener.java:365)


FAILED:  org.apache.oozie.service.TestJMSAccessorService.testConnectionRetry

Error Message:
null

Stack Trace:
junit.framework.AssertionFailedError
	at org.apache.oozie.service.TestJMSAccessorService.testConnectionRetry(TestJMSAccessorService.java:183)


FAILED:  org.apache.oozie.service.TestPartitionDependencyManagerEhcache.testPartitionDependency

Error Message:
null

Stack Trace:
junit.framework.AssertionFailedError
	at org.apache.oozie.service.TestPartitionDependencyManagerEhcache.testPartitionDependency(TestPartitionDependencyManagerEhcache.java:47)


FAILED:  org.apache.oozie.service.TestPartitionDependencyManagerService.testPartitionDependency

Error Message:
null

Stack Trace:
junit.framework.AssertionFailedError
	at org.apache.oozie.service.TestPartitionDependencyManagerService.testPartitionDependency(TestPartitionDependencyManagerService.java:95)


FAILED:  org.apache.oozie.service.TestRecoveryService.testCoordActionRecoveryServiceForWaitingRegisterPartition

Error Message:
null

Stack Trace:
junit.framework.AssertionFailedError
	at org.apache.oozie.service.TestRecoveryService.testCoordActionRecoveryServiceForWaitingRegisterPartition(TestRecoveryService.java:505)


FAILED:  org.apache.oozie.action.hadoop.TestPyspark.testPyspark

Error Message:
expected:<[SUCCEED]ED> but was:<[FAILED/KILL]ED>

Stack Trace:
junit.framework.ComparisonFailure: expected:<[SUCCEED]ED> but was:<[FAILED/KILL]ED>
	at org.apache.oozie.action.hadoop.TestPyspark.testPysparkHelper(TestPyspark.java:113)
	at org.apache.oozie.action.hadoop.TestPyspark.testPyspark(TestPyspark.java:91)


FAILED:  TEST-org.apache.oozie.action.hadoop.TestSparkActionExecutor.xml.[failed-to-read]

Error Message:


Stack Trace:
Failed to read test report file /home/jenkins/jenkins-slave/workspace/PreCommit-OOZIE-Build/sharelib/spark/target/surefire-reports/TEST-org.apache.oozie.action.hadoop.TestSparkActionExecutor.xml
org.dom4j.DocumentException: Error on line 92 of document  : XML document structures must start and end within the same entity. Nested exception: XML document structures must start and end within the same entity.
	at org.dom4j.io.SAXReader.read(SAXReader.java:482)
	at org.dom4j.io.SAXReader.read(SAXReader.java:343)
	at hudson.tasks.junit.SuiteResult.parse(SuiteResult.java:169)
	at hudson.tasks.junit.TestResult.parse(TestResult.java:348)
	at hudson.tasks.junit.TestResult.parsePossiblyEmpty(TestResult.java:281)
	at hudson.tasks.junit.TestResult.parse(TestResult.java:206)
	at hudson.tasks.junit.TestResult.parse(TestResult.java:178)
	at hudson.tasks.junit.TestResult.<init>(TestResult.java:143)
	at hudson.tasks.junit.JUnitParser$ParseResultCallable.invoke(JUnitParser.java:146)
	at hudson.tasks.junit.JUnitParser$ParseResultCallable.invoke(JUnitParser.java:118)
	at hudson.FilePath$FileCallableWrapper.call(FilePath.java:2760)
	at hudson.remoting.UserRequest.perform(UserRequest.java:207)
	at hudson.remoting.UserRequest.perform(UserRequest.java:53)
	at hudson.remoting.Request$2.run(Request.java:358)
	at hudson.remoting.InterceptingExecutorService$1.call(InterceptingExecutorService.java:72)
	at java.util.concurrent.FutureTask.run(FutureTask.java:266)
	at java.util.concurrent.ThreadPoolExecutor.runWorker(ThreadPoolExecutor.java:1142)
	at java.util.concurrent.ThreadPoolExecutor$Worker.run(ThreadPoolExecutor.java:617)
	at java.lang.Thread.run(Thread.java:748)
Caused by: org.xml.sax.SAXParseException; lineNumber: 92; columnNumber: 26; XML document structures must start and end within the same entity.
	at com.sun.org.apache.xerces.internal.util.ErrorHandlerWrapper.createSAXParseException(ErrorHandlerWrapper.java:203)
	at com.sun.org.apache.xerces.internal.util.ErrorHandlerWrapper.fatalError(ErrorHandlerWrapper.java:177)
	at com.sun.org.apache.xerces.internal.impl.XMLErrorReporter.reportError(XMLErrorReporter.java:400)
	at com.sun.org.apache.xerces.internal.impl.XMLErrorReporter.reportError(XMLErrorReporter.java:327)
	at com.sun.org.apache.xerces.internal.impl.XMLScanner.reportFatalError(XMLScanner.java:1472)
	at com.sun.org.apache.xerces.internal.impl.XMLDocumentFragmentScannerImpl.endEntity(XMLDocumentFragmentScannerImpl.java:899)
	at com.sun.org.apache.xerces.internal.impl.XMLDocumentScannerImpl.endEntity(XMLDocumentScannerImpl.java:559)
	at com.sun.org.apache.xerces.internal.impl.XMLEntityManager.endEntity(XMLEntityManager.java:1398)
	at com.sun.org.apache.xerces.internal.impl.XMLEntityScanner.load(XMLEntityScanner.java:1916)
	at com.sun.org.apache.xerces.internal.impl.XMLEntityScanner.scanData(XMLEntityScanner.java:1375)
	at com.sun.org.apache.xerces.internal.impl.XMLDocumentFragmentScannerImpl.scanCDATASection(XMLDocumentFragmentScannerImpl.java:1654)
	at com.sun.org.apache.xerces.internal.impl.XMLDocumentFragmentScannerImpl$FragmentContentDriver.next(XMLDocumentFragmentScannerImpl.java:3014)
	at com.sun.org.apache.xerces.internal.impl.XMLDocumentScannerImpl.next(XMLDocumentScannerImpl.java:602)
	at com.sun.org.apache.xerces.internal.impl.XMLNSDocumentScannerImpl.next(XMLNSDocumentScannerImpl.java:112)
	at com.sun.org.apache.xerces.internal.impl.XMLDocumentFragmentScannerImpl.scanDocument(XMLDocumentFragmentScannerImpl.java:505)
	at com.sun.org.apache.xerces.internal.parsers.XML11Configuration.parse(XML11Configuration.java:841)
	at com.sun.org.apache.xerces.internal.parsers.XML11Configuration.parse(XML11Configuration.java:770)
	at com.sun.org.apache.xerces.internal.parsers.XMLParser.parse(XMLParser.java:141)
	at com.sun.org.apache.xerces.internal.parsers.AbstractSAXParser.parse(AbstractSAXParser.java:1213)
	at com.sun.org.apache.xerces.internal.jaxp.SAXParserImpl$JAXPSAXParser.parse(SAXParserImpl.java:643)
	at org.dom4j.io.SAXReader.read(SAXReader.java:465)
	... 18 more
Nested exception: 
org.xml.sax.SAXParseException; lineNumber: 92; columnNumber: 26; XML document structures must start and end within the same entity.
	at com.sun.org.apache.xerces.internal.util.ErrorHandlerWrapper.createSAXParseException(ErrorHandlerWrapper.java:203)
	at com.sun.org.apache.xerces.internal.util.ErrorHandlerWrapper.fatalError(ErrorHandlerWrapper.java:177)
	at com.sun.org.apache.xerces.internal.impl.XMLErrorReporter.reportError(XMLErrorReporter.java:400)
	at com.sun.org.apache.xerces.internal.impl.XMLErrorReporter.reportError(XMLErrorReporter.java:327)
	at com.sun.org.apache.xerces.internal.impl.XMLScanner.reportFatalError(XMLScanner.java:1472)
	at com.sun.org.apache.xerces.internal.impl.XMLDocumentFragmentScannerImpl.endEntity(XMLDocumentFragmentScannerImpl.java:899)
	at com.sun.org.apache.xerces.internal.impl.XMLDocumentScannerImpl.endEntity(XMLDocumentScannerImpl.java:559)
	at com.sun.org.apache.xerces.internal.impl.XMLEntityManager.endEntity(XMLEntityManager.java:1398)
	at com.sun.org.apache.xerces.internal.impl.XMLEntityScanner.load(XMLEntityScanner.java:1916)
	at com.sun.org.apache.xerces.internal.impl.XMLEntityScanner.scanData(XMLEntityScanner.java:1375)
	at com.sun.org.apache.xerces.internal.impl.XMLDocumentFragmentScannerImpl.scanCDATASection(XMLDocumentFragmentScannerImpl.java:1654)
	at com.sun.org.apache.xerces.internal.impl.XMLDocumentFragmentScannerImpl$FragmentContentDriver.next(XMLDocumentFragmentScannerImpl.java:3014)
	at com.sun.org.apache.xerces.internal.impl.XMLDocumentScannerImpl.next(XMLDocumentScannerImpl.java:602)
	at com.sun.org.apache.xerces.internal.impl.XMLNSDocumentScannerImpl.next(XMLNSDocumentScannerImpl.java:112)
	at com.sun.org.apache.xerces.internal.impl.XMLDocumentFragmentScannerImpl.scanDocument(XMLDocumentFragmentScannerImpl.java:505)
	at com.sun.org.apache.xerces.internal.parsers.XML11Configuration.parse(XML11Configuration.java:841)
	at com.sun.org.apache.xerces.internal.parsers.XML11Configuration.parse(XML11Configuration.java:770)
	at com.sun.org.apache.xerces.internal.parsers.XMLParser.parse(XMLParser.java:141)
	at com.sun.org.apache.xerces.internal.parsers.AbstractSAXParser.parse(AbstractSAXParser.java:1213)
	at com.sun.org.apache.xerces.internal.jaxp.SAXParserImpl$JAXPSAXParser.parse(SAXParserImpl.java:643)
	at org.dom4j.io.SAXReader.read(SAXReader.java:465)
	at org.dom4j.io.SAXReader.read(SAXReader.java:343)
	at hudson.tasks.junit.SuiteResult.parse(SuiteResult.java:169)
	at hudson.tasks.junit.TestResult.parse(TestResult.java:348)
	at hudson.tasks.junit.TestResult.parsePossiblyEmpty(TestResult.java:281)
	at hudson.tasks.junit.TestResult.parse(TestResult.java:206)
	at hudson.tasks.junit.TestResult.parse(TestResult.java:178)
	at hudson.tasks.junit.TestResult.<init>(TestResult.java:143)
	at hudson.tasks.junit.JUnitParser$ParseResultCallable.invoke(JUnitParser.java:146)
	at hudson.tasks.junit.JUnitParser$ParseResultCallable.invoke(JUnitParser.java:118)
	at hudson.FilePath$FileCallableWrapper.call(FilePath.java:2760)
	at hudson.remoting.UserRequest.perform(UserRequest.java:207)
	at hudson.remoting.UserRequest.perform(UserRequest.java:53)
	at hudson.remoting.Request$2.run(Request.java:358)
	at hudson.remoting.InterceptingExecutorService$1.call(InterceptingExecutorService.java:72)
	at java.util.concurrent.FutureTask.run(FutureTask.java:266)
	at java.util.concurrent.ThreadPoolExecutor.runWorker(ThreadPoolExecutor.java:1142)
	at java.util.concurrent.ThreadPoolExecutor$Worker.run(ThreadPoolExecutor.java:617)
	at java.lang.Thread.run(Thread.java:748)


FAILED:  org.apache.oozie.action.hadoop.TestSparkMain.testMain

Error Message:
class com.fasterxml.jackson.module.scala.ser.ScalaIteratorSerializer overrides final method withResolved.(Lcom/fasterxml/jackson/databind/BeanProperty;Lcom/fasterxml/jackson/databind/jsontype/TypeSerializer;Lcom/fasterxml/jackson/databind/JsonSerializer;)Lcom/fasterxml/jackson/databind/ser/std/AsArraySerializerBase;

Stack Trace:
java.lang.VerifyError: class com.fasterxml.jackson.module.scala.ser.ScalaIteratorSerializer overrides final method withResolved.(Lcom/fasterxml/jackson/databind/BeanProperty;Lcom/fasterxml/jackson/databind/jsontype/TypeSerializer;Lcom/fasterxml/jackson/databind/JsonSerializer;)Lcom/fasterxml/jackson/databind/ser/std/AsArraySerializerBase;
	at org.apache.oozie.action.hadoop.TestSparkMain.call(TestSparkMain.java:97)
	at org.apache.oozie.action.hadoop.TestSparkMain.call(TestSparkMain.java:42)


FAILED:  org.apache.oozie.action.hadoop.TestSparkActionExecutor.testSparkAction

Error Message:
expected:<[SUCCEED]ED> but was:<[FAILED/KILL]ED>

Stack Trace:
junit.framework.ComparisonFailure: expected:<[SUCCEED]ED> but was:<[FAILED/KILL]ED>
	at org.apache.oozie.action.hadoop.TestSparkActionExecutor.testSparkAction(TestSparkActionExecutor.java:191)