You are viewing a plain text version of this content. The canonical link for it is here.
Posted to dev@zookeeper.apache.org by Apache Jenkins Server <je...@builds.apache.org> on 2011/10/24 19:20:41 UTC
Failed: ZOOKEEPER-1198 PreCommit Build #649
Jira: https://issues.apache.org/jira/browse/ZOOKEEPER-1198
Build: https://builds.apache.org/job/PreCommit-ZOOKEEPER-Build/649/
###################################################################################
########################## LAST 60 LINES OF THE CONSOLE ###########################
[...truncated 140572 lines...]
[exec]
[exec]
[exec]
[exec] -1 overall. Here are the results of testing the latest attachment
[exec] http://issues.apache.org/jira/secure/attachment/12500492/ZOOKEEPER-1198.patch
[exec] against trunk revision 1188039.
[exec]
[exec] +1 @author. The patch does not contain any @author tags.
[exec]
[exec] +1 tests included. The patch appears to include 119 new or modified tests.
[exec]
[exec] +1 javadoc. The javadoc tool did not generate any warning messages.
[exec]
[exec] -1 javac. The patch appears to cause tar ant target to fail.
[exec]
[exec] -1 findbugs. The patch appears to introduce 1 new Findbugs (version 1.3.9) warnings.
[exec]
[exec] +1 release audit. The applied patch does not increase the total number of release audit warnings.
[exec]
[exec] -1 core tests. The patch failed core unit tests.
[exec]
[exec] +1 contrib tests. The patch passed contrib unit tests.
[exec]
[exec] Test results: https://builds.apache.org/job/PreCommit-ZOOKEEPER-Build/649//testReport/
[exec] Findbugs warnings: https://builds.apache.org/job/PreCommit-ZOOKEEPER-Build/649//artifact/trunk/build/test/findbugs/newPatchFindbugsWarnings.html
[exec] Console output: https://builds.apache.org/job/PreCommit-ZOOKEEPER-Build/649//console
[exec]
[exec] This message is automatically generated.
[exec]
[exec]
[exec] ======================================================================
[exec] ======================================================================
[exec] Adding comment to Jira.
[exec] ======================================================================
[exec] ======================================================================
[exec]
[exec]
[exec] Comment added.
[exec] OlfKYfIz76 logged out
[exec]
[exec]
[exec] ======================================================================
[exec] ======================================================================
[exec] Finished build.
[exec] ======================================================================
[exec] ======================================================================
[exec]
[exec]
BUILD FAILED
/home/jenkins/jenkins-slave/workspace/PreCommit-ZOOKEEPER-Build/trunk/build.xml:1576: exec returned: 3
Total time: 19 minutes 21 seconds
Build step 'Execute shell' marked build as failure
Archiving artifacts
Recording test results
Description set: ZOOKEEPER-1198
Email was triggered for: Failure
Sending email for trigger: Failure
###################################################################################
############################## FAILED TESTS (if any) ##############################
2 tests failed.
REGRESSION: org.apache.zookeeper.test.ObserverTest.testObserver
Error Message:
KeeperErrorCode = ConnectionLoss for /obstest
Stack Trace:
org.apache.zookeeper.KeeperException$ConnectionLossException: KeeperErrorCode = ConnectionLoss for /obstest
at org.apache.zookeeper.KeeperException.create(KeeperException.java:101)
at org.apache.zookeeper.KeeperException.create(KeeperException.java:53)
at org.apache.zookeeper.ZooKeeper.setData(ZooKeeper.java:1229)
at org.apache.zookeeper.test.ObserverTest.testObserver(ObserverTest.java:109)
at org.apache.zookeeper.JUnit4ZKTestRunner$LoggedInvokeMethod.evaluate(JUnit4ZKTestRunner.java:52)
REGRESSION: org.apache.zookeeper.test.QuorumTest.testSessionMoved
Error Message:
null
Stack Trace:
junit.framework.AssertionFailedError
at org.apache.zookeeper.test.QuorumTest.testSessionMoved(QuorumTest.java:224)
at org.apache.zookeeper.JUnit4ZKTestRunner$LoggedInvokeMethod.evaluate(JUnit4ZKTestRunner.java:52)
Success: ZOOKEEPER-1200 PreCommit Build #650
Posted by Apache Jenkins Server <je...@builds.apache.org>.
Jira: https://issues.apache.org/jira/browse/ZOOKEEPER-1200
Build: https://builds.apache.org/job/PreCommit-ZOOKEEPER-Build/650/
###################################################################################
########################## LAST 60 LINES OF THE CONSOLE ###########################
[...truncated 141317 lines...]
[exec] BUILD SUCCESSFUL
[exec] Total time: 0 seconds
[exec]
[exec]
[exec]
[exec]
[exec] +1 overall. Here are the results of testing the latest attachment
[exec] http://issues.apache.org/jira/secure/attachment/12500494/ZOOKEEPER-1200.patch
[exec] against trunk revision 1188039.
[exec]
[exec] +1 @author. The patch does not contain any @author tags.
[exec]
[exec] +1 tests included. The patch appears to include 6 new or modified tests.
[exec]
[exec] +1 javadoc. The javadoc tool did not generate any warning messages.
[exec]
[exec] +1 javac. The applied patch does not increase the total number of javac compiler warnings.
[exec]
[exec] +1 findbugs. The patch does not introduce any new Findbugs (version 1.3.9) warnings.
[exec]
[exec] +1 release audit. The applied patch does not increase the total number of release audit warnings.
[exec]
[exec] +1 core tests. The patch passed core unit tests.
[exec]
[exec] +1 contrib tests. The patch passed contrib unit tests.
[exec]
[exec] Test results: https://builds.apache.org/job/PreCommit-ZOOKEEPER-Build/650//testReport/
[exec] Findbugs warnings: https://builds.apache.org/job/PreCommit-ZOOKEEPER-Build/650//artifact/trunk/build/test/findbugs/newPatchFindbugsWarnings.html
[exec] Console output: https://builds.apache.org/job/PreCommit-ZOOKEEPER-Build/650//console
[exec]
[exec] This message is automatically generated.
[exec]
[exec]
[exec] ======================================================================
[exec] ======================================================================
[exec] Adding comment to Jira.
[exec] ======================================================================
[exec] ======================================================================
[exec]
[exec]
[exec] Comment added.
[exec] UMM0rHJ26K logged out
[exec]
[exec]
[exec] ======================================================================
[exec] ======================================================================
[exec] Finished build.
[exec] ======================================================================
[exec] ======================================================================
[exec]
[exec]
BUILD SUCCESSFUL
Total time: 22 minutes 36 seconds
Archiving artifacts
Recording test results
Description set: ZOOKEEPER-1200
Email was triggered for: Success
Sending email for trigger: Success
###################################################################################
############################## FAILED TESTS (if any) ##############################
All tests passed