You are viewing a plain text version of this content. The canonical link for it is here.
Posted to builds@hbase.apache.org by Apache Jenkins Server <je...@builds.apache.org> on 2015/05/05 03:56:32 UTC

Build failed in Jenkins: HBase-TRUNK #6454

See <https://builds.apache.org/job/HBase-TRUNK/6454/changes>

Changes:

[stack] HBASE-13464 Remove deprecations for 2.0.0 - Part 1 (Lars Francke)

------------------------------------------
[...truncated 4775 lines...]
Running org.apache.hadoop.hbase.snapshot.TestFlushSnapshotFromClient
Tests run: 11, Failures: 0, Errors: 0, Skipped: 0, Time elapsed: 82.19 sec - in org.apache.hadoop.hbase.TestHBaseTestingUtility
Running org.apache.hadoop.hbase.snapshot.TestExportSnapshot
Tests run: 9, Failures: 0, Errors: 0, Skipped: 0, Time elapsed: 135.459 sec - in org.apache.hadoop.hbase.snapshot.TestFlushSnapshotFromClient
Running org.apache.hadoop.hbase.snapshot.TestSnapshotClientRetries
Tests run: 2, Failures: 0, Errors: 0, Skipped: 0, Time elapsed: 35.95 sec - in org.apache.hadoop.hbase.snapshot.TestSnapshotClientRetries
Running org.apache.hadoop.hbase.snapshot.TestRestoreFlushSnapshotFromClient
Tests run: 12, Failures: 0, Errors: 0, Skipped: 0, Time elapsed: 320.566 sec - in org.apache.hadoop.hbase.TestZooKeeper
Running org.apache.hadoop.hbase.TestInfoServers
Tests run: 3, Failures: 0, Errors: 0, Skipped: 0, Time elapsed: 6.326 sec - in org.apache.hadoop.hbase.TestInfoServers
Tests run: 5, Failures: 0, Errors: 0, Skipped: 0, Time elapsed: 115.665 sec - in org.apache.hadoop.hbase.snapshot.TestRestoreFlushSnapshotFromClient
Running org.apache.hadoop.hbase.quotas.TestQuotaAdmin
Tests run: 56, Failures: 0, Errors: 0, Skipped: 0, Time elapsed: 528.869 sec - in org.apache.hadoop.hbase.security.access.TestAccessController
Tests run: 2, Failures: 0, Errors: 0, Skipped: 0, Time elapsed: 6.788 sec - in org.apache.hadoop.hbase.quotas.TestQuotaAdmin
Running org.apache.hadoop.hbase.quotas.TestQuotaThrottle
Running org.apache.hadoop.hbase.procedure.TestZKProcedureControllers
Tests run: 4, Failures: 0, Errors: 0, Skipped: 0, Time elapsed: 8.352 sec - in org.apache.hadoop.hbase.procedure.TestZKProcedureControllers
Running org.apache.hadoop.hbase.procedure.TestZKProcedure
Tests run: 4, Failures: 0, Errors: 0, Skipped: 0, Time elapsed: 5.573 sec - in org.apache.hadoop.hbase.procedure.TestZKProcedure
Running org.apache.hadoop.hbase.quotas.TestQuotaTableUtil
Tests run: 3, Failures: 0, Errors: 0, Skipped: 0, Time elapsed: 3.112 sec - in org.apache.hadoop.hbase.quotas.TestQuotaTableUtil
Tests run: 7, Failures: 0, Errors: 0, Skipped: 0, Time elapsed: 24.16 sec - in org.apache.hadoop.hbase.quotas.TestQuotaThrottle
Running org.apache.hadoop.hbase.io.hfile.TestForceCacheImportantBlocks
Running org.apache.hadoop.hbase.io.hfile.TestHFileBlock
Running org.apache.hadoop.hbase.io.hfile.TestCacheOnWrite
Tests run: 2, Failures: 0, Errors: 0, Skipped: 0, Time elapsed: 92.297 sec - in org.apache.hadoop.hbase.io.hfile.TestForceCacheImportantBlocks
Running org.apache.hadoop.hbase.io.hfile.TestHFileBlockIndex
Tests run: 28, Failures: 0, Errors: 0, Skipped: 0, Time elapsed: 111.984 sec - in org.apache.hadoop.hbase.io.hfile.TestHFileBlock
Tests run: 10, Failures: 0, Errors: 0, Skipped: 0, Time elapsed: 19.065 sec - in org.apache.hadoop.hbase.io.hfile.TestHFileBlockIndex
Tests run: 9, Failures: 0, Errors: 0, Skipped: 0, Time elapsed: 515.392 sec - in org.apache.hadoop.hbase.snapshot.TestSecureExportSnapshot
Running org.apache.hadoop.hbase.io.hfile.TestHFileSeek
Tests run: 1, Failures: 0, Errors: 0, Skipped: 0, Time elapsed: 5.771 sec - in org.apache.hadoop.hbase.io.hfile.TestHFileSeek
Running org.apache.hadoop.hbase.io.hfile.TestCacheConfig
Running org.apache.hadoop.hbase.io.hfile.TestScannerSelectionUsingTTL
Tests run: 6, Failures: 0, Errors: 0, Skipped: 0, Time elapsed: 4.122 sec - in org.apache.hadoop.hbase.io.hfile.TestCacheConfig
Running org.apache.hadoop.hbase.io.encoding.TestDataBlockEncoders
Running org.apache.hadoop.hbase.io.encoding.TestEncodedSeekers
Tests run: 9, Failures: 0, Errors: 0, Skipped: 0, Time elapsed: 521.301 sec - in org.apache.hadoop.hbase.snapshot.TestExportSnapshot
Running org.apache.hadoop.hbase.io.encoding.TestBufferedDataBlockEncoder
Tests run: 6, Failures: 0, Errors: 0, Skipped: 0, Time elapsed: 66.935 sec - in org.apache.hadoop.hbase.io.hfile.TestScannerSelectionUsingTTL
Running org.apache.hadoop.hbase.io.encoding.TestChangingEncoding
Tests run: 1, Failures: 0, Errors: 0, Skipped: 0, Time elapsed: 48.157 sec - in org.apache.hadoop.hbase.io.encoding.TestBufferedDataBlockEncoder
Running org.apache.hadoop.hbase.io.encoding.TestLoadAndSwitchEncodeOnDisk
Tests run: 1, Failures: 0, Errors: 0, Skipped: 0, Time elapsed: 63.288 sec - in org.apache.hadoop.hbase.io.encoding.TestLoadAndSwitchEncodeOnDisk
Running org.apache.hadoop.hbase.io.TestFileLink
Tests run: 5, Failures: 0, Errors: 0, Skipped: 0, Time elapsed: 47.858 sec - in org.apache.hadoop.hbase.io.TestFileLink
Running org.apache.hadoop.hbase.wal.TestWALFactory
Tests run: 9, Failures: 0, Errors: 0, Skipped: 0, Time elapsed: 20.049 sec - in org.apache.hadoop.hbase.wal.TestWALFactory
Running org.apache.hadoop.hbase.wal.TestWALFiltering
Tests run: 3, Failures: 0, Errors: 0, Skipped: 0, Time elapsed: 236.201 sec - in org.apache.hadoop.hbase.io.encoding.TestChangingEncoding
Running org.apache.hadoop.hbase.wal.TestWALReaderOnSecureWAL
Tests run: 1, Failures: 0, Errors: 0, Skipped: 0, Time elapsed: 53.747 sec - in org.apache.hadoop.hbase.wal.TestWALFiltering
Tests run: 2, Failures: 0, Errors: 0, Skipped: 0, Time elapsed: 6.16 sec - in org.apache.hadoop.hbase.wal.TestWALReaderOnSecureWAL
Tests run: 20, Failures: 0, Errors: 0, Skipped: 0, Time elapsed: 330.838 sec - in org.apache.hadoop.hbase.io.encoding.TestEncodedSeekers
Running org.apache.hadoop.hbase.wal.TestSecureWAL
Running org.apache.hadoop.hbase.wal.TestDefaultWALProvider
Tests run: 1, Failures: 0, Errors: 0, Skipped: 0, Time elapsed: 4.904 sec - in org.apache.hadoop.hbase.wal.TestSecureWAL
Running org.apache.hadoop.hbase.wal.TestWALSplit
Tests run: 5, Failures: 0, Errors: 0, Skipped: 0, Time elapsed: 17.709 sec - in org.apache.hadoop.hbase.wal.TestDefaultWALProvider
Running org.apache.hadoop.hbase.wal.TestDefaultWALProviderWithHLogKey
Running org.apache.hadoop.hbase.wal.TestBoundedRegionGroupingProvider
Tests run: 5, Failures: 0, Errors: 0, Skipped: 0, Time elapsed: 14.824 sec - in org.apache.hadoop.hbase.wal.TestDefaultWALProviderWithHLogKey
Running org.apache.hadoop.hbase.wal.TestWALSplitCompressed
Tests run: 5, Failures: 0, Errors: 0, Skipped: 0, Time elapsed: 30.772 sec - in org.apache.hadoop.hbase.wal.TestBoundedRegionGroupingProvider
Running org.apache.hadoop.hbase.zookeeper.TestZooKeeperACL
Tests run: 6, Failures: 0, Errors: 0, Skipped: 0, Time elapsed: 0.34 sec - in org.apache.hadoop.hbase.zookeeper.TestZooKeeperACL
Running org.apache.hadoop.hbase.zookeeper.TestZKLeaderManager
Tests run: 1, Failures: 0, Errors: 0, Skipped: 0, Time elapsed: 0.226 sec - in org.apache.hadoop.hbase.zookeeper.TestZKLeaderManager
Running org.apache.hadoop.hbase.zookeeper.TestZooKeeperNodeTracker
Tests run: 3, Failures: 0, Errors: 0, Skipped: 0, Time elapsed: 1.88 sec - in org.apache.hadoop.hbase.zookeeper.TestZooKeeperNodeTracker
Running org.apache.hadoop.hbase.zookeeper.TestRecoverableZooKeeper
Tests run: 1, Failures: 0, Errors: 0, Skipped: 0, Time elapsed: 1.375 sec - in org.apache.hadoop.hbase.zookeeper.TestRecoverableZooKeeper
Running org.apache.hadoop.hbase.zookeeper.TestZKMulti
Tests run: 8, Failures: 0, Errors: 0, Skipped: 0, Time elapsed: 1.248 sec - in org.apache.hadoop.hbase.zookeeper.TestZKMulti
Running org.apache.hadoop.hbase.zookeeper.lock.TestZKInterProcessReadWriteLock
Tests run: 6, Failures: 0, Errors: 0, Skipped: 0, Time elapsed: 25.254 sec - in org.apache.hadoop.hbase.zookeeper.lock.TestZKInterProcessReadWriteLock
Running org.apache.hadoop.hbase.zookeeper.TestHQuorumPeer
Tests run: 4, Failures: 0, Errors: 0, Skipped: 0, Time elapsed: 1.737 sec - in org.apache.hadoop.hbase.zookeeper.TestHQuorumPeer
Running org.apache.hadoop.hbase.TestIOFencing
Tests run: 28, Failures: 0, Errors: 0, Skipped: 0, Time elapsed: 508.015 sec - in org.apache.hadoop.hbase.io.encoding.TestDataBlockEncoders
Running org.apache.hadoop.hbase.constraint.TestConstraint
Tests run: 31, Failures: 0, Errors: 0, Skipped: 0, Time elapsed: 211.429 sec - in org.apache.hadoop.hbase.wal.TestWALSplit
Tests run: 5, Failures: 0, Errors: 0, Skipped: 0, Time elapsed: 33.562 sec - in org.apache.hadoop.hbase.constraint.TestConstraint
Running org.apache.hadoop.hbase.TestMovedRegionsCleaner
Running org.apache.hadoop.hbase.backup.TestHFileArchiving
Tests run: 1, Failures: 0, Errors: 0, Skipped: 0, Time elapsed: 17.084 sec - in org.apache.hadoop.hbase.TestMovedRegionsCleaner
Running org.apache.hadoop.hbase.backup.example.TestZooKeeperTableArchiveClient
Tests run: 3, Failures: 0, Errors: 0, Skipped: 0, Time elapsed: 5.503 sec - in org.apache.hadoop.hbase.backup.example.TestZooKeeperTableArchiveClient
Tests run: 31, Failures: 0, Errors: 0, Skipped: 0, Time elapsed: 201.071 sec - in org.apache.hadoop.hbase.wal.TestWALSplitCompressed
Running org.apache.hadoop.hbase.ipc.TestProtoBufRpc
Tests run: 1, Failures: 0, Errors: 0, Skipped: 0, Time elapsed: 3.849 sec - in org.apache.hadoop.hbase.ipc.TestProtoBufRpc
Running org.apache.hadoop.hbase.ipc.TestDelayedRpc
Tests run: 4, Failures: 0, Errors: 0, Skipped: 0, Time elapsed: 5.547 sec - in org.apache.hadoop.hbase.ipc.TestDelayedRpc
Running org.apache.hadoop.hbase.TestHColumnDescriptorDefaultVersions
Running org.apache.hadoop.hbase.ipc.TestHBaseClient
Tests run: 1, Failures: 0, Errors: 0, Skipped: 0, Time elapsed: 0.598 sec - in org.apache.hadoop.hbase.ipc.TestHBaseClient
Running org.apache.hadoop.hbase.TestNamespace
Tests run: 3, Failures: 0, Errors: 0, Skipped: 0, Time elapsed: 34.453 sec - in org.apache.hadoop.hbase.TestHColumnDescriptorDefaultVersions
Tests run: 5, Failures: 0, Errors: 0, Skipped: 0, Time elapsed: 83.673 sec - in org.apache.hadoop.hbase.backup.TestHFileArchiving
Tests run: 9, Failures: 0, Errors: 0, Skipped: 1, Time elapsed: 42.064 sec - in org.apache.hadoop.hbase.TestNamespace
Tests run: 2, Failures: 0, Errors: 0, Skipped: 0, Time elapsed: 218.131 sec - in org.apache.hadoop.hbase.TestIOFencing

Results :




Tests run: 2232, Failures: 0, Errors: 0, Skipped: 17

[INFO] ------------------------------------------------------------------------
[INFO] Reactor Summary:
[INFO] 
[INFO] HBase ............................................. SUCCESS [  2.814 s]
[INFO] HBase - Checkstyle ................................ SUCCESS [  0.704 s]
[INFO] HBase - Annotations ............................... SUCCESS [  0.236 s]
[INFO] HBase - Protocol .................................. SUCCESS [  3.004 s]
[INFO] HBase - Common .................................... SUCCESS [03:10 min]
[INFO] HBase - Procedure ................................. SUCCESS [01:28 min]
[INFO] HBase - Client .................................... SUCCESS [01:47 min]
[INFO] HBase - Hadoop Compatibility ...................... SUCCESS [ 11.254 s]
[INFO] HBase - Hadoop Two Compatibility .................. SUCCESS [ 13.838 s]
[INFO] HBase - Prefix Tree ............................... SUCCESS [ 17.547 s]
[INFO] HBase - Server .................................... FAILURE [  02:07 h]
[INFO] HBase - Testing Util .............................. SKIPPED
[INFO] HBase - Thrift .................................... SKIPPED
[INFO] HBase - Shell ..................................... SKIPPED
[INFO] HBase - Integration Tests ......................... SKIPPED
[INFO] HBase - Examples .................................. SKIPPED
[INFO] HBase - Rest ...................................... SKIPPED
[INFO] HBase - Assembly .................................. SKIPPED
[INFO] HBase - Shaded .................................... SKIPPED
[INFO] HBase - Shaded - Client ........................... SKIPPED
[INFO] HBase - Shaded - Server ........................... SKIPPED
[INFO] ------------------------------------------------------------------------
[INFO] BUILD FAILURE
[INFO] ------------------------------------------------------------------------
[INFO] Total time: 02:14 h
[INFO] Finished at: 2015-05-05T01:52:50+00:00
[INFO] Final Memory: 69M/558M
[INFO] ------------------------------------------------------------------------
[ERROR] Failed to execute goal org.apache.maven.plugins:maven-surefire-plugin:2.18:test (secondPartTestsExecution) on project hbase-server: There was a timeout or other error in the fork -> [Help 1]
[ERROR] 
[ERROR] To see the full stack trace of the errors, re-run Maven with the -e switch.
[ERROR] Re-run Maven using the -X switch to enable full debug logging.
[ERROR] 
[ERROR] For more information about the errors and possible solutions, please read the following articles:
[ERROR] [Help 1] http://cwiki.apache.org/confluence/display/MAVEN/MojoFailureException
[ERROR] 
[ERROR] After correcting the problems, you can resume the build with the command
[ERROR]   mvn <goals> -rf :hbase-server
Build step 'Invoke top-level Maven targets' marked build as failure
Performing Post build task...
Match found for :.* : True
Logical operation result is TRUE
Running script  :   ZOMBIE_TESTS_COUNT=`jps | grep surefirebooter | wc -l`
  if [[ $ZOMBIE_TESTS_COUNT != 0 ]] ; then
    #It seems sometimes the tests are not dying immediately. Let's give them 10s
    echo "Suspicious java process found - waiting 10s to see if there are just slow to stop"
    sleep 10   
    ZOMBIE_TESTS_COUNT=`jps | grep surefirebooter | wc -l`
    if [[ $ZOMBIE_TESTS_COUNT != 0 ]] ; then
      echo "There are $ZOMBIE_TESTS_COUNT zombie tests, they should have been killed by surefire but survived"
      echo "************ BEGIN zombies jstack extract"
      ZB_STACK=`jps | grep surefirebooter | cut -d ' ' -f 1 | xargs -n 1 jstack | grep ".test" | grep "\.java"`
      jps | grep surefirebooter | cut -d ' ' -f 1 | xargs -n 1 jstack
      echo "************ END  zombies jstack extract"
      JIRA_COMMENT="$JIRA_COMMENT

     {color:red}-1 core zombie tests{color}.  There are ${ZOMBIE_TESTS_COUNT} zombie test(s): ${ZB_STACK}"
      BAD=1
      jps | grep surefirebooter | cut -d ' ' -f 1 | xargs kill -9
    else
      echo "We're ok: there is no zombie test, but some tests took some time to stop"
    fi
  else
    echo "We're ok: there is no zombie test"
  fi
[HBase-TRUNK] $ /bin/bash -xe /tmp/hudson9204508232087763330.sh
++ jps
++ grep surefirebooter
++ wc -l
+ ZOMBIE_TESTS_COUNT=0
+ [[ 0 != 0 ]]
+ echo 'We'\''re ok: there is no zombie test'
We're ok: there is no zombie test
POST BUILD TASK : SUCCESS
END OF POST BUILD TASK : 0
Archiving artifacts
Sending artifact delta relative to HBase-TRUNK #6452
Archived 2161 artifacts
Archive block size is 32768
Received 74 blocks and 428806187 bytes
Compression is 0.6%
Took 3 min 3 sec
Recording test results
[FINDBUGS] Collecting findbugs analysis files...
[FINDBUGS] Finding all files that match the pattern **/findbugs.xml,**/findbugsXml.xml
[FINDBUGS] Parsing 24 files in <https://builds.apache.org/job/HBase-TRUNK/ws/>
[FINDBUGS] Successfully parsed file <https://builds.apache.org/job/HBase-TRUNK/6454/artifact/hbase-annotations/target/findbugs.xml> of module  with 0 warnings.
[FINDBUGS] Successfully parsed file <https://builds.apache.org/job/HBase-TRUNK/6454/artifact/hbase-annotations/target/findbugsXml.xml> of module  with 0 warnings.
[FINDBUGS] Successfully parsed file <https://builds.apache.org/job/HBase-TRUNK/6454/artifact/hbase-client/target/findbugs.xml> of module  with 0 warnings.
[FINDBUGS] Successfully parsed file <https://builds.apache.org/job/HBase-TRUNK/6454/artifact/hbase-client/target/findbugsXml.xml> of module  with 8 warnings.
[FINDBUGS] Successfully parsed file <https://builds.apache.org/job/HBase-TRUNK/6454/artifact/hbase-common/target/findbugs.xml> of module  with 0 warnings.
[FINDBUGS] Successfully parsed file <https://builds.apache.org/job/HBase-TRUNK/6454/artifact/hbase-common/target/findbugsXml.xml> of module  with 1 warnings.
[FINDBUGS] Successfully parsed file <https://builds.apache.org/job/HBase-TRUNK/6454/artifact/hbase-examples/target/findbugs.xml> of module  with 0 warnings.
[FINDBUGS] Successfully parsed file <https://builds.apache.org/job/HBase-TRUNK/6454/artifact/hbase-examples/target/findbugsXml.xml> of module  with 0 warnings.
[FINDBUGS] Successfully parsed file <https://builds.apache.org/job/HBase-TRUNK/6454/artifact/hbase-hadoop-compat/target/findbugs.xml> of module  with 0 warnings.
[FINDBUGS] Successfully parsed file <https://builds.apache.org/job/HBase-TRUNK/6454/artifact/hbase-hadoop-compat/target/findbugsXml.xml> of module  with 0 warnings.
[FINDBUGS] Successfully parsed file <https://builds.apache.org/job/HBase-TRUNK/6454/artifact/hbase-hadoop2-compat/target/findbugs.xml> of module  with 0 warnings.
[FINDBUGS] Successfully parsed file <https://builds.apache.org/job/HBase-TRUNK/6454/artifact/hbase-hadoop2-compat/target/findbugsXml.xml> of module  with 0 warnings.
[FINDBUGS] Successfully parsed file <https://builds.apache.org/job/HBase-TRUNK/6454/artifact/hbase-prefix-tree/target/findbugs.xml> of module  with 0 warnings.
[FINDBUGS] Successfully parsed file <https://builds.apache.org/job/HBase-TRUNK/6454/artifact/hbase-prefix-tree/target/findbugsXml.xml> of module  with 0 warnings.
[FINDBUGS] Successfully parsed file <https://builds.apache.org/job/HBase-TRUNK/6454/artifact/hbase-procedure/target/findbugs.xml> of module  with 0 warnings.
[FINDBUGS] Successfully parsed file <https://builds.apache.org/job/HBase-TRUNK/6454/artifact/hbase-procedure/target/findbugsXml.xml> of module  with 1 warnings.
[FINDBUGS] Successfully parsed file <https://builds.apache.org/job/HBase-TRUNK/6454/artifact/hbase-protocol/target/findbugs.xml> of module  with 0 warnings.
[FINDBUGS] Successfully parsed file <https://builds.apache.org/job/HBase-TRUNK/6454/artifact/hbase-protocol/target/findbugsXml.xml> of module  with 0 warnings.
[FINDBUGS] Successfully parsed file <https://builds.apache.org/job/HBase-TRUNK/6454/artifact/hbase-rest/target/findbugs.xml> of module  with 0 warnings.
[FINDBUGS] Successfully parsed file <https://builds.apache.org/job/HBase-TRUNK/6454/artifact/hbase-rest/target/findbugsXml.xml> of module  with 2 warnings.
[FINDBUGS] Successfully parsed file <https://builds.apache.org/job/HBase-TRUNK/6454/artifact/hbase-server/target/findbugs.xml> of module  with 0 warnings.
[FINDBUGS] Successfully parsed file <https://builds.apache.org/job/HBase-TRUNK/6454/artifact/hbase-server/target/findbugsXml.xml> of module  with 64 warnings.
[FINDBUGS] Successfully parsed file <https://builds.apache.org/job/HBase-TRUNK/6454/artifact/hbase-thrift/target/findbugs.xml> of module  with 0 warnings.
[FINDBUGS] Successfully parsed file <https://builds.apache.org/job/HBase-TRUNK/6454/artifact/hbase-thrift/target/findbugsXml.xml> of module  with 0 warnings.
[FINDBUGS] Computing warning deltas based on reference build #6452
[CHECKSTYLE] Collecting checkstyle analysis files...
[CHECKSTYLE] Finding all files that match the pattern **/checkstyle-result.xml
[CHECKSTYLE] Parsing 21 files in <https://builds.apache.org/job/HBase-TRUNK/ws/>
[CHECKSTYLE] Successfully parsed file <https://builds.apache.org/job/HBase-TRUNK/6454/artifact/hbase-annotations/target/checkstyle-result.xml> of module  with 0 warnings.
[CHECKSTYLE] Successfully parsed file <https://builds.apache.org/job/HBase-TRUNK/6454/artifact/hbase-assembly/target/checkstyle-result.xml> of module  with 0 warnings.
[CHECKSTYLE] Successfully parsed file <https://builds.apache.org/job/HBase-TRUNK/6454/artifact/hbase-checkstyle/target/checkstyle-result.xml> of module  with 0 warnings.
[CHECKSTYLE] Successfully parsed file <https://builds.apache.org/job/HBase-TRUNK/6454/artifact/hbase-client/target/checkstyle-result.xml> of module  with 212 warnings.
[CHECKSTYLE] Successfully parsed file <https://builds.apache.org/job/HBase-TRUNK/6454/artifact/hbase-common/target/checkstyle-result.xml> of module  with 125 warnings.
[CHECKSTYLE] Successfully parsed file <https://builds.apache.org/job/HBase-TRUNK/6454/artifact/hbase-examples/target/checkstyle-result.xml> of module  with 30 warnings.
[CHECKSTYLE] Successfully parsed file <https://builds.apache.org/job/HBase-TRUNK/6454/artifact/hbase-hadoop-compat/target/checkstyle-result.xml> of module  with 2 warnings.
[CHECKSTYLE] Successfully parsed file <https://builds.apache.org/job/HBase-TRUNK/6454/artifact/hbase-hadoop2-compat/target/checkstyle-result.xml> of module  with 47 warnings.
[CHECKSTYLE] Successfully parsed file <https://builds.apache.org/job/HBase-TRUNK/6454/artifact/hbase-it/target/checkstyle-result.xml> of module  with 0 warnings.
[CHECKSTYLE] Successfully parsed file <https://builds.apache.org/job/HBase-TRUNK/6454/artifact/hbase-prefix-tree/target/checkstyle-result.xml> of module  with 25 warnings.
[CHECKSTYLE] Successfully parsed file <https://builds.apache.org/job/HBase-TRUNK/6454/artifact/hbase-procedure/target/checkstyle-result.xml> of module  with 0 warnings.
[CHECKSTYLE] Successfully parsed file <https://builds.apache.org/job/HBase-TRUNK/6454/artifact/hbase-protocol/target/checkstyle-result.xml> of module  with 3 warnings.
[CHECKSTYLE] Successfully parsed file <https://builds.apache.org/job/HBase-TRUNK/6454/artifact/hbase-rest/target/checkstyle-result.xml> of module  with 42 warnings.
[CHECKSTYLE] Successfully parsed file <https://builds.apache.org/job/HBase-TRUNK/6454/artifact/hbase-server/target/checkstyle-result.xml> of module  with 1379 warnings.
[CHECKSTYLE] Successfully parsed file <https://builds.apache.org/job/HBase-TRUNK/6454/artifact/hbase-shaded/hbase-shaded-client/target/checkstyle-result.xml> of module  with 0 warnings.
[CHECKSTYLE] Successfully parsed file <https://builds.apache.org/job/HBase-TRUNK/6454/artifact/hbase-shaded/hbase-shaded-server/target/checkstyle-result.xml> of module  with 0 warnings.
[CHECKSTYLE] Successfully parsed file <https://builds.apache.org/job/HBase-TRUNK/6454/artifact/hbase-shaded/target/checkstyle-result.xml> of module  with 0 warnings.
[CHECKSTYLE] Successfully parsed file <https://builds.apache.org/job/HBase-TRUNK/6454/artifact/hbase-shell/target/checkstyle-result.xml> of module  with 0 warnings.
[CHECKSTYLE] Successfully parsed file <https://builds.apache.org/job/HBase-TRUNK/6454/artifact/hbase-testing-util/target/checkstyle-result.xml> of module  with 0 warnings.
[CHECKSTYLE] Successfully parsed file <https://builds.apache.org/job/HBase-TRUNK/6454/artifact/hbase-thrift/target/checkstyle-result.xml> of module  with 32 warnings.
[CHECKSTYLE] Successfully parsed file <https://builds.apache.org/job/HBase-TRUNK/6454/artifact/target/checkstyle-result.xml> of module  with 0 warnings.
[CHECKSTYLE] Computing warning deltas based on reference build #6452
Updating HBASE-13464

Jenkins build is back to normal : HBase-TRUNK #6455

Posted by Apache Jenkins Server <je...@builds.apache.org>.
See <https://builds.apache.org/job/HBase-TRUNK/6455/changes>