You are viewing a plain text version of this content. The canonical link for it is here.
Posted to notifications@qpid.apache.org by Apache Jenkins Server <je...@builds.apache.org> on 2015/02/05 06:12:45 UTC
Build failed in Jenkins: Qpid-Java-Cpp-Test #2392
See <https://builds.apache.org/job/Qpid-Java-Cpp-Test/2392/changes>
Changes:
[shuston] Add cmake module for checking size_t native; should have been with the rest of the patch for QPID-6312
------------------------------------------
[...truncated 6899 lines...]
at org.apache.qpid.server.store.berkeleydb.replication.MultiNodeTest.setUp(MultiNodeTest.java:81)
testPriority(org.apache.qpid.server.store.berkeleydb.replication.MultiNodeTest) Time elapsed: 0.006 sec <<< FAILURE!
junit.framework.AssertionFailedError: null
at junit.framework.Assert.fail(Assert.java:55)
at junit.framework.Assert.assertTrue(Assert.java:22)
at junit.framework.Assert.assertTrue(Assert.java:31)
at junit.framework.TestCase.assertTrue(TestCase.java:201)
at org.apache.qpid.server.store.berkeleydb.replication.MultiNodeTest.setUp(MultiNodeTest.java:81)
testQuorumOverride(org.apache.qpid.server.store.berkeleydb.replication.MultiNodeTest) Time elapsed: 0.006 sec <<< FAILURE!
junit.framework.AssertionFailedError: null
at junit.framework.Assert.fail(Assert.java:55)
at junit.framework.Assert.assertTrue(Assert.java:22)
at junit.framework.Assert.assertTrue(Assert.java:31)
at junit.framework.TestCase.assertTrue(TestCase.java:201)
at org.apache.qpid.server.store.berkeleydb.replication.MultiNodeTest.setUp(MultiNodeTest.java:81)
testLossOfQuorumCausesClientDisconnection(org.apache.qpid.server.store.berkeleydb.replication.MultiNodeTest) Time elapsed: 0.006 sec <<< FAILURE!
junit.framework.AssertionFailedError: null
at junit.framework.Assert.fail(Assert.java:55)
at junit.framework.Assert.assertTrue(Assert.java:22)
at junit.framework.Assert.assertTrue(Assert.java:31)
at junit.framework.TestCase.assertTrue(TestCase.java:201)
at org.apache.qpid.server.store.berkeleydb.replication.MultiNodeTest.setUp(MultiNodeTest.java:81)
testLossOfMasterNodeCausesClientToFailover(org.apache.qpid.server.store.berkeleydb.replication.MultiNodeTest) Time elapsed: 0.006 sec <<< FAILURE!
junit.framework.AssertionFailedError: null
at junit.framework.Assert.fail(Assert.java:55)
at junit.framework.Assert.assertTrue(Assert.java:22)
at junit.framework.Assert.assertTrue(Assert.java:31)
at junit.framework.TestCase.assertTrue(TestCase.java:201)
at org.apache.qpid.server.store.berkeleydb.replication.MultiNodeTest.setUp(MultiNodeTest.java:81)
testClusterCannotStartWithIntruder(org.apache.qpid.server.store.berkeleydb.replication.MultiNodeTest) Time elapsed: 0.006 sec <<< FAILURE!
junit.framework.AssertionFailedError: null
at junit.framework.Assert.fail(Assert.java:55)
at junit.framework.Assert.assertTrue(Assert.java:22)
at junit.framework.Assert.assertTrue(Assert.java:31)
at junit.framework.TestCase.assertTrue(TestCase.java:201)
at org.apache.qpid.server.store.berkeleydb.replication.MultiNodeTest.setUp(MultiNodeTest.java:81)
testTransferMasterWhilstMessagesInFlight(org.apache.qpid.server.store.berkeleydb.replication.MultiNodeTest) Time elapsed: 0.006 sec <<< FAILURE!
junit.framework.AssertionFailedError: null
at junit.framework.Assert.fail(Assert.java:55)
at junit.framework.Assert.assertTrue(Assert.java:22)
at junit.framework.Assert.assertTrue(Assert.java:31)
at junit.framework.TestCase.assertTrue(TestCase.java:201)
at org.apache.qpid.server.store.berkeleydb.replication.MultiNodeTest.setUp(MultiNodeTest.java:81)
testTransferMasterFromRemoteNode(org.apache.qpid.server.store.berkeleydb.replication.MultiNodeTest) Time elapsed: 0.006 sec <<< FAILURE!
junit.framework.AssertionFailedError: null
at junit.framework.Assert.fail(Assert.java:55)
at junit.framework.Assert.assertTrue(Assert.java:22)
at junit.framework.Assert.assertTrue(Assert.java:31)
at junit.framework.TestCase.assertTrue(TestCase.java:201)
at org.apache.qpid.server.store.berkeleydb.replication.MultiNodeTest.setUp(MultiNodeTest.java:81)
testLossOfReplicaNodeDoesNotCauseClientToFailover(org.apache.qpid.server.store.berkeleydb.replication.MultiNodeTest) Time elapsed: 0.006 sec <<< FAILURE!
junit.framework.AssertionFailedError: null
at junit.framework.Assert.fail(Assert.java:55)
at junit.framework.Assert.assertTrue(Assert.java:22)
at junit.framework.Assert.assertTrue(Assert.java:31)
at junit.framework.TestCase.assertTrue(TestCase.java:201)
at org.apache.qpid.server.store.berkeleydb.replication.MultiNodeTest.setUp(MultiNodeTest.java:81)
testPersistentMessagesAvailableAfterFailover(org.apache.qpid.server.store.berkeleydb.replication.MultiNodeTest) Time elapsed: 0.006 sec <<< FAILURE!
junit.framework.AssertionFailedError: null
at junit.framework.Assert.fail(Assert.java:55)
at junit.framework.Assert.assertTrue(Assert.java:22)
at junit.framework.Assert.assertTrue(Assert.java:31)
at junit.framework.TestCase.assertTrue(TestCase.java:201)
at org.apache.qpid.server.store.berkeleydb.replication.MultiNodeTest.setUp(MultiNodeTest.java:81)
Running org.apache.qpid.server.store.berkeleydb.replication.TwoNodeTest
Tests run: 7, Failures: 7, Errors: 0, Skipped: 0, Time elapsed: 0.074 sec <<< FAILURE! - in org.apache.qpid.server.store.berkeleydb.replication.TwoNodeTest
testMasterDesignatedPrimaryCanBeRestartedWithoutReplica(org.apache.qpid.server.store.berkeleydb.replication.TwoNodeTest) Time elapsed: 0.006 sec <<< FAILURE!
junit.framework.AssertionFailedError: null
at junit.framework.Assert.fail(Assert.java:55)
at junit.framework.Assert.assertTrue(Assert.java:22)
at junit.framework.Assert.assertTrue(Assert.java:31)
at junit.framework.TestCase.assertTrue(TestCase.java:201)
at org.apache.qpid.server.store.berkeleydb.replication.TwoNodeTest.setUp(TwoNodeTest.java:55)
testSecondaryDesignatedAsPrimaryAfterOriginalPrimaryStopped(org.apache.qpid.server.store.berkeleydb.replication.TwoNodeTest) Time elapsed: 0.006 sec <<< FAILURE!
junit.framework.AssertionFailedError: null
at junit.framework.Assert.fail(Assert.java:55)
at junit.framework.Assert.assertTrue(Assert.java:22)
at junit.framework.Assert.assertTrue(Assert.java:31)
at junit.framework.TestCase.assertTrue(TestCase.java:201)
at org.apache.qpid.server.store.berkeleydb.replication.TwoNodeTest.setUp(TwoNodeTest.java:55)
testClusterRestartWithoutDesignatedPrimary(org.apache.qpid.server.store.berkeleydb.replication.TwoNodeTest) Time elapsed: 0.018 sec <<< FAILURE!
junit.framework.AssertionFailedError: null
at junit.framework.Assert.fail(Assert.java:55)
at junit.framework.Assert.assertTrue(Assert.java:22)
at junit.framework.Assert.assertTrue(Assert.java:31)
at junit.framework.TestCase.assertTrue(TestCase.java:201)
at org.apache.qpid.server.store.berkeleydb.replication.TwoNodeTest.setUp(TwoNodeTest.java:55)
testDesignatedPrimaryContinuesAfterSecondaryStopped(org.apache.qpid.server.store.berkeleydb.replication.TwoNodeTest) Time elapsed: 0.009 sec <<< FAILURE!
junit.framework.AssertionFailedError: null
at junit.framework.Assert.fail(Assert.java:55)
at junit.framework.Assert.assertTrue(Assert.java:22)
at junit.framework.Assert.assertTrue(Assert.java:31)
at junit.framework.TestCase.assertTrue(TestCase.java:201)
at org.apache.qpid.server.store.berkeleydb.replication.TwoNodeTest.setUp(TwoNodeTest.java:55)
testPersistentOperationsFailOnNonDesignatedPrimaryAfterSecondaryStopped(org.apache.qpid.server.store.berkeleydb.replication.TwoNodeTest) Time elapsed: 0.01 sec <<< FAILURE!
junit.framework.AssertionFailedError: null
at junit.framework.Assert.fail(Assert.java:55)
at junit.framework.Assert.assertTrue(Assert.java:22)
at junit.framework.Assert.assertTrue(Assert.java:31)
at junit.framework.TestCase.assertTrue(TestCase.java:201)
at org.apache.qpid.server.store.berkeleydb.replication.TwoNodeTest.setUp(TwoNodeTest.java:55)
testInitialDesignatedPrimaryStateOfNodes(org.apache.qpid.server.store.berkeleydb.replication.TwoNodeTest) Time elapsed: 0.009 sec <<< FAILURE!
junit.framework.AssertionFailedError: null
at junit.framework.Assert.fail(Assert.java:55)
at junit.framework.Assert.assertTrue(Assert.java:22)
at junit.framework.Assert.assertTrue(Assert.java:31)
at junit.framework.TestCase.assertTrue(TestCase.java:201)
at org.apache.qpid.server.store.berkeleydb.replication.TwoNodeTest.setUp(TwoNodeTest.java:55)
testSecondaryDoesNotBecomePrimaryWhenDesignatedPrimaryStopped(org.apache.qpid.server.store.berkeleydb.replication.TwoNodeTest) Time elapsed: 0.009 sec <<< FAILURE!
junit.framework.AssertionFailedError: null
at junit.framework.Assert.fail(Assert.java:55)
at junit.framework.Assert.assertTrue(Assert.java:22)
at junit.framework.Assert.assertTrue(Assert.java:31)
at junit.framework.TestCase.assertTrue(TestCase.java:201)
at org.apache.qpid.server.store.berkeleydb.replication.TwoNodeTest.setUp(TwoNodeTest.java:55)
Running org.apache.qpid.server.store.berkeleydb.BDBBackupTest
Tests run: 0, Failures: 0, Errors: 0, Skipped: 0, Time elapsed: 0.002 sec - in org.apache.qpid.server.store.berkeleydb.BDBBackupTest
Results :
Failed tests:
MultiNodeTest>QpidTestCase.run:148->QpidBrokerTestCase.runBare:272->setUp:81 null
MultiNodeTest>QpidTestCase.run:148->QpidBrokerTestCase.runBare:272->setUp:81 null
MultiNodeTest>QpidTestCase.run:148->QpidBrokerTestCase.runBare:272->setUp:81 null
MultiNodeTest>QpidTestCase.run:148->QpidBrokerTestCase.runBare:272->setUp:81 null
MultiNodeTest>QpidTestCase.run:148->QpidBrokerTestCase.runBare:272->setUp:81 null
MultiNodeTest>QpidTestCase.run:148->QpidBrokerTestCase.runBare:272->setUp:81 null
MultiNodeTest>QpidTestCase.run:148->QpidBrokerTestCase.runBare:272->setUp:81 null
MultiNodeTest>QpidTestCase.run:148->QpidBrokerTestCase.runBare:272->setUp:81 null
MultiNodeTest>QpidTestCase.run:148->QpidBrokerTestCase.runBare:272->setUp:81 null
MultiNodeTest>QpidTestCase.run:148->QpidBrokerTestCase.runBare:272->setUp:81 null
TwoNodeTest>QpidTestCase.run:148->QpidBrokerTestCase.runBare:272->setUp:55 null
TwoNodeTest>QpidTestCase.run:148->QpidBrokerTestCase.runBare:272->setUp:55 null
TwoNodeTest>QpidTestCase.run:148->QpidBrokerTestCase.runBare:272->setUp:55 null
TwoNodeTest>QpidTestCase.run:148->QpidBrokerTestCase.runBare:272->setUp:55 null
TwoNodeTest>QpidTestCase.run:148->QpidBrokerTestCase.runBare:272->setUp:55 null
TwoNodeTest>QpidTestCase.run:148->QpidBrokerTestCase.runBare:272->setUp:55 null
TwoNodeTest>QpidTestCase.run:148->QpidBrokerTestCase.runBare:272->setUp:55 null
Tests in error:
BDBHAVirtualHostNodeRestTest>QpidTestCase.run:148->QpidBrokerTestCase.runBare:272->testNewMasterElectedWhenVirtualHostIsStopped:135->createHANode:317 » Connect
BDBHAVirtualHostNodeRestTest>QpidTestCase.run:148->QpidBrokerTestCase.runBare:272->testMutateStateOfOneNode:103->createHANode:317 » Connect
BDBHAVirtualHostNodeRestTest>QpidTestCase.run:148->QpidBrokerTestCase.runBare:272->testIntruderProtection:252->createHANode:317 » Connect
BDBHAVirtualHostNodeRestTest>QpidTestCase.run:148->QpidBrokerTestCase.runBare:272->testDeleteMasterNode:192->createHANode:317 » Connect
BDBHAVirtualHostNodeRestTest>QpidTestCase.run:148->QpidBrokerTestCase.runBare:272->testCreate3NodeGroup:92->createHANode:317 » Connect
BDBHAVirtualHostNodeRestTest>QpidTestCase.run:148->QpidBrokerTestCase.runBare:272->testDeleteReplicaNode:166->createHANode:317 » Connect
BDBHAVirtualHostNodeRestTest>QpidTestCase.run:148->QpidBrokerTestCase.runBare:272->testIntruderBDBHAVHNNotAllowedToConnect:232->createHANode:317 » Connect
BDBHAVirtualHostRestTest>QpidTestCase.run:148->QpidBrokerTestCase.runBare:272->testSetLocalTransactionSynchronizationPolicy:116->QpidRestTestCase.waitForAttributeChanged:114 » Connect
BDBHAVirtualHostRestTest>QpidTestCase.run:148->QpidBrokerTestCase.runBare:272->testMutateState:140->QpidRestTestCase.waitForAttributeChanged:114 » Connect
BDBHAVirtualHostRestTest>QpidTestCase.run:148->QpidBrokerTestCase.runBare:272->testSetRemoteTransactionSynchronizationPolicy:128->QpidRestTestCase.waitForAttributeChanged:114 » Connect
JMXManagementTest>QpidTestCase.run:148->QpidBrokerTestCase.runBare:272->testRemoveRemoteNodeFromGroup:164->getStoreBeanForNodeAtBrokerPort:276 » IO
JMXManagementTest>QpidTestCase.run:148->QpidBrokerTestCase.runBare:272->testVirtualHostOperationsDeniedForNonMasterNode:187->getManagedBrokerBeanForNodeAtBrokerPort:283 » IO
JMXManagementTest>QpidTestCase.run:148->QpidBrokerTestCase.runBare:272->testStateOfNonActiveBrokerIsNotMaster:133->getStoreBeanForNodeAtBrokerPort:276 » IO
JMXManagementTest>QpidTestCase.run:148->QpidBrokerTestCase.runBare:272->testStateOfActiveBrokerIsMaster:125->getStoreBeanForNodeAtBrokerPort:276 » IO
JMXManagementTest>QpidTestCase.run:148->QpidBrokerTestCase.runBare:272->testVirtualHostMbeanOnMasterTransfer:225->getManagedBrokerBeanForNodeAtBrokerPort:283 » IO
JMXManagementTest>QpidTestCase.run:148->QpidBrokerTestCase.runBare:272->testGroupMembers:142->getStoreBeanForNodeAtBrokerPort:276 » IO
JMXManagementTest>QpidTestCase.run:148->QpidBrokerTestCase.runBare:272->testReadonlyMBeanAttributes:111->getStoreBeanForNodeAtBrokerPort:276 » IO
Tests run: 42, Failures: 17, Errors: 17, Skipped: 0
[INFO] ------------------------------------------------------------------------
[INFO] Reactor Summary:
[INFO]
[INFO] Qpid Java Build ................................... SUCCESS [2.647s]
[INFO] Qpid AMQP 1.0 Common .............................. SUCCESS [5.893s]
[INFO] Qpid AMQP 1.0 Client .............................. SUCCESS [0.743s]
[INFO] Qpid AMQP 1.0 Client JMS .......................... SUCCESS [1.853s]
[INFO] Qpid AMQP 1.0 JMS Client Examples ................. SUCCESS [0.229s]
[INFO] Qpid AMQP 1.0 Client WebSocket .................... SUCCESS [1.177s]
[INFO] Qpid Broker Code Generation ....................... SUCCESS [0.445s]
[INFO] Qpid Test Utilities ............................... SUCCESS [0.276s]
[INFO] Qpid Common ....................................... SUCCESS [28.281s]
[INFO] Qpid Management Common ............................ SUCCESS [1.222s]
[INFO] Qpid Java Broker Core ............................. SUCCESS [1:24.272s]
[INFO] Qpid Access Control Broker Plug-in ................ SUCCESS [4.177s]
[INFO] Qpid AMQP 0-8 Protocol Broker Plug-in ............. SUCCESS [21.225s]
[INFO] Qpid AMQP 0-10 Protocol Plug-in ................... SUCCESS [4.177s]
[INFO] Qpid AMQP 1-0 Protocol Broker Plug-in ............. SUCCESS [0.715s]
[INFO] Qpid AMQP 0-8 to 0-10 Message Conversion Broker Plug-in SUCCESS [0.418s]
[INFO] Qpid AMQP 0-8 to 1-0 Message Conversion Broker Plug-in SUCCESS [0.262s]
[INFO] Qpid AMQP 0-10 to 1-0 Message Conversion Broker Plug-in SUCCESS [0.346s]
[INFO] Qpid Derby Message Store .......................... SUCCESS [16.099s]
[INFO] Qpid JDBC Message Store Connection Pooling Plug-in SUCCESS [0.388s]
[INFO] Qpid JDBC Message Store Broker Plug-in ............ SUCCESS [9.409s]
[INFO] Qpid HTTP Management Broker Plug-in ............... SUCCESS [4.957s]
[INFO] Qpid JMX Management Broker Plug-in ................ SUCCESS [3.412s]
[INFO] Qpid Memory Message Store Broker Plug-in .......... SUCCESS [0.458s]
[INFO] Qpid WebSocket Broker Plug-in ..................... SUCCESS [0.311s]
[INFO] Qpid AMQP 0-x JMS Client .......................... SUCCESS [6.920s]
[INFO] Qpid BDB Message Store ............................ SUCCESS [2:13.033s]
[INFO] Qpid BDB Message Store JMX ........................ SUCCESS [2.003s]
[INFO] Qpid Java Broker .................................. SUCCESS [4.829s]
[INFO] Qpid AMQP Management Protocol Broker Plug-in ...... SUCCESS [0.290s]
[INFO] Qpid AMQP 0-x JMS Client Examples ................. SUCCESS [0.173s]
[INFO] Qpid JCA .......................................... SUCCESS [1.588s]
[INFO] Qpid Resource Adaptor ............................. SUCCESS [0.417s]
[INFO] Qpid Tools ........................................ SUCCESS [0.439s]
[INFO] Qpid Management Examples .......................... SUCCESS [0.216s]
[INFO] Qpid Java System Test Parent ...................... SUCCESS [0.821s]
[INFO] Qpid System Tests ................................. SUCCESS [5:45.694s]
[INFO] Qpid Performance Tests ............................ SUCCESS [13.037s]
[INFO] Qpid Performance Test System Tests ................ FAILURE [16.167s]
[INFO] Qpid Performance Tests Visualisation JFC .......... SUCCESS [4.488s]
[INFO] Qpid BDB Store System Tests ....................... FAILURE [6.145s]
[INFO] ------------------------------------------------------------------------
[INFO] BUILD FAILURE
[INFO] ------------------------------------------------------------------------
[INFO] Total time: 12:11.211s
[INFO] Finished at: Thu Feb 05 05:12:35 UTC 2015
[INFO] Final Memory: 74M/371M
[INFO] ------------------------------------------------------------------------
[ERROR] Failed to execute goal org.apache.maven.plugins:maven-surefire-plugin:2.16:test (integration-test) on project qpid-perftests-systests: There are test failures.
[ERROR]
[ERROR] Please refer to <https://builds.apache.org/job/Qpid-Java-Cpp-Test/ws/trunk/qpid/java/qpid-perftests-systests/target/surefire-reports> for the individual test results.
[ERROR] -> [Help 1]
[ERROR] Failed to execute goal org.apache.maven.plugins:maven-surefire-plugin:2.16:test (integration-test) on project qpid-bdbstore-systests: There are test failures.
[ERROR]
[ERROR] Please refer to <https://builds.apache.org/job/Qpid-Java-Cpp-Test/ws/trunk/qpid/java/bdbstore/systests/target/surefire-reports> for the individual test results.
[ERROR] -> [Help 1]
[ERROR]
[ERROR] To see the full stack trace of the errors, re-run Maven with the -e switch.
[ERROR] Re-run Maven using the -X switch to enable full debug logging.
[ERROR]
[ERROR] For more information about the errors and possible solutions, please read the following articles:
[ERROR] [Help 1] http://cwiki.apache.org/confluence/display/MAVEN/MojoFailureException
[ERROR]
[ERROR] After correcting the problems, you can resume the build with the command
[ERROR] mvn <goals> -rf :qpid-perftests-systests
Build step 'Invoke top-level Maven targets' marked build as failure
[locks-and-latches] Releasing all the locks
[locks-and-latches] All the locks released
Recording test results