You are viewing a plain text version of this content. The canonical link for it is here.
Posted to notifications@maven.apache.org by Hudson <Hu...@sonatype.org> on 2008/10/02 01:14:48 UTC
Build failed in Hudson: mercury #96
See http://ci.sonatype.org/job/mercury/96/changes
------------------------------------------
started
Updating http://svn.apache.org/repos/asf/maven/sandbox/trunk/mercury
At revision 700970
no change for http://svn.apache.org/repos/asf/maven/sandbox/trunk/mercury since the previous build
[mercury] $ mvn clean deploy -B -U -e -Dmaven.repo.local=/home/j2ee-hudson/repos/mercury -Pstrict -Dsurefire.useFile=false -DdistMgmtSnapshotsId=sona-maven-snapshots -DdistMgmtSnapshotsUrl=http://repository.sonatype.org/content/repositories/maven.snapshots
+ Error stacktraces are turned on.
[INFO] Scanning for projects...
[INFO] Reactor build order:
[INFO] Mercury parent POM: 1-alpha-1-SNAPSHOT
[INFO] Mercury Artifact: 1.0.0-alpha-1-SNAPSHOT
[INFO] Mercury Crypto Reactor: 1.0.0-alpha-1-SNAPSHOT
[INFO] Mercury Crypto APIs: 1.0.0-alpha-1-SNAPSHOT
[INFO] Mercury Crypto Basics: 1.0.0-alpha-1-SNAPSHOT
[INFO] Mercury Shared Utilities: 1.0.0-alpha-1-SNAPSHOT
[INFO] Mercury Metadata Reactor: 1.0.0-alpha-1-SNAPSHOT
[INFO] Mercury Shared Metadata: 1.0.0-alpha-1-SNAPSHOT
[INFO] Mercury Transport Reactor: 1.0.0-alpha-1-SNAPSHOT
[INFO] Mercury Transport APIs: 1.0.0-alpha-1-SNAPSHOT
[INFO] Mercury External Dependencies: 1.0.0-alpha-1-SNAPSHOT
[INFO] Mercury Repository Reactor: 1.0.0-alpha-1-SNAPSHOT
[INFO] Mercury Repository APIs: 1.0.0-alpha-1-SNAPSHOT
[INFO] Mercury Local M2 Repository: 1.0.0-alpha-1-SNAPSHOT
[INFO] Mercury Jetty HTTP Transport: 1.0.0-alpha-1-SNAPSHOT
[INFO] Mercury Remote M2 Repository: 1.0.0-alpha-1-SNAPSHOT
[INFO] Mercury Dependency Builder: 1.0.0-alpha-1-SNAPSHOT
[INFO] Mercury File Transport: 1.0.0-alpha-1-SNAPSHOT
[INFO] Mercury Integration Tests: 1.0.0-alpha-1-SNAPSHOT
[INFO] Mercury Wagon provider: 1.0.0-alpha-1-SNAPSHOT
[INFO] Mercury Reactor: 1.0.0-alpha-1-SNAPSHOT
[INFO] ------------------------------------------------------------------------
[INFO] Building Mercury parent POM: 1-alpha-1-SNAPSHOT
[INFO] task-segment: [clean, deploy]
[INFO] ------------------------------------------------------------------------
[INFO] [clean:clean]
[INFO] Deleting directory http://ci.sonatype.org/job/mercury/ws/mercury/mercury-pom/target
Downloading: http://localhost:8081/content/groups/public/org/apache/maven/plugins/maven-deploy-plugin/2.3/maven-deploy-plugin-2.3.pom
1K downloaded
Downloading: http://localhost:8081/content/groups/public/org/apache/maven/plugins/maven-plugins/7/maven-plugins-7.pom
13K downloaded
Downloading: http://localhost:8081/content/groups/public/org/apache/maven/maven-plugin-surrogate-parent/5/maven-plugin-surrogate-parent-5.pom
10K downloaded
Downloading: http://localhost:8081/content/groups/public/org/apache/maven/plugins/maven-deploy-plugin/2.3/maven-deploy-plugin-2.3.jar
15K downloaded
[INFO] [site:attach-descriptor]
[INFO] [jar:test-jar {execution: package-tests}]
[WARNING] JAR will be empty - no content was marked for inclusion!
[INFO] Building jar: http://ci.sonatype.org/job/mercury/ws/mercury/mercury-pom/target/mercury-pom-1-alpha-1-SNAPSHOT-tests.jar
[INFO] [install:install]
[INFO] Installing http://ci.sonatype.org/job/mercury/ws/mercury/mercury-pom/pom.xml to /home/j2ee-hudson/repos/mercury/org/apache/maven/mercury/mercury-pom/1-alpha-1-SNAPSHOT/mercury-pom-1-alpha-1-SNAPSHOT.pom
[INFO] Installing http://ci.sonatype.org/job/mercury/ws/mercury/mercury-pom/target/mercury-pom-1-alpha-1-SNAPSHOT-tests.jar to /home/j2ee-hudson/repos/mercury/org/apache/maven/mercury/mercury-pom/1-alpha-1-SNAPSHOT/mercury-pom-1-alpha-1-SNAPSHOT-tests.jar
[INFO] [deploy:deploy]
altDeploymentRepository = null
[INFO] Retrieving previous build number from sona-maven-snapshots
[INFO] repository metadata for: 'snapshot org.apache.maven.mercury:mercury-pom:1-alpha-1-SNAPSHOT' could not be found on repository: sona-maven-snapshots, so will be created
Uploading: http://repository.sonatype.org/content/repositories/maven.snapshots/org/apache/maven/mercury/mercury-pom/1-alpha-1-SNAPSHOT/mercury-pom-1-alpha-1-20081001.231447-1.pom
8K uploaded
[INFO] ------------------------------------------------------------------------
[ERROR] BUILD ERROR
[INFO] ------------------------------------------------------------------------
[INFO] Error deploying artifact: Failed to transfer file: http://repository.sonatype.org/content/repositories/maven.snapshots/org/apache/maven/mercury/mercury-pom/1-alpha-1-SNAPSHOT/mercury-pom-1-alpha-1-20081001.231447-1.pom. Return code is: 401
[INFO] ------------------------------------------------------------------------
[INFO] Trace
org.apache.maven.lifecycle.LifecycleExecutionException: Error deploying artifact: Failed to transfer file: http://repository.sonatype.org/content/repositories/maven.snapshots/org/apache/maven/mercury/mercury-pom/1-alpha-1-SNAPSHOT/mercury-pom-1-alpha-1-20081001.231447-1.pom. Return code is: 401
at org.apache.maven.lifecycle.DefaultLifecycleExecutor.executeGoals(DefaultLifecycleExecutor.java:583)
at org.apache.maven.lifecycle.DefaultLifecycleExecutor.executeGoalWithLifecycle(DefaultLifecycleExecutor.java:499)
at org.apache.maven.lifecycle.DefaultLifecycleExecutor.executeGoal(DefaultLifecycleExecutor.java:478)
at org.apache.maven.lifecycle.DefaultLifecycleExecutor.executeGoalAndHandleFailures(DefaultLifecycleExecutor.java:330)
at org.apache.maven.lifecycle.DefaultLifecycleExecutor.executeTaskSegments(DefaultLifecycleExecutor.java:291)
at org.apache.maven.lifecycle.DefaultLifecycleExecutor.execute(DefaultLifecycleExecutor.java:142)
at org.apache.maven.DefaultMaven.doExecute(DefaultMaven.java:336)
at org.apache.maven.DefaultMaven.execute(DefaultMaven.java:129)
at org.apache.maven.cli.MavenCli.main(MavenCli.java:287)
at sun.reflect.NativeMethodAccessorImpl.invoke0(Native Method)
at sun.reflect.NativeMethodAccessorImpl.invoke(NativeMethodAccessorImpl.java:39)
at sun.reflect.DelegatingMethodAccessorImpl.invoke(DelegatingMethodAccessorImpl.java:25)
at java.lang.reflect.Method.invoke(Method.java:585)
at org.codehaus.classworlds.Launcher.launchEnhanced(Launcher.java:315)
at org.codehaus.classworlds.Launcher.launch(Launcher.java:255)
at org.codehaus.classworlds.Launcher.mainWithExitCode(Launcher.java:430)
at org.codehaus.classworlds.Launcher.main(Launcher.java:375)
Caused by: org.apache.maven.plugin.MojoExecutionException: Error deploying artifact: Failed to transfer file: http://repository.sonatype.org/content/repositories/maven.snapshots/org/apache/maven/mercury/mercury-pom/1-alpha-1-SNAPSHOT/mercury-pom-1-alpha-1-20081001.231447-1.pom. Return code is: 401
at org.apache.maven.plugin.deploy.DeployMojo.execute(DeployMojo.java:174)
at org.apache.maven.plugin.DefaultPluginManager.executeMojo(DefaultPluginManager.java:451)
at org.apache.maven.lifecycle.DefaultLifecycleExecutor.executeGoals(DefaultLifecycleExecutor.java:558)
... 16 more
Caused by: org.apache.maven.artifact.deployer.ArtifactDeploymentException: Error deploying artifact: Failed to transfer file: http://repository.sonatype.org/content/repositories/maven.snapshots/org/apache/maven/mercury/mercury-pom/1-alpha-1-SNAPSHOT/mercury-pom-1-alpha-1-20081001.231447-1.pom. Return code is: 401
at org.apache.maven.artifact.deployer.DefaultArtifactDeployer.deploy(DefaultArtifactDeployer.java:94)
at org.apache.maven.plugin.deploy.DeployMojo.execute(DeployMojo.java:152)
... 18 more
Caused by: org.apache.maven.wagon.TransferFailedException: Failed to transfer file: http://repository.sonatype.org/content/repositories/maven.snapshots/org/apache/maven/mercury/mercury-pom/1-alpha-1-SNAPSHOT/mercury-pom-1-alpha-1-20081001.231447-1.pom. Return code is: 401
at org.apache.maven.wagon.providers.http.LightweightHttpWagon.put(LightweightHttpWagon.java:172)
at org.apache.maven.artifact.manager.DefaultWagonManager.putRemoteFile(DefaultWagonManager.java:244)
at org.apache.maven.artifact.manager.DefaultWagonManager.putArtifact(DefaultWagonManager.java:160)
at org.apache.maven.artifact.deployer.DefaultArtifactDeployer.deploy(DefaultArtifactDeployer.java:80)
... 19 more
[INFO] ------------------------------------------------------------------------
[INFO] Total time: 5 seconds
[INFO] Finished at: Wed Oct 01 18:14:47 CDT 2008
[INFO] Final Memory: 20M/95M
[INFO] ------------------------------------------------------------------------
Hudson build is back to normal: mercury #98
Posted by Hudson <Hu...@sonatype.org>.
See http://ci.sonatype.org/job/mercury/98/changes
Build failed in Hudson: mercury #97
Posted by Hudson <Hu...@sonatype.org>.
See http://ci.sonatype.org/job/mercury/97/changes
------------------------------------------
started
Updating http://svn.apache.org/repos/asf/maven/sandbox/trunk/mercury
At revision 700975
no change for http://svn.apache.org/repos/asf/maven/sandbox/trunk/mercury since the previous build
[mercury] $ mvn clean deploy -B -U -e -Dmaven.repo.local=/home/j2ee-hudson/repos/mercury -Pstrict -Dsurefire.useFile=false -DdistMgmtSnapshotsId=sona-maven-snapshots -DdistMgmtSnapshotsUrl=http://localhost:8081/content/repositories/maven.snapshots
+ Error stacktraces are turned on.
[INFO] Scanning for projects...
[INFO] Reactor build order:
[INFO] Mercury parent POM: 1-alpha-1-SNAPSHOT
[INFO] Mercury Artifact: 1.0.0-alpha-1-SNAPSHOT
[INFO] Mercury Crypto Reactor: 1.0.0-alpha-1-SNAPSHOT
[INFO] Mercury Crypto APIs: 1.0.0-alpha-1-SNAPSHOT
[INFO] Mercury Crypto Basics: 1.0.0-alpha-1-SNAPSHOT
[INFO] Mercury Shared Utilities: 1.0.0-alpha-1-SNAPSHOT
[INFO] Mercury Metadata Reactor: 1.0.0-alpha-1-SNAPSHOT
[INFO] Mercury Shared Metadata: 1.0.0-alpha-1-SNAPSHOT
[INFO] Mercury Transport Reactor: 1.0.0-alpha-1-SNAPSHOT
[INFO] Mercury Transport APIs: 1.0.0-alpha-1-SNAPSHOT
[INFO] Mercury External Dependencies: 1.0.0-alpha-1-SNAPSHOT
[INFO] Mercury Repository Reactor: 1.0.0-alpha-1-SNAPSHOT
[INFO] Mercury Repository APIs: 1.0.0-alpha-1-SNAPSHOT
[INFO] Mercury Local M2 Repository: 1.0.0-alpha-1-SNAPSHOT
[INFO] Mercury Jetty HTTP Transport: 1.0.0-alpha-1-SNAPSHOT
[INFO] Mercury Remote M2 Repository: 1.0.0-alpha-1-SNAPSHOT
[INFO] Mercury Dependency Builder: 1.0.0-alpha-1-SNAPSHOT
[INFO] Mercury File Transport: 1.0.0-alpha-1-SNAPSHOT
[INFO] Mercury Integration Tests: 1.0.0-alpha-1-SNAPSHOT
[INFO] Mercury Wagon provider: 1.0.0-alpha-1-SNAPSHOT
[INFO] Mercury Reactor: 1.0.0-alpha-1-SNAPSHOT
[INFO] ------------------------------------------------------------------------
[INFO] Building Mercury parent POM: 1-alpha-1-SNAPSHOT
[INFO] task-segment: [clean, deploy]
[INFO] ------------------------------------------------------------------------
[INFO] [clean:clean]
[INFO] Deleting directory http://ci.sonatype.org/job/mercury/ws/mercury/mercury-pom/target
[INFO] [site:attach-descriptor]
[INFO] [jar:test-jar {execution: package-tests}]
[WARNING] JAR will be empty - no content was marked for inclusion!
[INFO] Building jar: http://ci.sonatype.org/job/mercury/ws/mercury/mercury-pom/target/mercury-pom-1-alpha-1-SNAPSHOT-tests.jar
[INFO] [install:install]
[INFO] Installing http://ci.sonatype.org/job/mercury/ws/mercury/mercury-pom/pom.xml to /home/j2ee-hudson/repos/mercury/org/apache/maven/mercury/mercury-pom/1-alpha-1-SNAPSHOT/mercury-pom-1-alpha-1-SNAPSHOT.pom
[INFO] Installing http://ci.sonatype.org/job/mercury/ws/mercury/mercury-pom/target/mercury-pom-1-alpha-1-SNAPSHOT-tests.jar to /home/j2ee-hudson/repos/mercury/org/apache/maven/mercury/mercury-pom/1-alpha-1-SNAPSHOT/mercury-pom-1-alpha-1-SNAPSHOT-tests.jar
[INFO] [deploy:deploy]
altDeploymentRepository = null
[INFO] Retrieving previous build number from sona-maven-snapshots
Uploading: http://localhost:8081/content/repositories/maven.snapshots/org/apache/maven/mercury/mercury-pom/1-alpha-1-SNAPSHOT/mercury-pom-1-alpha-1-20081002.000035-2.pom
8K uploaded
[INFO] ------------------------------------------------------------------------
[ERROR] BUILD ERROR
[INFO] ------------------------------------------------------------------------
[INFO] Error deploying artifact: Failed to transfer file: http://localhost:8081/content/repositories/maven.snapshots/org/apache/maven/mercury/mercury-pom/1-alpha-1-SNAPSHOT/mercury-pom-1-alpha-1-20081002.000035-2.pom. Return code is: 401
[INFO] ------------------------------------------------------------------------
[INFO] Trace
org.apache.maven.lifecycle.LifecycleExecutionException: Error deploying artifact: Failed to transfer file: http://localhost:8081/content/repositories/maven.snapshots/org/apache/maven/mercury/mercury-pom/1-alpha-1-SNAPSHOT/mercury-pom-1-alpha-1-20081002.000035-2.pom. Return code is: 401
at org.apache.maven.lifecycle.DefaultLifecycleExecutor.executeGoals(DefaultLifecycleExecutor.java:583)
at org.apache.maven.lifecycle.DefaultLifecycleExecutor.executeGoalWithLifecycle(DefaultLifecycleExecutor.java:499)
at org.apache.maven.lifecycle.DefaultLifecycleExecutor.executeGoal(DefaultLifecycleExecutor.java:478)
at org.apache.maven.lifecycle.DefaultLifecycleExecutor.executeGoalAndHandleFailures(DefaultLifecycleExecutor.java:330)
at org.apache.maven.lifecycle.DefaultLifecycleExecutor.executeTaskSegments(DefaultLifecycleExecutor.java:291)
at org.apache.maven.lifecycle.DefaultLifecycleExecutor.execute(DefaultLifecycleExecutor.java:142)
at org.apache.maven.DefaultMaven.doExecute(DefaultMaven.java:336)
at org.apache.maven.DefaultMaven.execute(DefaultMaven.java:129)
at org.apache.maven.cli.MavenCli.main(MavenCli.java:287)
at sun.reflect.NativeMethodAccessorImpl.invoke0(Native Method)
at sun.reflect.NativeMethodAccessorImpl.invoke(NativeMethodAccessorImpl.java:39)
at sun.reflect.DelegatingMethodAccessorImpl.invoke(DelegatingMethodAccessorImpl.java:25)
at java.lang.reflect.Method.invoke(Method.java:585)
at org.codehaus.classworlds.Launcher.launchEnhanced(Launcher.java:315)
at org.codehaus.classworlds.Launcher.launch(Launcher.java:255)
at org.codehaus.classworlds.Launcher.mainWithExitCode(Launcher.java:430)
at org.codehaus.classworlds.Launcher.main(Launcher.java:375)
Caused by: org.apache.maven.plugin.MojoExecutionException: Error deploying artifact: Failed to transfer file: http://localhost:8081/content/repositories/maven.snapshots/org/apache/maven/mercury/mercury-pom/1-alpha-1-SNAPSHOT/mercury-pom-1-alpha-1-20081002.000035-2.pom. Return code is: 401
at org.apache.maven.plugin.deploy.DeployMojo.execute(DeployMojo.java:174)
at org.apache.maven.plugin.DefaultPluginManager.executeMojo(DefaultPluginManager.java:451)
at org.apache.maven.lifecycle.DefaultLifecycleExecutor.executeGoals(DefaultLifecycleExecutor.java:558)
... 16 more
Caused by: org.apache.maven.artifact.deployer.ArtifactDeploymentException: Error deploying artifact: Failed to transfer file: http://localhost:8081/content/repositories/maven.snapshots/org/apache/maven/mercury/mercury-pom/1-alpha-1-SNAPSHOT/mercury-pom-1-alpha-1-20081002.000035-2.pom. Return code is: 401
at org.apache.maven.artifact.deployer.DefaultArtifactDeployer.deploy(DefaultArtifactDeployer.java:94)
at org.apache.maven.plugin.deploy.DeployMojo.execute(DeployMojo.java:152)
... 18 more
Caused by: org.apache.maven.wagon.TransferFailedException: Failed to transfer file: http://localhost:8081/content/repositories/maven.snapshots/org/apache/maven/mercury/mercury-pom/1-alpha-1-SNAPSHOT/mercury-pom-1-alpha-1-20081002.000035-2.pom. Return code is: 401
at org.apache.maven.wagon.providers.http.LightweightHttpWagon.put(LightweightHttpWagon.java:172)
at org.apache.maven.artifact.manager.DefaultWagonManager.putRemoteFile(DefaultWagonManager.java:244)
at org.apache.maven.artifact.manager.DefaultWagonManager.putArtifact(DefaultWagonManager.java:160)
at org.apache.maven.artifact.deployer.DefaultArtifactDeployer.deploy(DefaultArtifactDeployer.java:80)
... 19 more
[INFO] ------------------------------------------------------------------------
[INFO] Total time: 7 seconds
[INFO] Finished at: Wed Oct 01 19:00:35 CDT 2008
[INFO] Final Memory: 22M/105M
[INFO] ------------------------------------------------------------------------