You are viewing a plain text version of this content. The canonical link for it is here.
Posted to dev@commons.apache.org by Stefan Bodewig <bo...@apache.org> on 2006/07/09 11:47:38 UTC

[GUMP@vmgump]: Project commons-net (in module jakarta-commons) failed

To whom it may engage...
        
This is an automated request, but not an unsolicited one. For 
more information please visit http://gump.apache.org/nagged.html, 
and/or contact the folk at general@gump.apache.org.

Project commons-net has an issue affecting its community integration.
This issue affects 8 projects.
The current state of this project is 'Failed', with reason 'Build Failed'.
For reference only, the following projects are affected by this:
    - apacheds-shared :  Apache Directory Server
    - asn1-codec :  Apache ASN.1 Tools
    - commons-net :  Commons Net
    - kerberos-common :  Apache Directory Project
    - kerberos-protocol :  Apache Kerberos Server
    - ldap-common :  Apache Directory Project
    - ldap-protocol :  Apache Directory Server
    - mina :  A Multipurpose Infrastrusture for Network Applications


Full details are available at:
    http://vmgump.apache.org/gump/public/jakarta-commons/commons-net/index.html

That said, some information snippets are provided here.

The following annotations (debug/informational/warning/error messages) were provided:
 -DEBUG- Sole output [commons-net-09072006.jar] identifier set to project name
 -INFO- Made directory [/usr/local/gump/public/workspace/jakarta-commons/net/target/classes]
 -INFO- Made directory [/usr/local/gump/public/workspace/jakarta-commons/net/target/test-classes]
 -INFO- Failed with reason build failed
 -INFO- Failed to extract fallback artifacts from Gump Repository



The following work was performed:
http://vmgump.apache.org/gump/public/jakarta-commons/commons-net/gump_work/build_jakarta-commons_commons-net.html
Work Name: build_jakarta-commons_commons-net (Type: Build)
Work ended in a state of : Failed
Elapsed: 10 secs
Command Line: java -Djava.awt.headless=true -Dant.build.clonevm=true -Xbootclasspath/p:/usr/local/gump/public/workspace/xml-xerces2/build/xercesImpl.jar:/usr/local/gump/public/workspace/xml-commons/java/external/build/xml-apis.jar org.apache.tools.ant.Main -Dgump.merge=/x1/gump/public/gump/work/merge.xml -Dbuild.sysclasspath=only -Dfinal.name=commons-net-09072006 dist 
[Working Directory: /usr/local/gump/public/workspace/jakarta-commons/net]
CLASSPATH: /opt/jdk1.5/lib/tools.jar:/usr/local/gump/public/workspace/jakarta-commons/net/target/classes:/usr/local/gump/public/workspace/jakarta-commons/net/target/test-classes:/usr/local/gump/public/workspace/ant/dist/lib/ant-jmf.jar:/usr/local/gump/public/workspace/ant/dist/lib/ant-swing.jar:/usr/local/gump/public/workspace/ant/dist/lib/ant-apache-resolver.jar:/usr/local/gump/public/workspace/ant/dist/lib/ant-trax.jar:/usr/local/gump/public/workspace/ant/dist/lib/ant-junit.jar:/usr/local/gump/public/workspace/ant/dist/lib/ant-launcher.jar:/usr/local/gump/public/workspace/ant/dist/lib/ant-nodeps.jar:/usr/local/gump/public/workspace/ant/dist/lib/ant.jar:/usr/local/gump/packages/junit3.8.1/junit.jar:/usr/local/gump/public/workspace/xml-commons/java/build/resolver.jar:/usr/local/gump/public/workspace/jakarta-oro/jakarta-oro-09072006.jar:/usr/local/gump/public/workspace/dist/junit/junit.jar
---------------------------------------------
    [junit] org.apache.tools.ant.taskdefs.optional.junit.JUnitTestRunner$1:testGetServerLanguageCode(org.apache.commons.net.ftp.FTPClientConfigTest)
    [junit] org.apache.tools.ant.taskdefs.optional.junit.JUnitTestRunner$1:testLookupDateFormatSymbols(org.apache.commons.net.ftp.FTPClientConfigTest)
    [junit] org.apache.tools.ant.taskdefs.optional.junit.JUnitTestRunner$1:testGetDateFormatSymbols(org.apache.commons.net.ftp.FTPClientConfigTest)
    [junit] ------------- ---------------- ---------------

    [junit] Testcase: testFTPClientConfigString took 0.015 sec
    [junit] Testcase: testFTPClientConfigStringStringStringStringStringString took 0.001 sec
    [junit] Testcase: testSetShortMonthNames took 0 sec
    [junit] Testcase: testGetServerLanguageCode took 0 sec
    [junit] Testcase: testLookupDateFormatSymbols took 0.017 sec
    [junit] Testcase: testGetDateFormatSymbols took 0.014 sec
    [junit] Exception in thread "main" java.io.FileNotFoundException: 1/gump/public/workspace/jakarta-commons/net/junitvmwatcher1839372820.properties (No such file or directory)
    [junit] 	at java.io.FileOutputStream.open(Native Method)
    [junit] 	at java.io.FileOutputStream.<init>(FileOutputStream.java:179)
    [junit] 	at java.io.FileOutputStream.<init>(FileOutputStream.java:70)
    [junit] 	at java.io.FileWriter.<init>(FileWriter.java:46)
    [junit] 	at org.apache.tools.ant.taskdefs.optional.junit.JUnitTestRunner.registerNonCrash(JUnitTestRunner.java:823)
    [junit] 	at org.apache.tools.ant.taskdefs.optional.junit.JUnitTestRunner.main(JUnitTestRunner.java:676)
    [junit] java.io.FileNotFoundException: /x1/gump/public/workspace/jakarta-commons/net/junitvmwatcher1839372820.properties (No such file or directory)
    [junit] 	at java.io.FileInputStream.open(Native Method)
    [junit] 	at java.io.FileInputStream.<init>(FileInputStream.java:106)
    [junit] 	at java.io.FileReader.<init>(FileReader.java:55)
    [junit] 	at org.apache.tools.ant.taskdefs.optional.junit.JUnitTask.executeAsForked(JUnitTask.java:996)
    [junit] 	at org.apache.tools.ant.taskdefs.optional.junit.JUnitTask.execute(JUnitTask.java:792)
    [junit] 	at org.apache.tools.ant.taskdefs.optional.junit.JUnitTask.executeOrQueue(JUnitTask.java:1593)
    [junit] 	at org.apache.tools.ant.taskdefs.optional.junit.JUnitTask.execute(JUnitTask.java:739)
    [junit] 	at org.apache.tools.ant.UnknownElement.execute(UnknownElement.java:275)
    [junit] 	at sun.reflect.NativeMethodAccessorImpl.invoke0(Native Method)
    [junit] 	at sun.reflect.NativeMethodAccessorImpl.invoke(NativeMethodAccessorImpl.java:39)
    [junit] 	at sun.reflect.DelegatingMethodAccessorImpl.invoke(DelegatingMethodAccessorImpl.java:25)
    [junit] 	at java.lang.reflect.Method.invoke(Method.java:585)
    [junit] 	at org.apache.tools.ant.dispatch.DispatchUtils.execute(DispatchUtils.java:104)
    [junit] 	at org.apache.tools.ant.Task.perform(Task.java:375)
    [junit] 	at org.apache.tools.ant.Target.execute(Target.java:356)
    [junit] 	at org.apache.tools.ant.Target.performTasks(Target.java:384)
    [junit] 	at org.apache.tools.ant.Project.executeSortedTargets(Project.java:1268)
    [junit] 	at org.apache.tools.ant.Project.executeTarget(Project.java:1237)
    [junit] 	at org.apache.tools.ant.helper.DefaultExecutor.executeTargets(DefaultExecutor.java:40)
    [junit] 	at org.apache.tools.ant.Project.executeTargets(Project.java:1120)
    [junit] 	at org.apache.tools.ant.Main.runBuild(Main.java:686)
    [junit] 	at org.apache.tools.ant.Main.startAnt(Main.java:196)
    [junit] 	at org.apache.tools.ant.Main.start(Main.java:158)
    [junit] 	at org.apache.tools.ant.Main.main(Main.java:247)
    [junit] Running org.apache.commons.net.ftp.FTPClientConfigTest
    [junit] Tests run: 1, Failures: 0, Errors: 1, Time elapsed: 0 sec

BUILD FAILED
/x1/gump/public/workspace/jakarta-commons/net/build.xml:93: Test org.apache.commons.net.ftp.FTPClientConfigTest failed (crashed)

Total time: 10 seconds
---------------------------------------------

To subscribe to this information via syndicated feeds:
- RSS: http://vmgump.apache.org/gump/public/jakarta-commons/commons-net/rss.xml
- Atom: http://vmgump.apache.org/gump/public/jakarta-commons/commons-net/atom.xml

============================== Gump Tracking Only ===
Produced by Gump version 2.2.
Gump Run 37000009072006, vmgump.apache.org:vmgump-public:37000009072006
Gump E-mail Identifier (unique within run) #60.

--
Apache Gump
http://gump.apache.org/ [Instance: vmgump]

---------------------------------------------------------------------
To unsubscribe, e-mail: commons-dev-unsubscribe@jakarta.apache.org
For additional commands, e-mail: commons-dev-help@jakarta.apache.org